<?xml version="1.0" encoding="utf-8"?>
<!-- Generator: Adobe Illustrator 21.0.2, SVG Export Plug-In . SVG Version: 6.00 Build 0)  -->
<svg version="1.1" id="Layer_1" xmlns="http://www.w3.org/2000/svg" xmlns:xlink="http://www.w3.org/1999/xlink" x="0px" y="0px"
	 viewBox="0 0 300 100" style="enable-background:new 0 0 300 100;" xml:space="preserve">
<style type="text/css">
	.st0{fill:#1F3362;}
	.st1{fill:url(#XMLID_26_);}
	.st2{fill:url(#XMLID_27_);}
	.st3{fill:url(#XMLID_28_);}
	.st4{fill:#BFCBEB;}
	.st5{fill:#3E64C3;}
	.st6{fill:#3759AD;}
	.st7{fill:none;stroke:#3E64C3;stroke-width:0.9115;stroke-miterlimit:10;}
	.st8{fill:#D15B2D;}
	.st9{fill:url(#XMLID_29_);}
	.st10{fill:#7188C3;}
	.st11{fill:#1F3262;}
	.st12{fill:#8BA2DB;}
	.st13{fill:#2F4B92;}
	.st14{fill:none;stroke:#3E64C3;stroke-width:0.9115;stroke-linecap:round;stroke-linejoin:round;stroke-miterlimit:10;}
	.st15{fill:#D9E0F3;}
	.st16{fill:#94A8D9;}
	.st17{fill:#6583CF;}
</style>
<ellipse id="XMLID_24_" class="st0" cx="150.5" cy="52.9" rx="43.7" ry="39.5"/>
<g id="XMLID_233_">
	<linearGradient id="XMLID_26_" gradientUnits="userSpaceOnUse" x1="55.2269" y1="8.4323" x2="55.2269" y2="97.3438">
		<stop  offset="0" style="stop-color:#E1E5EF"/>
		<stop  offset="0.2371" style="stop-color:#D4DBE8"/>
		<stop  offset="0.4612" style="stop-color:#D0D7E6"/>
		<stop  offset="1" style="stop-color:#C6CDDB"/>
	</linearGradient>
	<path id="XMLID_237_" class="st1" d="M61.8,80.2H14.5L10,62.9L60.7,8.4H88v53.5h12.4v18.3H88v17.2H61.8V80.2z M61.8,62V36.7
		L38.5,62H61.8z"/>
	<linearGradient id="XMLID_27_" gradientUnits="userSpaceOnUse" x1="243.9431" y1="8.4323" x2="243.9431" y2="97.3438">
		<stop  offset="0" style="stop-color:#E1E5EF"/>
		<stop  offset="0.2371" style="stop-color:#D4DBE8"/>
		<stop  offset="0.4612" style="stop-color:#D0D7E6"/>
		<stop  offset="1" style="stop-color:#C6CDDB"/>
	</linearGradient>
	<path id="XMLID_234_" class="st2" d="M250.5,80.2h-47.3l-4.5-17.3l50.7-54.5h27.4v53.5h12.4v18.3h-12.4v17.2h-26.2V80.2z M250.5,62
		V36.7L227.2,62H250.5z"/>
</g>
<g id="XMLID_23_">
	<linearGradient id="XMLID_28_" gradientUnits="userSpaceOnUse" x1="150.5517" y1="34.5972" x2="150.5517" y2="95.3426">
		<stop  offset="0" style="stop-color:#FFFFFF"/>
		<stop  offset="9.853119e-02" style="stop-color:#F7F8FB"/>
		<stop  offset="0.4121" style="stop-color:#E1E6EF"/>
		<stop  offset="0.7167" style="stop-color:#D4DBE8"/>
		<stop  offset="1" style="stop-color:#D0D7E6"/>
	</linearGradient>
	<polygon id="XMLID_12_" class="st3" points="164.4,34.6 153.1,34.6 136.3,34.6 115.2,95.3 153.1,95.3 185.9,95.3 	"/>
	<ellipse id="XMLID_2_" class="st4" cx="150.6" cy="27.8" rx="22.3" ry="20.1"/>
	<path id="XMLID_8_" class="st5" d="M172.8,27.8c0,0-7.4,4.1-22.4,4.1c-15,0-22.2-4.1-22.2-4.1s-25.8,6.7-25.8,11.3
		c0,4.6,28.9,8.8,48,8.8s48.1-4.2,48.1-8.8C198.5,34.5,172.8,27.8,172.8,27.8z"/>
	<path id="XMLID_17_" class="st6" d="M127.1,28.1c0,0,2.5,12,18.8,12s27.6-11.3,27.6-11.3s-7.1,2-23.1,2S127.1,28.1,127.1,28.1z"/>
	<line id="XMLID_6_" class="st7" x1="149.7" y1="7.8" x2="149.7" y2="2.1"/>
	<ellipse id="XMLID_5_" class="st8" cx="149.9" cy="2.1" rx="2.4" ry="2.1"/>
	<linearGradient id="XMLID_29_" gradientUnits="userSpaceOnUse" x1="150.5517" y1="90.6062" x2="150.5517" y2="100">
		<stop  offset="0" style="stop-color:#FFFFFF"/>
		<stop  offset="0.5954" style="stop-color:#E6EAF2"/>
		<stop  offset="1" style="stop-color:#DBE0EC"/>
	</linearGradient>
	<ellipse id="XMLID_3_" class="st9" cx="150.6" cy="95.3" rx="35.4" ry="4.7"/>
	<g id="XMLID_58_">
		<path id="XMLID_4_" class="st5" d="M165.3,70.4l-13.9,9.4c-0.4,0.3-1,0.2-1.3-0.2l-11.7-14.1c-0.3-0.4-0.2-0.9,0.2-1.1l11.4-7.7
			l5.7,0.9l9.7,11.7C165.8,69.6,165.7,70.2,165.3,70.4z"/>
		<path id="XMLID_9_" class="st10" d="M150,56.7l5.7,0.9l-2.5,1.8c-0.3,0.2-0.8,0.2-1.1-0.1L150,56.7z"/>
		<g id="XMLID_10_">
			<path id="XMLID_7_" class="st4" d="M147.8,66.5c0.4,0.5,0.3,1.1-0.2,1.5c-0.5,0.3-1.2,0.3-1.6-0.2c-0.4-0.5-0.3-1.1,0.2-1.5
				C146.7,66,147.4,66,147.8,66.5z"/>
			<path id="XMLID_11_" class="st4" d="M154,62.2c0.4,0.5,0.3,1.1-0.2,1.5c-0.5,0.3-1.2,0.3-1.6-0.2s-0.3-1.1,0.2-1.5
				C152.9,61.7,153.7,61.8,154,62.2z"/>
		</g>
		<path id="XMLID_13_" class="st11" d="M153.9,67.8c0.9,1.1,1.2,2.3,0.6,2.7c-0.6,0.4-1.8-0.2-2.7-1.3c-0.9-1.1-1.2-2.3-0.6-2.7
			C151.8,66.1,153,66.7,153.9,67.8z"/>
	</g>
	<path id="XMLID_14_" class="st4" d="M176.2,62.6l-5.3,0.5c-0.3,0-0.4-0.3-0.2-0.4c1-0.6,2.4-1.8,3.4-3.9c1-2.2,0.8-3.5,0.7-3.9
		c0-0.1,0-0.2,0.1-0.3l4.8-2.4c0.2-0.1,0.3,0,0.4,0.2c0.1,0.8,0.3,2.8-0.7,5.3c-1.1,2.6-2.6,4.5-3,4.8
		C176.3,62.5,176.2,62.6,176.2,62.6z"/>
	<path id="XMLID_15_" class="st12" d="M116.5,80.4c-0.6,1.4-2.4,6.4,2.1,9.7c0.2,0.2,0.6,0.2,0.9,0.1l6.7-2.8
		c0.5-0.2,0.6-0.8,0.3-1.2c-1.1-1.3-2.9-4-2.2-6.7c0.2-0.6-0.4-1.1-1-0.9l-6.2,1.3C116.8,80,116.6,80.1,116.5,80.4z"/>
	<ellipse id="XMLID_61_" class="st13" cx="129.6" cy="37.9" rx="5.9" ry="5.3"/>
	<ellipse id="XMLID_60_" class="st13" cx="171.5" cy="37.9" rx="5.9" ry="5.3"/>
	<ellipse id="XMLID_18_" class="st4" cx="171.5" cy="37.9" rx="4.5" ry="4.1"/>
	<ellipse id="XMLID_59_" class="st13" cx="150.5" cy="40.1" rx="5.9" ry="5.3"/>
	<g id="XMLID_69_">
		<line id="XMLID_63_" class="st14" x1="150.7" y1="83.5" x2="150.7" y2="88.1"/>
		<g id="XMLID_68_">
			<line id="XMLID_64_" class="st14" x1="155.5" y1="81.8" x2="155.5" y2="84.4"/>
			<line id="XMLID_66_" class="st14" x1="155.5" y1="87" x2="155.5" y2="88.1"/>
		</g>
		<g id="XMLID_62_">
			<line id="XMLID_65_" class="st14" x1="145.9" y1="81.5" x2="145.9" y2="84.1"/>
			<line id="XMLID_67_" class="st14" x1="145.9" y1="85.8" x2="145.9" y2="87.3"/>
		</g>
	</g>
	<ellipse id="XMLID_70_" class="st15" cx="159.9" cy="16.1" rx="3.5" ry="3.1"/>
	<ellipse id="XMLID_72_" class="st15" cx="166.6" cy="22.1" rx="1.7" ry="1.5"/>
	<g id="XMLID_22_">
		<path id="XMLID_21_" class="st16" d="M149.7,22.5c-3.2,0-4.4,1.5-4.4,4.4s3.2,5,4.4,5s4.4-2.1,4.4-5S152.9,22.5,149.7,22.5z"/>
		<g id="XMLID_20_">
			<path id="XMLID_16_" class="st4" d="M150.5,27.8c0,0-0.1-1.2,0.8-1.7c0.9-0.5,2.1-0.2,2.1-0.2s0,1.5-0.9,1.9
				C151.3,28.2,150.5,27.8,150.5,27.8z"/>
			<path id="XMLID_19_" class="st4" d="M149,27.8c0,0,0.1-1.2-0.8-1.7c-0.9-0.5-2.1-0.2-2.1-0.2s0,1.5,0.9,1.9
				C148.2,28.2,149,27.8,149,27.8z"/>
		</g>
	</g>
	<g id="XMLID_71_">
		<path id="XMLID_74_" class="st17" d="M150.4,33.1c-15.2,0-22.6-4.1-22.9-4.3c-0.6-0.3-0.8-1.1-0.4-1.6c0.4-0.5,1.2-0.7,1.8-0.4
			c0.1,0,7.2,3.9,21.5,3.9c14.4,0,21.7-3.9,21.8-4c0.6-0.3,1.4-0.2,1.8,0.4c0.4,0.5,0.2,1.3-0.4,1.6C173.2,29,165.6,33.1,150.4,33.1
			z"/>
	</g>
	<path id="XMLID_82_" class="st15" d="M171.5,33.9c-0.2,0-0.4,0-0.7,0l-3.7,5.2c0.3,0.9,0.9,1.6,1.7,2.1l4.8-6.9
		C173.1,34.1,172.3,33.9,171.5,33.9z"/>
	<path id="XMLID_81_" class="st15" d="M174.7,35l-4.7,6.7c0.5,0.2,1,0.3,1.6,0.3c0.1,0,0.1,0,0.2,0l4-5.6
		C175.5,35.9,175.1,35.4,174.7,35z"/>
	<g id="XMLID_73_">
		<ellipse id="XMLID_84_" class="st4" cx="150.4" cy="40.1" rx="4.5" ry="4.1"/>
		<path id="XMLID_80_" class="st15" d="M150.4,36c-0.2,0-0.4,0-0.7,0l-3.7,5.2c0.3,0.9,0.9,1.6,1.7,2.1l4.8-6.9
			C152,36.2,151.2,36,150.4,36z"/>
		<path id="XMLID_75_" class="st15" d="M153.6,37.2l-4.7,6.7c0.5,0.2,1,0.3,1.6,0.3c0.1,0,0.1,0,0.2,0l4-5.6
			C154.4,38,154,37.6,153.6,37.2z"/>
	</g>
	<g id="XMLID_89_">
		<ellipse id="XMLID_93_" class="st4" cx="129.6" cy="37.9" rx="4.5" ry="4.1"/>
		<path id="XMLID_92_" class="st15" d="M129.6,33.9c-0.2,0-0.4,0-0.7,0l-3.7,5.2c0.3,0.9,0.9,1.6,1.7,2.1l4.8-6.9
			C131.1,34.1,130.4,33.9,129.6,33.9z"/>
		<path id="XMLID_90_" class="st15" d="M132.7,35l-4.7,6.7c0.5,0.2,1,0.3,1.6,0.3c0.1,0,0.1,0,0.2,0l4-5.6
			C133.5,35.9,133.2,35.4,132.7,35z"/>
	</g>
	<path id="XMLID_114_" class="st15" d="M150.6,7.7c-3.9,0-7.6,0.9-10.8,2.5c0.3-0.1,10.5-3.7,20.7,1.4c10.2,5.1,12.2,14.7,12.3,15.1
		C172.1,16.1,162.4,7.7,150.6,7.7z"/>
	<path id="XMLID_115_" class="st17" d="M198.5,39.2c0-4.1-20.1-9.8-24.7-11.1l0,0c0,0,20.2,6.9,20.7,10.4c0.5,3.5-10.3,6.3-10.3,6.3
		h0l7.4-1.6C195.8,41.9,198.5,40.6,198.5,39.2z"/>
	<path id="XMLID_1_" class="st17" d="M102.4,39.2c0-4.1,20.1-9.8,24.7-11.1l0,0c0,0-20.2,6.9-20.7,10.4c-0.5,3.5,10.3,6.3,10.3,6.3
		h0l-7.4-1.6C105.1,41.9,102.4,40.6,102.4,39.2z"/>
</g>
</svg>
