<svg xmlns="http://www.w3.org/2000/svg" width="97.57" height="97.57" viewBox="0 0 97.57 97.57">
  <path id="check-mark" d="M70.35,33.306a3.811,3.811,0,0,1,0,5.39L44.782,64.266a3.812,3.812,0,0,1-5.39,0L27.22,52.093A3.811,3.811,0,0,1,32.609,46.7l9.477,9.477L64.96,33.306a3.812,3.812,0,0,1,5.39,0Zm27.22,15.48A48.785,48.785,0,1,1,48.785,0,48.759,48.759,0,0,1,97.57,48.786Zm-7.623,0A41.162,41.162,0,1,0,48.785,89.948,41.14,41.14,0,0,0,89.948,48.786Zm0,0" transform="translate(0 0)" fill="#fff"/>
</svg>
