<svg xmlns="http://www.w3.org/2000/svg" xmlns:xlink="http://www.w3.org/1999/xlink" width="60" height="60" viewBox="0 0 60 60">
  <defs>
    <clipPath id="clip-path">
      <rect id="Rectangle_3361" data-name="Rectangle 3361" width="60" height="60" fill="#004ac9"/>
    </clipPath>
  </defs>
  <g id="phone" clip-path="url(#clip-path)">
    <g id="telephone" transform="translate(5.989 6)">
      <g id="Group_903" data-name="Group 903" transform="translate(0.011)">
        <path id="Path_1294" data-name="Path 1294" d="M47.271,35.779l-6.03-6.03a4.269,4.269,0,0,0-6.03,0L32.469,32.49a3.234,3.234,0,0,1-4.568,0L16.02,20.6a3.229,3.229,0,0,1,0-4.569l2.741-2.741a4.262,4.262,0,0,0,0-6.032l-6.029-6.01a4.268,4.268,0,0,0-6.026,0l-2.2,2.178a15.394,15.394,0,0,0,0,21.746L23.332,44a15.368,15.368,0,0,0,21.746,0l2.193-2.193a4.269,4.269,0,0,0,0-6.028ZM8.71,3.258a1.424,1.424,0,0,1,2.012,0l6.029,6.01a1.421,1.421,0,0,1,0,2.01l-1.005,1.005L7.71,4.249ZM25.343,41.993,6.517,23.157A12.5,12.5,0,0,1,5.733,6.292L13.745,14.3a6.067,6.067,0,0,0,.264,8.3L25.89,34.5h0a6.067,6.067,0,0,0,8.305.265l8.012,8.012a12.473,12.473,0,0,1-16.864-.784ZM45.261,39.8l-1.005,1-8.041-8.041,1-1a1.423,1.423,0,0,1,2.01,0l6.03,6.03a1.423,1.423,0,0,1,.006,2.016Z" transform="translate(-0.011)" fill="#004ac9"/>
      </g>
    </g>
  </g>
</svg>
