<svg id="files" xmlns="http://www.w3.org/2000/svg" width="54.343" height="65.21" viewBox="0 0 54.343 65.21">
  <g id="Group_2319" data-name="Group 2319" transform="translate(0 0)">
    <g id="Group_2318" data-name="Group 2318" transform="translate(0 0)">
      <path id="Path_27043" data-name="Path 27043" d="M95.288,12.912a.988.988,0,0,0-.493-.721L82.125-.479A.988.988,0,0,0,81.4-.972a.93.93,0,0,0-.285-.019H50.749a3.2,3.2,0,0,0-3.26,3.26V5.53h-3.26a3.2,3.2,0,0,0-3.26,3.26V60.956a3.2,3.2,0,0,0,3.26,3.26h41.3a3.2,3.2,0,0,0,3.26-3.26V57.7h3.26a3.2,3.2,0,0,0,3.26-3.26V13.2A.926.926,0,0,0,95.288,12.912Zm-3.676-.861h-8.26a1.027,1.027,0,0,1-1.087-1.087V2.7Zm-5,48.905a1.027,1.027,0,0,1-1.087,1.087h-41.3a1.027,1.027,0,0,1-1.087-1.087V8.79A1.089,1.089,0,0,1,44.228,7.7h3.26V54.435a3.2,3.2,0,0,0,3.26,3.26H86.613v3.26Zm6.521-6.521a1.027,1.027,0,0,1-1.087,1.087h-41.3a1.027,1.027,0,0,1-1.087-1.087V2.27a1.089,1.089,0,0,1,1.087-1.087H80.092v9.781a3.2,3.2,0,0,0,3.26,3.26h9.781Z" transform="translate(-40.968 0.994)" fill="#fff"/>
      <path id="Path_27044" data-name="Path 27044" d="M151.169,101.929h19.562a1.087,1.087,0,0,0,0-2.173H151.169a1.087,1.087,0,1,0,0,2.173Z" transform="translate(-135.954 -86.711)" fill="#fff"/>
      <path id="Path_27045" data-name="Path 27045" d="M150.082,151.2a1.027,1.027,0,0,0,1.087,1.087h32.6a1.087,1.087,0,0,0,0-2.173h-32.6A1.027,1.027,0,0,0,150.082,151.2Z" transform="translate(-135.954 -130.55)" fill="#fff"/>
      <path id="Path_27046" data-name="Path 27046" d="M183.772,200.477h-32.6a1.087,1.087,0,1,0,0,2.173h32.6a1.087,1.087,0,0,0,0-2.173Z" transform="translate(-135.954 -174.391)" fill="#fff"/>
      <path id="Path_27047" data-name="Path 27047" d="M183.772,250.837h-32.6a1.087,1.087,0,1,0,0,2.173h32.6a1.087,1.087,0,0,0,0-2.173Z" transform="translate(-135.954 -218.23)" fill="#fff"/>
      <path id="Path_27048" data-name="Path 27048" d="M183.772,301.2h-32.6a1.087,1.087,0,1,0,0,2.173h32.6a1.087,1.087,0,0,0,0-2.173Z" transform="translate(-135.954 -262.07)" fill="#fff"/>
      <path id="Path_27049" data-name="Path 27049" d="M183.772,351.559h-32.6a1.087,1.087,0,0,0,0,2.173h32.6a1.087,1.087,0,0,0,0-2.173Z" transform="translate(-135.954 -305.91)" fill="#fff"/>
    </g>
  </g>
</svg>
