<svg xmlns="http://www.w3.org/2000/svg" width="29.93" height="29.929" viewBox="0 0 29.93 29.929">
  <g id="logout" transform="translate(0 -0.008)">
    <path id="Path_27066" data-name="Path 27066" d="M290.114,209.879H278.267a.935.935,0,0,1,0-1.871h11.847a.935.935,0,0,1,0,1.871Zm0,0" transform="translate(-261.121 -195.841)" fill="#fff"/>
    <path id="Path_27067" data-name="Path 27067" d="M400.939,139.2a.936.936,0,0,1-.661-1.6l4.016-4.015-4.016-4.016a.936.936,0,0,1,1.323-1.323l4.676,4.676a.935.935,0,0,1,0,1.323L401.6,138.92A.929.929,0,0,1,400.939,139.2Zm0,0" transform="translate(-376.622 -120.482)" fill="#fff"/>
    <path id="Path_27068" data-name="Path 27068" d="M9.976,29.937a2.57,2.57,0,0,1-.773-.116l-7.5-2.5A2.517,2.517,0,0,1,0,24.949V2.5A2.5,2.5,0,0,1,2.494.008a2.572,2.572,0,0,1,.773.116l7.5,2.5A2.517,2.517,0,0,1,12.47,5V27.443a2.5,2.5,0,0,1-2.494,2.494ZM2.494,1.879A.625.625,0,0,0,1.87,2.5V24.949a.648.648,0,0,0,.433.6l7.47,2.489a.677.677,0,0,0,.2.027.625.625,0,0,0,.623-.624V5a.648.648,0,0,0-.433-.6L2.7,1.906a.677.677,0,0,0-.2-.027Zm0,0" transform="translate(0 0)" fill="#fff"/>
    <path id="Path_27069" data-name="Path 27069" d="M44.126,9.984a.936.936,0,0,1-.935-.935V3.437a1.561,1.561,0,0,0-1.559-1.559H27.6a.935.935,0,1,1,0-1.871H41.632a3.432,3.432,0,0,1,3.429,3.429V9.049A.936.936,0,0,1,44.126,9.984Zm0,0" transform="translate(-25.109 0)" fill="#fff"/>
    <path id="Path_27070" data-name="Path 27070" d="M187.256,287.316h-4.988a.935.935,0,0,1,0-1.871h4.988a1.561,1.561,0,0,0,1.559-1.559v-5.612a.935.935,0,0,1,1.871,0v5.612A3.432,3.432,0,0,1,187.256,287.316Zm0,0" transform="translate(-170.733 -261.12)" fill="#fff"/>
  </g>
</svg>
