<svg id="close" xmlns="http://www.w3.org/2000/svg" width="24.112" height="24.112" viewBox="0 0 24.112 24.112">
  <path id="Path_27062" data-name="Path 27062" d="M29.56,19.247a.831.831,0,0,0-1.177,0L24.4,23.234l-3.987-3.987a.832.832,0,0,0-1.177,1.177l3.987,3.983-3.987,3.987a.832.832,0,0,0,1.177,1.177L24.4,25.583l3.987,3.987a.832.832,0,0,0,1.177-1.177l-3.987-3.987,3.987-3.987A.831.831,0,0,0,29.56,19.247Z" transform="translate(-12.345 -12.35)" fill="red"/>
  <path id="Path_27063" data-name="Path 27063" d="M15.056,3A12.056,12.056,0,1,0,27.112,15.056,12.056,12.056,0,0,0,15.056,3Zm0,22.449A10.393,10.393,0,1,1,25.45,15.056,10.393,10.393,0,0,1,15.056,25.449Z" transform="translate(-3 -3)" fill="red"/>
</svg>
