<svg xmlns="http://www.w3.org/2000/svg" width="32.157" height="32.157" viewBox="0 0 32.157 32.157">
  <path id="user2" d="M27.447,4.709A16.078,16.078,0,0,0,4.709,27.447,16.078,16.078,0,0,0,27.447,4.709ZM6.978,26.962a9.2,9.2,0,0,1,9.1-8.1,9.164,9.164,0,0,1,9.1,8.095,14.164,14.164,0,0,1-18.2,0Zm9.1-10.036a4.883,4.883,0,1,1,4.883-4.883A4.889,4.889,0,0,1,16.078,16.927ZM26.8,25.369a11.076,11.076,0,0,0-6.933-7.721,6.768,6.768,0,1,0-7.575,0,11.066,11.066,0,0,0-6.937,7.718,14.194,14.194,0,1,1,21.445,0Zm0,0" transform="translate(0.001)" fill="#004ac9"/>
</svg>
