<svg xmlns="http://www.w3.org/2000/svg" xmlns:xlink="http://www.w3.org/1999/xlink" width="25" height="25" viewBox="0 0 25 25">
  <defs>
    <clipPath id="clip-arrows-left">
      <rect width="25" height="25"/>
    </clipPath>
  </defs>
  <g id="arrows-left" clip-path="url(#clip-arrows-left)">
    <path id="next2" d="M1.293,11.293l7-7A1,1,0,1,1,9.707,5.707L4.414,11H22a1,1,0,0,1,0,2H4.414l5.293,5.293a1,1,0,1,1-1.414,1.414l-7-7a1,1,0,0,1,0-1.414Z" transform="translate(1 1)" fill="#004ac9"/>
  </g>
</svg>
