<svg width="60" height="60" viewBox="0 0 60 60" fill="none" xmlns="http://www.w3.org/2000/svg">
<path d="M4 30C4 35.1423 5.52487 40.1691 8.38179 44.4448C11.2387 48.7205 15.2993 52.053 20.0502 54.0209C24.8011 55.9887 30.0288 56.5036 35.0723 55.5004C40.1158 54.4972 44.7486 52.0209 48.3848 48.3848C52.0209 44.7486 54.4972 40.1158 55.5004 35.0723C56.5036 30.0288 55.9887 24.8011 54.0209 20.0502C52.053 15.2993 48.7205 11.2387 44.4448 8.38179C40.1691 5.52487 35.1423 4 30 4C23.1044 4 16.4912 6.73928 11.6152 11.6152C6.73928 16.4912 4 23.1044 4 30Z" fill="url(#paint0_linear_447_2362)"/>
<path d="M30.2332 20.8273C30.0465 20.8316 29.861 20.8578 29.6804 20.9053V16.9648H18.7876C18.4662 16.9648 18.1579 17.0925 17.9306 17.3198C17.7034 17.5471 17.5757 17.8553 17.5757 18.1767V29.0696H21.509C21.4578 28.8898 21.4316 28.7037 21.4311 28.5168C21.4315 28.2249 21.4899 27.9361 21.6029 27.667C21.7158 27.3979 21.8811 27.1539 22.0891 26.9492C22.2971 26.7445 22.5437 26.5831 22.8146 26.4744C23.0855 26.3658 23.3752 26.312 23.667 26.3162C24.2206 26.3492 24.7394 26.5972 25.1128 27.0072C25.9101 27.84 25.9101 28.4813 25.7648 29.0625H29.6946V25.1398C29.8746 25.1896 30.0606 25.2146 30.2474 25.2142C30.5365 25.2147 30.8229 25.1581 31.09 25.0477C31.3572 24.9372 31.6 24.7752 31.8044 24.5707C32.0089 24.3663 32.1709 24.1235 32.2814 23.8563C32.3918 23.5891 32.4484 23.3028 32.4479 23.0137C32.4386 22.4318 32.2014 21.8768 31.7873 21.468C31.3732 21.0591 30.8152 20.8291 30.2332 20.8273Z" fill="#FFDC83"/>
<path d="M30.2332 20.8273C30.0465 20.8316 29.861 20.8578 29.6804 20.9053V16.9648H18.7876C18.4662 16.9648 18.1579 17.0925 17.9306 17.3198C17.7034 17.5471 17.5757 17.8553 17.5757 18.1767V29.0696H21.509C21.4578 28.8898 21.4316 28.7037 21.4311 28.5168C21.4315 28.2249 21.4899 27.9361 21.6029 27.667C21.7158 27.3979 21.8811 27.1539 22.0891 26.9492C22.2971 26.7445 22.5437 26.5831 22.8146 26.4744C23.0855 26.3658 23.3752 26.312 23.667 26.3162C24.2206 26.3492 24.7394 26.5972 25.1128 27.0072C25.9101 27.84 25.9101 28.4813 25.7648 29.0625H29.6946V25.1398C29.8746 25.1896 30.0606 25.2146 30.2474 25.2142C30.5365 25.2147 30.8229 25.1581 31.09 25.0477C31.3572 24.9372 31.6 24.7752 31.8044 24.5707C32.0089 24.3663 32.1709 24.1235 32.2814 23.8563C32.3918 23.5891 32.4484 23.3028 32.4479 23.0137C32.4386 22.4318 32.2014 21.8768 31.7873 21.468C31.3732 21.0591 30.8152 20.8291 30.2332 20.8273Z" fill="#F25022"/>
<path d="M41.7854 18.0808C41.7859 17.9362 41.7578 17.793 41.7028 17.6593C41.6478 17.5257 41.567 17.4041 41.4649 17.3018C41.3629 17.1994 41.2416 17.1181 41.1081 17.0627C40.9746 17.0073 40.8315 16.9788 40.6869 16.9788H29.6807V20.9121C29.8605 20.8612 30.0465 20.8349 30.2335 20.8341C30.8171 20.8341 31.3768 21.066 31.7895 21.4787C32.2022 21.8913 32.434 22.4511 32.434 23.0347C32.434 23.6183 32.2022 24.178 31.7895 24.5907C31.3768 25.0034 30.8171 25.2352 30.2335 25.2352C30.0471 25.2303 29.8617 25.2054 29.6807 25.1608V29.0906H33.614C33.5631 29.2705 33.5368 29.4564 33.536 29.6434C33.536 30.227 33.7679 30.7867 34.1806 31.1994C34.5932 31.6121 35.153 31.8439 35.7366 31.8439C36.3202 31.8439 36.8799 31.6121 37.2926 31.1994C37.7053 30.7867 37.9371 30.227 37.9371 29.6434C37.934 29.4568 37.909 29.2713 37.8627 29.0906H41.7925V18.0808H41.7854Z" fill="#7FBA00"/>
<path d="M29.1205 32.9319C29.3072 32.9359 29.4928 32.9621 29.6733 33.0098V29.0765H25.7577C25.8385 28.7736 25.8537 28.457 25.8023 28.1478C25.7508 27.8386 25.6339 27.544 25.4593 27.2836C25.2847 27.0233 25.0565 26.8032 24.79 26.6382C24.5235 26.4732 24.2248 26.367 23.914 26.3268C23.6031 26.2866 23.2872 26.3132 22.9875 26.405C22.6878 26.4967 22.4111 26.6514 22.176 26.8588C21.9409 27.0661 21.7529 27.3213 21.6244 27.6072C21.4959 27.8931 21.43 28.2032 21.4311 28.5166C21.4351 28.7033 21.4613 28.8889 21.509 29.0694H17.5757V40.0757C17.5757 40.2202 17.6042 40.3633 17.6596 40.4969C17.7151 40.6304 17.7963 40.7516 17.8987 40.8537C18.0011 40.9557 18.1226 41.0366 18.2563 41.0916C18.3899 41.1466 18.5332 41.1746 18.6777 41.1742H29.6804V37.2515C29.5004 37.3014 29.3144 37.3265 29.1276 37.3259C28.5449 37.3259 27.9861 37.0944 27.5741 36.6824C27.1621 36.2704 26.9306 35.7116 26.9306 35.1289C26.9306 34.5462 27.1621 33.9874 27.5741 33.5754C27.9861 33.1633 28.5449 32.9319 29.1276 32.9319H29.1205Z" fill="#00A4EF"/>
<path d="M40.2756 31.5002C40.3268 31.6801 40.353 31.8661 40.3535 32.053C40.3535 32.6367 40.1217 33.1964 39.709 33.6091C39.2963 34.0217 38.7366 34.2536 38.153 34.2536C37.5694 34.2536 37.0097 34.0217 36.597 33.6091C36.1843 33.1964 35.9525 32.6367 35.9525 32.053C35.9554 31.8665 35.9803 31.6809 36.0269 31.5002H32.0971V35.43C31.917 35.3803 31.7311 35.3552 31.5443 35.3556C30.9607 35.3556 30.401 35.5875 29.9883 36.0001C29.5756 36.4128 29.3438 36.9725 29.3438 37.5562C29.3438 38.1398 29.5756 38.6995 29.9883 39.1122C30.401 39.5249 30.9607 39.7567 31.5443 39.7567C31.731 39.7524 31.9165 39.7262 32.0971 39.6787V43.6121H43.0821C43.2268 43.6121 43.3701 43.5836 43.5038 43.5282C43.6375 43.4728 43.759 43.3916 43.8613 43.2893C43.9637 43.187 44.0448 43.0655 44.1002 42.9318C44.1556 42.7981 44.1841 42.6547 44.1841 42.51V31.5073H40.2756V31.5002Z" fill="#FFB900"/>
<defs>
<linearGradient id="paint0_linear_447_2362" x1="30" y1="4" x2="30" y2="56" gradientUnits="userSpaceOnUse">
<stop stop-color="#4A4A4A"/>
<stop offset="1" stop-color="#2F2F2F"/>
</linearGradient>
</defs>
</svg>
