<svg width="60" height="60" viewBox="0 0 60 60" fill="none" xmlns="http://www.w3.org/2000/svg">
<path d="M39.4655 25.4916H20.5345C19.1487 25.5002 17.7751 25.2315 16.4932 24.7012C15.2112 24.171 14.0466 23.3896 13.0667 22.4025C12.0868 21.4154 11.3112 20.2421 10.7848 18.9508C10.2584 17.6594 9.9917 16.2756 10.0002 14.8797V14.6121C9.99213 13.2163 10.2591 11.8327 10.7856 10.5415C11.3122 9.25034 12.0878 8.07725 13.0676 7.09022C14.0474 6.10319 15.2119 5.32183 16.4937 4.79141C17.7754 4.26099 19.1489 3.99205 20.5345 4.00018H39.4655C40.8511 3.99205 42.2246 4.26099 43.5063 4.79141C44.7881 5.32183 45.9526 6.10319 46.9324 7.09022C47.9122 8.07725 48.6878 9.25034 49.2144 10.5415C49.7409 11.8327 50.0079 13.2163 49.9998 14.6121V14.8797C50.0083 16.2756 49.7416 17.6594 49.2152 18.9508C48.6888 20.2421 47.9132 21.4154 46.9333 22.4025C45.9534 23.3896 44.7888 24.171 43.5068 24.7012C42.2249 25.2315 40.8513 25.5002 39.4655 25.4916Z" fill="url(#paint0_linear_447_3305)"/>
<path d="M31.6001 14.7475C31.6001 16.2088 32.0302 17.6373 32.8362 18.8523C33.6421 20.0673 34.7875 21.0143 36.1277 21.5735C37.4679 22.1327 38.9426 22.279 40.3653 21.9939C41.788 21.7088 43.0949 21.0052 44.1206 19.9719C45.1463 18.9386 45.8448 17.6221 46.1278 16.1889C46.4108 14.7557 46.2656 13.2701 45.7105 11.9201C45.1553 10.57 44.2153 9.41614 43.0092 8.6043C41.803 7.79245 40.385 7.35913 38.9344 7.35913C36.9892 7.35913 35.1237 8.13755 33.7483 9.52314C32.3728 10.9087 31.6001 12.788 31.6001 14.7475Z" fill="url(#paint1_linear_447_3305)"/>
<path d="M39.4655 55.9999H20.5345C19.1489 56.008 17.7754 55.7391 16.4937 55.2087C15.2119 54.6783 14.0474 53.8969 13.0676 52.9099C12.0878 51.9228 11.3122 50.7498 10.7856 49.4586C10.2591 48.1674 9.99213 46.7838 10.0002 45.388V45.1204C9.9917 43.7245 10.2584 42.3407 10.7848 41.0493C11.3112 39.758 12.0868 38.5847 13.0667 37.5976C14.0466 36.6105 15.2112 35.8291 16.4932 35.2989C17.7751 34.7686 19.1487 34.4999 20.5345 34.5085H39.4655C40.8513 34.4999 42.2249 34.7686 43.5068 35.2989C44.7888 35.8291 45.9534 36.6105 46.9333 37.5976C47.9132 38.5847 48.6889 39.758 49.2152 41.0493C49.7416 42.3407 50.0083 43.7245 49.9998 45.1204V45.388C50.0079 46.7838 49.7409 48.1674 49.2144 49.4586C48.6878 50.7498 47.9122 51.9228 46.9324 52.9099C45.9526 53.8969 44.7881 54.6783 43.5063 55.2087C42.2246 55.7391 40.8511 56.008 39.4655 55.9999Z" fill="url(#paint2_linear_447_3305)"/>
<path d="M13.7344 45.2526C13.7337 46.7141 14.1634 48.1431 14.9691 49.3586C15.7748 50.5741 16.9202 51.5216 18.2605 52.0812C19.6008 52.6408 21.0758 52.7874 22.4988 52.5024C23.9218 52.2174 25.2289 51.5137 26.2549 50.4802C27.2808 49.4467 27.9794 48.1299 28.2623 46.6964C28.5452 45.2629 28.3996 43.7771 27.8441 42.4269C27.2886 41.0767 26.3481 39.9229 25.1414 39.1113C23.9348 38.2997 22.5164 37.8668 21.0655 37.8674C19.1214 37.8683 17.2572 38.6466 15.8826 40.0314C14.5079 41.4162 13.7352 43.2942 13.7344 45.2526Z" fill="url(#paint3_linear_447_3305)"/>
<defs>
<linearGradient id="paint0_linear_447_3305" x1="11.8182" y1="14.9895" x2="50" y2="14.9895" gradientUnits="userSpaceOnUse">
<stop stop-color="#2ACCFF"/>
<stop offset="1" stop-color="#2953FF"/>
</linearGradient>
<linearGradient id="paint1_linear_447_3305" x1="34.8488" y1="8.88426" x2="43.408" y2="19.2015" gradientUnits="userSpaceOnUse">
<stop stop-color="#D4DCFF"/>
<stop offset="1" stop-color="#93A8FF"/>
</linearGradient>
<linearGradient id="paint2_linear_447_3305" x1="10" y1="45.6191" x2="50" y2="45.6191" gradientUnits="userSpaceOnUse">
<stop stop-color="#FCCA1E"/>
<stop offset="1" stop-color="#FD7C1F"/>
</linearGradient>
<linearGradient id="paint3_linear_447_3305" x1="17.2725" y1="39.5137" x2="24.6194" y2="50.4534" gradientUnits="userSpaceOnUse">
<stop stop-color="#FF6373"/>
<stop offset="1" stop-color="#FF273A"/>
</linearGradient>
</defs>
</svg>
