<svg width="60" height="60" viewBox="0 0 60 60" fill="none" xmlns="http://www.w3.org/2000/svg">
<path d="M11.6156 48.3851C15.2518 52.0212 19.8845 54.4974 24.928 55.5005C29.9715 56.5036 35.1992 55.9887 39.95 54.0208C44.7008 52.0529 48.7614 48.7204 51.6183 44.4447C54.4752 40.1691 56 35.1423 56 30C56 24.8577 54.4752 19.8309 51.6183 15.5553C48.7614 11.2796 44.7008 7.94714 39.95 5.97924C35.1992 4.01133 29.9715 3.49639 24.928 4.49952C19.8845 5.50266 15.2518 7.97883 11.6156 11.6149C9.20114 14.0292 7.28591 16.8955 5.97922 20.05C4.67254 23.2046 4 26.5856 4 30C4 33.4145 4.67254 36.7955 5.97922 39.95C7.28591 43.1045 9.20114 45.9708 11.6156 48.3851V48.3851Z" fill="url(#paint0_linear_447_4556)"/>
<path d="M44.4578 41.1349L40.4326 37.1096C40.2498 36.9264 40.1355 36.6859 40.1088 36.4285C40.0821 36.1711 40.1447 35.9123 40.286 35.6955C42.1788 32.961 43.0016 29.6267 42.5982 26.3256C42.1949 23.0245 40.5935 19.9864 38.0981 17.788C35.6026 15.5897 32.3868 14.3842 29.0612 14.4003C25.7356 14.4164 22.5317 15.6531 20.0577 17.8755C17.5837 20.098 16.0118 23.1515 15.6405 26.4563C15.2692 29.7612 16.1244 33.0873 18.0435 35.8033C19.9627 38.5193 22.8124 40.4361 26.0515 41.1898C29.2906 41.9434 32.6937 41.4815 35.6147 39.8917C35.8285 39.7678 36.077 39.7174 36.3222 39.7483C36.5673 39.7792 36.7955 39.8897 36.9719 40.0627L41.2686 44.3703C41.6952 44.7859 42.2679 45.0174 42.8635 45.0149C43.4591 45.0124 44.0299 44.7762 44.453 44.357C44.8761 43.9378 45.1176 43.3692 45.1257 42.7737C45.1337 42.1781 44.9075 41.6033 44.4958 41.1729L44.4578 41.1349ZM20.233 27.9598C20.2324 26.1699 20.7627 24.42 21.7567 22.9315C22.7508 21.443 24.1639 20.2827 25.8174 19.5973C27.4709 18.912 29.2905 18.7324 31.0461 19.0812C32.8017 19.4301 34.4144 20.2918 35.6803 21.5572C36.9461 22.8227 37.8083 24.4351 38.1576 26.1906C38.507 27.9461 38.328 29.7658 37.6431 31.4195C36.9583 33.0732 35.7984 34.4867 34.3102 35.4812C32.822 36.4756 31.0723 37.0064 29.2824 37.0064C26.8828 37.0064 24.5814 36.0534 22.8844 34.3569C21.1874 32.6604 20.2337 30.3594 20.233 27.9598Z" fill="url(#paint1_linear_447_4556)"/>
<defs>
<linearGradient id="paint0_linear_447_4556" x1="12.0889" y1="15.5556" x2="52.5334" y2="49.6445" gradientUnits="userSpaceOnUse">
<stop offset="0.0692589" stop-color="#2264FC"/>
<stop offset="1" stop-color="#1653DF"/>
</linearGradient>
<linearGradient id="paint1_linear_447_4556" x1="22.2996" y1="20.4673" x2="43.6773" y2="43.5784" gradientUnits="userSpaceOnUse">
<stop stop-color="#F5FFFF"/>
<stop offset="1" stop-color="#F6F5FF" stop-opacity="0.6"/>
</linearGradient>
</defs>
</svg>
