<svg width="60" height="60" viewBox="0 0 60 60" fill="none" xmlns="http://www.w3.org/2000/svg">
<g filter="url(#filter0_b_447_3161)">
<rect x="14.3201" y="13.2" width="32.48" height="31.36" rx="2.34675" fill="url(#paint0_linear_447_3161)"/>
<path d="M55.6676 45.1676H49.8324V16C49.8403 15.2319 49.6948 14.4699 49.4045 13.7588C49.1141 13.0476 48.6848 12.4015 48.1417 11.8583C47.5985 11.3152 46.9524 10.8859 46.2412 10.5955C45.5301 10.3052 44.7681 10.1597 44 10.1676H14.8324V4.3324C14.8324 2.9324 13.9 2 12.5 2C11.1 2 10.1676 2.9324 10.1676 4.3324V10.1676H4.3324C2.9324 10.1676 2 11.1 2 12.5C2 13.9 2.9324 14.8324 4.3324 14.8324H10.1676V44C10.1597 44.7681 10.3052 45.5301 10.5955 46.2412C10.8859 46.9524 11.3152 47.5985 11.8583 48.1417C12.4015 48.6848 13.0476 49.1141 13.7588 49.4045C14.4699 49.6948 15.2319 49.8403 16 49.8324H45.1676V55.6676C45.1676 57.0676 46.1 58 47.5 58C48.9 58 49.8324 57.0676 49.8324 55.6676V49.8324H55.6676C57.0676 49.8324 58 48.9 58 47.5C58 46.1 57.0676 45.1676 55.6676 45.1676ZM44 14.8324C44.1558 14.823 44.3118 14.8468 44.4577 14.9021C44.6036 14.9575 44.7361 15.0432 44.8465 15.1535C44.9568 15.2639 45.0425 15.3964 45.0979 15.5423C45.1532 15.6882 45.177 15.8442 45.1676 16V34.6676L37.2324 26.9676C37.0229 26.7447 36.77 26.567 36.4893 26.4456C36.2085 26.3242 35.9059 26.2615 35.6 26.2615C35.2941 26.2615 34.9915 26.3242 34.7107 26.4456C34.43 26.567 34.1771 26.7447 33.9676 26.9676L26.2676 34.9L23 31.6324C22.622 31.2102 22.0955 30.9504 21.5305 30.9071C20.9655 30.8638 20.4055 31.0404 19.9676 31.4L15.0676 35.3676V14.8324H44Z" fill="url(#paint1_linear_447_3161)"/>
<path d="M23.0003 28.3677C24.3411 28.3364 25.6165 27.7818 26.5537 26.8224C27.4909 25.863 28.0156 24.5751 28.0156 23.2339C28.0156 21.8927 27.4909 20.6048 26.5537 19.6454C25.6165 18.686 24.3411 18.1314 23.0003 18.1001C20.2003 18.1001 17.8679 20.2001 17.8679 23.0001C17.8679 25.8001 20.2003 28.3677 23.0003 28.3677Z" fill="#28A8EA"/>
</g>
<defs>
<filter id="filter0_b_447_3161" x="-3.4355" y="-3.4355" width="66.871" height="66.871" filterUnits="userSpaceOnUse" color-interpolation-filters="sRGB">
<feFlood flood-opacity="0" result="BackgroundImageFix"/>
<feGaussianBlur in="BackgroundImage" stdDeviation="2.71775"/>
<feComposite in2="SourceAlpha" operator="in" result="effect1_backgroundBlur_447_3161"/>
<feBlend mode="normal" in="SourceGraphic" in2="effect1_backgroundBlur_447_3161" result="shape"/>
</filter>
<linearGradient id="paint0_linear_447_3161" x1="7.60007" y1="6.47995" x2="46.8001" y2="49.04" gradientUnits="userSpaceOnUse">
<stop stop-color="#FFFFFD"/>
<stop offset="1" stop-color="#79CFFF"/>
</linearGradient>
<linearGradient id="paint1_linear_447_3161" x1="30" y1="2" x2="30" y2="58" gradientUnits="userSpaceOnUse">
<stop stop-color="#50D9FF"/>
<stop offset="1" stop-color="#0358A7"/>
</linearGradient>
</defs>
</svg>
