<svg width="60" height="60" viewBox="0 0 60 60" fill="none" xmlns="http://www.w3.org/2000/svg">
<path d="M48.847 50.2886H11.4721C10.3709 50.2878 9.31495 49.7939 8.53626 48.9155C7.75756 48.0371 7.31978 46.8459 7.31909 45.6035V19.8374C7.31875 19.2219 7.42592 18.6124 7.63447 18.0436C7.84303 17.4748 8.14889 16.958 8.53457 16.5227C8.92025 16.0873 9.37819 15.742 9.88223 15.5063C10.3863 15.2707 10.9265 15.1494 11.4721 15.1494H48.8496C49.395 15.1498 49.9349 15.2714 50.4387 15.5072C50.9424 15.743 51.4 16.0884 51.7854 16.5237C52.1708 16.959 52.4765 17.4757 52.6849 18.0443C52.8933 18.6128 53.0003 19.2221 53 19.8374V45.6035C53 46.2188 52.8926 46.828 52.6839 47.3964C52.4752 47.9648 52.1692 48.4813 51.7836 48.9164C51.398 49.3514 50.9401 49.6965 50.4363 49.9319C49.9324 50.1674 49.3923 50.2886 48.847 50.2886Z" fill="#2B7CD3"/>
<path d="M15.6229 9H44.6942C45.7959 9.00069 46.8522 9.43882 47.631 10.2181C48.4098 10.9973 48.8472 12.054 48.8472 13.1557H11.4724C11.4721 12.6103 11.5792 12.0702 11.7875 11.5662C11.9959 11.0622 12.3016 10.6041 12.687 10.2182C13.0724 9.83236 13.53 9.52616 14.0337 9.31713C14.5375 9.1081 15.0775 9.00034 15.6229 9Z" fill="#185ABD"/>
<g filter="url(#filter0_b_447_4702)">
<path d="M25.1744 21.0421C25.3908 21.0382 25.6058 21.0781 25.8065 21.1593C26.0071 21.2405 26.1893 21.3615 26.3421 21.5148C26.5005 21.6617 26.6263 21.8403 26.7114 22.0388C26.7965 22.2374 26.839 22.4516 26.8362 22.6677V29.2357C26.8331 29.6716 26.6587 30.0887 26.3504 30.3969C26.0422 30.7051 25.6251 30.8796 25.1892 30.8826H18.6097C18.3936 30.8856 18.1794 30.8431 17.9808 30.758C17.7822 30.6729 17.6037 30.547 17.4568 30.3886C17.3039 30.2354 17.1833 30.0532 17.1021 29.8526C17.0209 29.6521 16.9808 29.4372 16.9841 29.2209V22.6693C16.9824 22.4551 17.0233 22.2428 17.1044 22.0445C17.1856 21.8463 17.3054 21.6663 17.4568 21.5148C17.6083 21.3634 17.7883 21.2436 17.9865 21.1624C18.1848 21.0813 18.3971 21.0404 18.6113 21.0421H25.1744ZM25.1744 35.9335C25.3909 35.9292 25.606 35.9689 25.8067 36.0501C26.0074 36.1314 26.1895 36.2525 26.3421 36.4062C26.5006 36.553 26.6264 36.7315 26.7115 36.9301C26.7966 37.1287 26.8391 37.343 26.8362 37.559V44.1468C26.8394 44.3629 26.7971 44.5773 26.712 44.7759C26.6268 44.9745 26.5008 45.153 26.3421 45.2997C26.189 45.4526 26.0067 45.5732 25.8061 45.6544C25.6056 45.7356 25.3907 45.7757 25.1744 45.7724H18.6097C18.3955 45.7741 18.1831 45.7332 17.9849 45.6521C17.7867 45.5709 17.6066 45.4511 17.4552 45.2997C17.3037 45.1482 17.1839 44.9682 17.1028 44.7699C17.0216 44.5717 16.9807 44.3594 16.9825 44.1452V37.5574C16.9807 37.3432 17.0216 37.1308 17.1028 36.9326C17.1839 36.7344 17.3037 36.5543 17.4552 36.4029C17.6066 36.2514 17.7867 36.1316 17.9849 36.0505C18.1831 35.9693 18.3955 35.9284 18.6097 35.9302L25.1744 35.9335ZM40.0921 35.9335C40.3063 35.9317 40.5187 35.9726 40.7169 36.0538C40.9151 36.1349 41.0952 36.2547 41.2466 36.4062C41.3981 36.5576 41.5179 36.7377 41.599 36.9359C41.6802 37.1341 41.7211 37.3465 41.7193 37.5607V44.1485C41.7211 44.3626 41.6802 44.575 41.599 44.7732C41.5179 44.9715 41.3981 45.1515 41.2466 45.303C41.0952 45.4544 40.9151 45.5742 40.7169 45.6554C40.5187 45.7365 40.3063 45.7774 40.0921 45.7757H33.5224C33.306 45.7793 33.0911 45.7393 32.8905 45.6581C32.6899 45.5769 32.5077 45.4561 32.3548 45.303C32.1965 45.1559 32.0708 44.9774 31.9857 44.7788C31.9006 44.5803 31.858 44.3661 31.8607 44.1501V37.5623C31.8577 37.3463 31.9002 37.132 31.9853 36.9334C32.0704 36.7348 32.1963 36.5563 32.3548 36.4095C32.5079 36.2566 32.6901 36.136 32.8907 36.0548C33.0913 35.9736 33.3061 35.9335 33.5224 35.9368L40.0921 35.9335ZM42.8129 24.924C42.98 25.0831 43.1126 25.2749 43.2027 25.4873C43.2928 25.6998 43.3384 25.9284 43.3366 26.1592C43.3401 26.3868 43.2952 26.6126 43.2049 26.8215C43.1147 27.0305 42.981 27.2179 42.8129 27.3714L37.9297 32.2546C37.772 32.42 37.5824 32.5517 37.3724 32.6417C37.1623 32.7316 36.9362 32.778 36.7076 32.778C36.4791 32.778 36.253 32.7316 36.0429 32.6417C35.8329 32.5517 35.6433 32.42 35.4856 32.2546L30.6024 27.3714C30.4418 27.214 30.3151 27.0254 30.2301 26.8172C30.1451 26.609 30.1037 26.3857 30.1083 26.1608C30.1033 25.7 30.281 25.2559 30.6024 24.9256L35.4889 20.0408C35.8152 19.7209 36.254 19.5417 36.7109 19.5417C37.1679 19.5417 37.6066 19.7209 37.933 20.0408L42.8129 24.924Z" fill="white" fill-opacity="0.8"/>
</g>
<defs>
<filter id="filter0_b_447_4702" x="11.9428" y="14.5021" width="36.4335" height="36.3134" filterUnits="userSpaceOnUse" color-interpolation-filters="sRGB">
<feFlood flood-opacity="0" result="BackgroundImageFix"/>
<feGaussianBlur in="BackgroundImage" stdDeviation="2.51982"/>
<feComposite in2="SourceAlpha" operator="in" result="effect1_backgroundBlur_447_4702"/>
<feBlend mode="normal" in="SourceGraphic" in2="effect1_backgroundBlur_447_4702" result="shape"/>
</filter>
</defs>
</svg>
