<svg width="60" height="60" viewBox="0 0 60 60" fill="none" xmlns="http://www.w3.org/2000/svg">
<path d="M46.8607 18.5903C46.8607 9.24767 39.2687 4 29.9303 4C20.592 4 13 9.24767 13 18.5903V39.074C13 48.4123 20.592 56 29.9303 56C39.2687 56 46.8607 48.4123 46.8607 39.0697V18.5903Z" fill="url(#paint0_linear_447_2471)"/>
<path opacity="0.51" d="M44.5643 21.1297C44.5643 17.2947 43.5763 12.398 39.854 9.122C38.2376 7.70067 36.2833 6.46134 34.5803 6.79934C31.859 7.341 32.665 10.344 33.7743 12.086C34.5716 13.3383 35.9583 14.751 36.1316 20.2933C36.1966 22.447 36.2053 24.4663 35.577 26.5247C33.9303 31.9197 29.4323 30.9317 28.7 31.3347C27.387 32.0583 27.1876 33.835 27.1833 35.3343C27.1703 38.918 27.0143 42.7963 27.3913 46.3583C27.6513 48.8153 29.116 52.0263 32.1016 51.905C34.485 51.8097 36.149 51.0037 38.0903 49.669C41.9946 46.991 44.3823 42.4757 44.3823 37.7437C44.3866 37.7393 44.5643 21.1383 44.5643 21.1297Z" fill="url(#paint1_linear_447_2471)" fill-opacity="0.3"/>
<path d="M31.0658 4.03004C30.6888 4.01271 30.2944 3.89571 29.7094 4.43737C29.1244 4.98337 28.9424 5.50771 28.8514 6.95504L28.7908 21.1857H31.0658V4.03004Z" fill="#B5B5B5"/>
<path d="M43.8279 23.0709C41.7262 21.8489 38.8445 20.7439 34.9619 20.2152C34.6918 20.1779 34.4444 20.0441 34.2652 19.8387C34.086 19.6332 33.9871 19.3698 33.9869 19.0972V17.1169C33.8655 13.6892 32.0975 12.2202 29.7662 12.2202C27.4349 12.2202 25.3982 13.1649 25.1989 17.5199L25.1729 19.0019C25.166 19.3278 25.0452 19.6411 24.8315 19.8872C24.6178 20.1334 24.3246 20.297 24.0029 20.3495C20.5839 20.9129 17.9925 21.9355 16.0599 23.0579C14.1619 24.1542 13.0049 26.1865 13.0049 28.3749V28.8949C13.3602 28.2535 15.9169 24.1889 23.7472 22.7069C24.4535 22.5725 25.0992 23.1315 25.0862 23.8465L25.0775 24.2495C25.3592 28.6435 27.4305 29.7615 29.7619 29.7615C32.0932 29.7615 34.0259 28.3229 33.9825 25.1379V23.5259C33.9825 22.9149 34.5285 22.4425 35.1309 22.5335C43.7455 23.8379 46.4669 28.1842 46.8569 28.8949V28.3749C46.8612 26.1952 45.7129 24.1672 43.8279 23.0709Z" fill="#B5B5B5"/>
<path d="M29.9309 28.5658C28.1715 28.5658 26.7632 27.0448 26.7632 25.1468V16.8355C26.7632 14.9375 28.1715 13.4165 29.9309 13.4165C31.6902 13.4165 33.0985 14.9375 33.0985 16.8355V25.1468C33.0985 27.0448 31.6902 28.5658 29.9309 28.5658Z" fill="#504F4F"/>
<path d="M32.1319 16.2721C32.6259 19.1581 32.4049 22.6421 32.2099 24.9778C32.0149 27.3134 30.8883 27.7771 30.2816 27.9114C29.4583 28.0934 28.5223 27.8204 28.1626 26.9408C28.1626 26.9408 29.0423 25.9484 29.1853 24.5531C29.4236 22.2261 29.5709 19.8644 29.2719 17.5461C29.1376 16.5148 29.1159 15.5788 28.1626 15.2798C28.1626 15.2798 28.3533 14.6168 29.1116 14.3264C31.4559 13.4164 32.0193 15.6178 32.1319 16.2721Z" fill="#757575" fill-opacity="0.5"/>
<path opacity="0.51" d="M24.6359 6.60439C26.7505 5.78105 27.3789 7.66172 27.3962 8.07339C27.4179 8.74939 27.9249 11.3017 26.7722 11.9734C24.0639 13.5464 24.6965 15.5874 23.2405 16.1897C21.4335 16.9351 20.5799 14.8767 20.6145 13.5291C20.7619 7.83939 23.6089 7.00739 24.6359 6.60439Z" fill="url(#paint2_linear_447_2471)" fill-opacity="0.3"/>
<defs>
<linearGradient id="paint0_linear_447_2471" x1="29.9303" y1="4" x2="29.9303" y2="56" gradientUnits="userSpaceOnUse">
<stop stop-color="#939393"/>
<stop offset="1" stop-color="#0D0D0D"/>
</linearGradient>
<linearGradient id="paint1_linear_447_2471" x1="35.8523" y1="6.74316" x2="35.8523" y2="51.9083" gradientUnits="userSpaceOnUse">
<stop stop-color="white"/>
<stop offset="1" stop-color="white" stop-opacity="0"/>
</linearGradient>
<linearGradient id="paint2_linear_447_2471" x1="24.0696" y1="6.39819" x2="24.0696" y2="16.3478" gradientUnits="userSpaceOnUse">
<stop stop-color="white"/>
<stop offset="1" stop-color="white" stop-opacity="0"/>
</linearGradient>
</defs>
</svg>
