<svg width="60" height="60" viewBox="0 0 60 60" fill="none" xmlns="http://www.w3.org/2000/svg">
<path d="M7 10.68C7 8.64759 8.64759 7 10.68 7H15.857H49.32C51.3524 7 53 8.64759 53 10.68V49.3198C53 51.3522 51.3524 52.9998 49.32 52.9998H10.68C8.64759 52.9998 7 51.3522 7 49.3198V12.9046V10.68Z" fill="url(#paint0_linear_447_2896)"/>
<rect x="14.3601" y="11.6001" width="30.36" height="34.04" rx="1.84" fill="#FFF7DD" fill-opacity="0.5"/>
<rect x="11.6001" y="15.28" width="35.88" height="36.7998" rx="1.84" fill="#FFFFFD"/>
<g filter="url(#filter0_b_447_2896)">
<path d="M7 24.4799C7 23.4637 7.8238 22.6399 8.84 22.6399H15.857H51.16C52.1762 22.6399 53 23.4637 53 24.4799V51.1599C53 52.1761 52.1762 52.9999 51.16 52.9999H8.84C7.8238 52.9999 7 52.1761 7 51.1599V28.4855V24.4799Z" fill="url(#paint1_linear_447_2896)" fill-opacity="0.85"/>
</g>
<path d="M37.845 28.1599H23.1597C22.2959 28.1599 21.72 28.741 21.72 29.6125V48.7873C21.72 49.5136 22.4398 50.2399 23.1597 50.2399H32.374C33.2378 50.2399 33.8137 49.6589 33.8137 48.7873V45.7368C33.8137 45.0104 34.5336 44.2841 35.2535 44.2841H37.701C38.5649 44.2841 39.1408 43.7031 39.1408 42.8315V29.4673C39.1408 28.8545 38.7519 28.1599 37.845 28.1599ZM33.0939 40.0715C33.0998 40.1684 33.0852 40.2655 33.0511 40.3563C33.017 40.4471 32.9642 40.5296 32.8961 40.5983C32.828 40.6669 32.7463 40.7202 32.6563 40.7546C32.5663 40.789 32.4701 40.8037 32.374 40.7978H25.8952C25.7991 40.8037 25.7029 40.789 25.6129 40.7546C25.5229 40.7202 25.4412 40.6669 25.3731 40.5983C25.305 40.5296 25.2522 40.4471 25.2181 40.3563C25.184 40.2655 25.1694 40.1684 25.1753 40.0715V39.9262C25.1694 39.8293 25.184 39.7322 25.2181 39.6414C25.2522 39.5506 25.305 39.4681 25.3731 39.3994C25.4412 39.3308 25.5229 39.2775 25.6129 39.2431C25.7029 39.2087 25.7991 39.194 25.8952 39.1999H32.374C32.8059 39.1999 33.0939 39.4904 33.0939 40.0715ZM36.2613 36.1494C36.2672 36.2463 36.2526 36.3434 36.2185 36.4342C36.1844 36.525 36.1316 36.6075 36.0635 36.6762C35.9955 36.7448 35.9137 36.7981 35.8237 36.8325C35.7337 36.8669 35.6375 36.8816 35.5414 36.8757H25.8952C25.4633 36.7304 25.0314 36.4399 25.0314 36.1494V36.0041C25.0255 35.9072 25.0401 35.8101 25.0741 35.7193C25.1082 35.6285 25.1611 35.546 25.2291 35.4773C25.2972 35.4087 25.3789 35.3554 25.4689 35.321C25.5589 35.2866 25.6552 35.2719 25.7512 35.2778H35.3974C35.9733 35.2778 36.2613 35.5683 36.2613 36.1494ZM36.2613 32.2273C36.2672 32.3242 36.2526 32.4213 36.2185 32.5121C36.1844 32.6029 36.1316 32.6854 36.0635 32.7541C35.9955 32.8227 35.9137 32.876 35.8237 32.9104C35.7337 32.9448 35.6375 32.9595 35.5414 32.9536H25.8952C25.7991 32.9595 25.7029 32.9448 25.6129 32.9104C25.5229 32.876 25.4412 32.8227 25.3731 32.7541C25.305 32.6854 25.2522 32.6029 25.2181 32.5121C25.184 32.4213 25.1694 32.3242 25.1753 32.2273V32.082C25.1694 31.9851 25.184 31.888 25.2181 31.7972C25.2522 31.7064 25.305 31.6239 25.3731 31.5552C25.4412 31.4866 25.5229 31.4333 25.6129 31.3989C25.7029 31.3645 25.7991 31.3498 25.8952 31.3557H35.5414C35.9733 31.3557 36.2613 31.6462 36.2613 32.2273Z" fill="url(#paint2_linear_447_2896)"/>
<path d="M34.8218 46.7537V48.7873C34.8218 49.5137 35.6856 49.8042 36.1176 49.3684L38.997 46.4631C39.429 46.0273 39.141 45.1558 38.4211 45.1558H36.4055C35.9866 45.1594 35.5859 45.3289 35.2897 45.6278C34.9934 45.9267 34.8254 46.331 34.8218 46.7537Z" fill="url(#paint3_linear_447_2896)"/>
<defs>
<filter id="filter0_b_447_2896" x="3.62041" y="19.2603" width="52.7592" height="37.1193" filterUnits="userSpaceOnUse" color-interpolation-filters="sRGB">
<feFlood flood-opacity="0" result="BackgroundImageFix"/>
<feGaussianBlur in="BackgroundImage" stdDeviation="1.6898"/>
<feComposite in2="SourceAlpha" operator="in" result="effect1_backgroundBlur_447_2896"/>
<feBlend mode="normal" in="SourceGraphic" in2="effect1_backgroundBlur_447_2896" result="shape"/>
</filter>
<linearGradient id="paint0_linear_447_2896" x1="41.8833" y1="7.8493" x2="41.1945" y2="51.4807" gradientUnits="userSpaceOnUse">
<stop offset="0.0001" stop-color="#698493"/>
<stop offset="0.51875" stop-color="#5D7684"/>
<stop offset="1" stop-color="#6986A4"/>
</linearGradient>
<linearGradient id="paint1_linear_447_2896" x1="31.0303" y1="23.182" x2="29.9281" y2="51.8734" gradientUnits="userSpaceOnUse">
<stop stop-color="#B3C4D5"/>
<stop offset="0.51875" stop-color="#95AFC9"/>
<stop offset="1" stop-color="#6986A4"/>
</linearGradient>
<linearGradient id="paint2_linear_447_2896" x1="30.4626" y1="28.1599" x2="30.4626" y2="50.2399" gradientUnits="userSpaceOnUse">
<stop stop-color="white"/>
<stop offset="1" stop-color="white" stop-opacity="0.8"/>
</linearGradient>
<linearGradient id="paint3_linear_447_2896" x1="30.4626" y1="28.1599" x2="30.4626" y2="50.2399" gradientUnits="userSpaceOnUse">
<stop stop-color="white"/>
<stop offset="1" stop-color="white" stop-opacity="0.8"/>
</linearGradient>
</defs>
</svg>
