<svg width="60" height="60" viewBox="0 0 60 60" fill="none" xmlns="http://www.w3.org/2000/svg">
<path d="M52.9645 10H8.04689C7.50526 9.99918 6.98549 10.2324 6.6017 10.6483C6.21792 11.0643 6.00151 11.6291 6 12.2186V47.7752C6.00151 48.3653 6.21773 48.9307 6.60135 49.3477C6.98498 49.7646 7.50474 49.9992 8.04689 50H52.9645C53.5051 49.9975 54.0229 49.7621 54.4043 49.3451C54.7858 48.9281 55 48.3636 55 47.7752V12.2186C54.9955 11.6322 54.7798 11.0712 54.3991 10.6563C54.0184 10.2413 53.5032 10.0057 52.9645 10V10Z" fill="#333333"/>
<path d="M6 18H23V10H8.12727C7.56629 10 7.02828 10.2396 6.63161 10.6662C6.23494 11.0928 6.01209 11.6713 6.01209 12.2746V12.2746L6 18Z" fill="#E0DDD8"/>
<path d="M38 10H23V18H38V10Z" fill="#3E92CC"/>
<path d="M55 18H38V10H52.8727C53.4337 10 53.9717 10.2396 54.3684 10.6662C54.7651 11.0928 54.9879 11.6713 54.9879 12.2746V12.2746L55 18Z" fill="#0A2463"/>
<path opacity="0.1" d="M23.8188 30.4603L14.4015 39.8775C14.1749 40.0662 14.0324 40.3371 14.0052 40.6307C13.9781 40.9242 14.0684 41.2166 14.2565 41.4437L14.4015 41.5887L16.3418 43.5116C16.531 43.7384 16.8023 43.8809 17.0964 43.9081C17.3904 43.9353 17.6833 43.8449 17.9108 43.6566L18.0559 43.5116L27.4615 34.0856C27.5741 33.9922 27.6672 33.8774 27.7355 33.748C27.8037 33.6185 27.8457 33.4769 27.8592 33.3312C27.8727 33.1854 27.8573 33.0385 27.8139 32.8987C27.7706 32.759 27.7001 32.6291 27.6065 32.5166C27.5634 32.4633 27.5148 32.4147 27.4615 32.3716L25.5328 30.4603C25.295 30.254 24.9907 30.1404 24.6758 30.1404C24.3609 30.1404 24.0566 30.254 23.8188 30.4603V30.4603Z" fill="black"/>
<path d="M23.6823 30.7675L14.7117 39.741C14.6042 39.8279 14.5149 39.9352 14.4491 40.0568C14.3833 40.1783 14.3422 40.3117 14.3282 40.4492C14.3141 40.5867 14.3275 40.7256 14.3674 40.858C14.4074 40.9903 14.4731 41.1134 14.5609 41.2202V41.2376L14.6972 41.3739L16.5099 43.1866C16.5982 43.2941 16.7069 43.3831 16.8296 43.4485C16.9523 43.514 17.0868 43.5546 17.2252 43.5681C17.3637 43.5815 17.5034 43.5676 17.6365 43.527C17.7695 43.4864 17.8933 43.42 18.0006 43.3316V43.3316L18.137 43.1489L27.1105 34.1754C27.2175 34.088 27.3062 33.9805 27.3715 33.8588C27.4369 33.7372 27.4776 33.6039 27.4913 33.4665C27.505 33.3291 27.4915 33.1903 27.4516 33.0581C27.4116 32.926 27.346 32.803 27.2584 32.6962V32.6962C27.2182 32.6459 27.1724 32.6001 27.1221 32.5599L25.3094 30.7472C25.0799 30.5527 24.7871 30.4489 24.4864 30.4554C24.1856 30.4618 23.8976 30.5779 23.6765 30.782L23.6823 30.7675Z" fill="#C0C0C0"/>
<path opacity="0.1" d="M18.0353 23.3196L27.4613 32.734C27.5739 32.8274 27.667 32.9422 27.7352 33.0716C27.8034 33.2011 27.8455 33.3427 27.859 33.4884C27.8724 33.6342 27.8571 33.7811 27.8137 33.9209C27.7703 34.0606 27.6999 34.1905 27.6063 34.303L27.4613 34.448L25.5326 36.3796C25.343 36.6057 25.0717 36.7478 24.7779 36.7749C24.4841 36.8021 24.1914 36.7121 23.9635 36.5247C23.9109 36.4808 23.8624 36.4322 23.8185 36.3796L14.4012 26.9537C14.1745 26.7645 14.0319 26.4931 14.0047 26.1991C13.9776 25.905 14.068 25.6121 14.2562 25.3846L14.4012 25.2396L16.3415 23.3196C16.5756 23.1136 16.8767 23 17.1884 23C17.5002 23 17.8013 23.1136 18.0353 23.3196V23.3196Z" fill="black"/>
<path d="M18.1544 23.6271L27.1279 32.6007C27.2342 32.6886 27.3222 32.7966 27.3867 32.9186C27.4513 33.0405 27.4912 33.174 27.5041 33.3114C27.517 33.4488 27.5028 33.5873 27.4621 33.7192C27.4214 33.8511 27.3552 33.9736 27.2671 34.0798V34.0798C27.2261 34.1295 27.1805 34.1752 27.1308 34.2161L25.3181 36.0288C25.2308 36.1358 25.1232 36.2245 25.0016 36.2898C24.8799 36.3552 24.7466 36.3959 24.6092 36.4096C24.4718 36.4234 24.3331 36.4099 24.2009 36.3699C24.0687 36.3299 23.9457 36.2643 23.839 36.1767H23.8216C23.7719 36.1358 23.7262 36.0901 23.6852 36.0404L14.7117 27.0611C14.6042 26.9742 14.5149 26.8669 14.4491 26.7454C14.3833 26.6238 14.3422 26.4904 14.3282 26.3529C14.3141 26.2154 14.3275 26.0765 14.3674 25.9442C14.4074 25.8118 14.4731 25.6887 14.5609 25.5819V25.5674C14.6003 25.5164 14.6461 25.4706 14.6972 25.4311L16.5099 23.6184C16.7353 23.4206 17.025 23.3115 17.3249 23.3115C17.6248 23.3115 17.9145 23.4206 18.1399 23.6184L18.1544 23.6271Z" fill="#EBEBEB"/>
<path d="M35 40.9984C35 43.3715 35.7037 45.6913 37.0221 47.6644C38.3405 49.6375 40.2144 51.1754 42.4068 52.0835C44.5993 52.9917 47.0117 53.2293 49.3392 52.7663C51.6667 52.3033 53.8046 51.1606 55.4826 49.4826C57.1606 47.8046 58.3033 45.6667 58.7663 43.3392C59.2293 41.0117 58.9917 38.5993 58.0835 36.4068C57.1754 34.2144 55.6375 32.3405 53.6644 31.0221C51.6913 29.7037 49.3715 29 46.9984 29C43.8162 29 40.7644 30.2641 38.5143 32.5143C36.2641 34.7644 35 37.8162 35 40.9984V40.9984Z" fill="#C9CBD2"/>
<path d="M36.8289 40.9987C36.8289 43.0098 37.4252 44.9756 38.5425 46.6477C39.6597 48.3199 41.2477 49.6231 43.1057 50.3927C44.9636 51.1623 47.0081 51.3636 48.9805 50.9713C50.9528 50.579 52.7646 49.6106 54.1866 48.1886C55.6086 46.7666 56.577 44.9548 56.9694 42.9824C57.3617 41.01 57.1603 38.9656 56.3907 37.1076C55.6212 35.2497 54.3179 33.6617 52.6458 32.5444C50.9737 31.4271 49.0078 30.8308 46.9968 30.8308C44.3001 30.8308 41.7138 31.9021 39.807 33.8089C37.9001 35.7158 36.8289 38.302 36.8289 40.9987V40.9987Z" fill="#57555E"/>
<path d="M46.997 51.2263C44.9712 51.2263 42.9909 50.6256 41.3065 49.5002C39.6221 48.3747 38.3093 46.775 37.5341 44.9034C36.7588 43.0319 36.556 40.9724 36.9512 38.9856C37.3464 36.9987 38.3219 35.1736 39.7544 33.7412C41.1868 32.3087 43.0119 31.3332 44.9987 30.938C46.9856 30.5428 49.045 30.7456 50.9166 31.5209C52.7882 32.2961 54.3879 33.6089 55.5133 35.2933C56.6388 36.9777 57.2395 38.958 57.2395 40.9838V40.9955C57.2341 43.7092 56.1529 46.3101 54.2328 48.2279C52.3128 50.1458 49.7107 51.224 46.997 51.2263V51.2263ZM46.997 30.9066C45.0001 30.9066 43.0481 31.4987 41.3878 32.6081C39.7275 33.7175 38.4334 35.2943 37.6693 37.1391C36.9051 38.984 36.7052 41.014 37.0947 42.9725C37.4843 44.931 38.4459 46.7299 39.8578 48.1419C41.2698 49.5539 43.0688 50.5155 45.0273 50.905C46.9858 51.2946 49.0158 51.0947 50.8606 50.3305C52.7055 49.5663 54.2823 48.2723 55.3917 46.612C56.5011 44.9516 57.0932 42.9996 57.0932 41.0028C57.0932 38.3251 56.0295 35.7571 54.1361 33.8637C52.2427 31.9703 49.6746 30.9066 46.997 30.9066V30.9066Z" fill="#6B6A6A"/>
<path d="M45.0032 40.9988C45.0032 41.5277 45.2133 42.035 45.5873 42.409C45.9613 42.783 46.4686 42.9931 46.9975 42.9931C47.5265 42.9931 48.0338 42.783 48.4078 42.409C48.7818 42.035 48.9919 41.5277 48.9919 40.9988V40.9988C48.9919 40.7369 48.9403 40.4775 48.8401 40.2356C48.7399 39.9936 48.593 39.7737 48.4078 39.5885C48.2226 39.4033 48.0027 39.2564 47.7608 39.1562C47.5188 39.056 47.2595 39.0044 46.9975 39.0044C46.7356 39.0044 46.4763 39.056 46.2343 39.1562C45.9924 39.2564 45.7725 39.4033 45.5873 39.5885C45.4021 39.7737 45.2552 39.9936 45.155 40.2356C45.0548 40.4775 45.0032 40.7369 45.0032 40.9988V40.9988Z" fill="#EBECF0"/>
<path d="M39.8739 42.2203H40.7518L40.7943 42.2511L40.8352 42.3037L40.8704 42.3754V42.4164C41.0406 43.0301 41.3052 43.6135 41.6547 44.1459V44.2045C41.6619 44.25 41.6619 44.2964 41.6547 44.342C41.6545 44.46 41.6077 44.5731 41.5244 44.6566L41.0606 45.119C40.894 45.286 40.8005 45.5123 40.8005 45.7482C40.8005 45.9841 40.894 46.2103 41.0606 46.3774L41.5303 46.847C41.6973 47.0136 41.9236 47.1071 42.1595 47.1071C42.3953 47.1071 42.6216 47.0136 42.7886 46.847L43.251 46.3832L43.311 46.3422H43.75C44.2525 46.6384 44.7944 46.862 45.3595 47.0065C45.4504 47.0334 45.5302 47.089 45.5869 47.1649C45.6436 47.2409 45.6742 47.3332 45.6741 47.4279V48.0805C45.6733 48.3161 45.7659 48.5424 45.9315 48.71C46.0971 48.8775 46.3223 48.9726 46.5579 48.9746H47.2281C47.4634 48.973 47.6885 48.8785 47.8544 48.7115C48.0202 48.5446 48.1133 48.3188 48.1133 48.0835V47.4309C48.1128 47.3368 48.1426 47.2451 48.1982 47.1692C48.2538 47.0934 48.3322 47.0374 48.4221 47.0095C48.9795 46.862 49.5134 46.6369 50.0082 46.3408L50.0857 46.3042H50.3579L50.4179 46.3349L50.4881 46.3934L50.952 46.8573C51.119 47.0238 51.3453 47.1174 51.5812 47.1174C51.817 47.1174 52.0433 47.0238 52.2103 46.8573L52.6786 46.3876C52.7614 46.3051 52.8271 46.207 52.8719 46.0991C52.9168 45.9911 52.9399 45.8753 52.9399 45.7584C52.9399 45.6415 52.9168 45.5257 52.8719 45.4178C52.8271 45.3098 52.7614 45.2117 52.6786 45.1292L52.4123 44.6903C52.3542 44.6326 52.3135 44.5598 52.2946 44.4802C52.2757 44.4005 52.2795 44.3172 52.3054 44.2396V44.1854C52.6012 43.6874 52.8248 43.1499 52.9698 42.5891V42.5481L53.0063 42.4764L53.0473 42.4223L53.0883 42.3871H54.1125C54.3477 42.386 54.5729 42.2917 54.7388 42.125C54.9047 41.9583 54.9978 41.7327 54.9978 41.4975V40.6591C54.994 40.4262 54.8992 40.204 54.7338 40.0399C54.5684 39.8759 54.3455 39.783 54.1125 39.7811H53.4599C53.366 39.7795 53.2751 39.7477 53.2006 39.6906C53.126 39.6334 53.0718 39.5539 53.0458 39.4636C52.8896 38.8901 52.6516 38.3421 52.3391 37.8365V37.3595L52.3684 37.3244L52.8322 36.8606C52.9988 36.6935 53.0923 36.4673 53.0923 36.2314C53.0923 35.9955 52.9988 35.7692 52.8322 35.6022L52.3625 35.1339C52.28 35.0511 52.1819 34.9854 52.074 34.9406C51.966 34.8957 51.8502 34.8727 51.7333 34.8727C51.6164 34.8727 51.5007 34.8957 51.3927 34.9406C51.2847 34.9854 51.1867 35.0511 51.1041 35.1339L50.6418 35.5963C50.5834 35.6557 50.5094 35.6973 50.4283 35.7162C50.3472 35.7352 50.2624 35.7306 50.1838 35.7031H50.1194C49.6212 35.4077 49.0838 35.184 48.523 35.0388C48.2494 34.9554 48.1601 34.8545 48.1543 34.5999V33.9517C48.1512 33.7178 48.0561 33.4945 47.8896 33.3301C47.7231 33.1658 47.4986 33.0737 47.2646 33.0737H46.6589C46.425 33.0768 46.2017 33.1719 46.0374 33.3384C45.873 33.5049 45.7809 33.7294 45.7809 33.9634V34.6174C45.7824 34.6389 45.7824 34.6604 45.7809 34.6818V34.8486H45.7458L45.68 34.8837H45.639C45.0939 35.0218 44.5701 35.2335 44.0821 35.5129C44.0011 35.5874 43.8951 35.6287 43.7851 35.6287C43.6751 35.6287 43.5691 35.5874 43.4881 35.5129L42.8384 35.1149C42.6714 34.9484 42.4451 34.8548 42.2092 34.8548C41.9733 34.8548 41.7471 34.9484 41.58 35.1149L41.1118 35.5846C41.029 35.6671 40.9633 35.7652 40.9184 35.8732C40.8736 35.9811 40.8505 36.0969 40.8505 36.2138C40.8505 36.3307 40.8736 36.4465 40.9184 36.5544C40.9633 36.6624 41.029 36.7605 41.1118 36.843L41.5742 37.3054C41.6527 37.3826 41.6993 37.4866 41.7048 37.5967C41.7102 37.7067 41.674 37.8148 41.6034 37.8994C41.3236 38.385 41.111 38.9063 40.9713 39.449V39.5953H39.8739C39.6383 39.5969 39.413 39.6916 39.2471 39.8589C39.0812 40.0262 38.9883 40.2523 38.9887 40.4879V41.1522C38.9431 41.3841 38.9915 41.6245 39.1232 41.8207C39.2549 42.0169 39.4591 42.1528 39.691 42.1984C39.751 42.2123 39.8123 42.2197 39.8739 42.2203V42.2203ZM46.9969 38.1131C47.5676 38.1131 48.1254 38.2823 48.6 38.5994C49.0745 38.9164 49.4443 39.3671 49.6627 39.8943C49.8811 40.4216 49.9382 41.0017 49.8269 41.5615C49.7156 42.1212 49.4408 42.6353 49.0372 43.0389C48.6337 43.4424 48.1195 43.7172 47.5598 43.8286C47.0001 43.9399 46.4199 43.8828 45.8927 43.6644C45.3654 43.446 44.9148 43.0761 44.5977 42.6016C44.2806 42.1271 44.1114 41.5692 44.1114 40.9985C44.1114 40.6196 44.186 40.2444 44.331 39.8943C44.4761 39.5442 44.6886 39.2261 44.9565 38.9582C45.2245 38.6903 45.5426 38.4777 45.8927 38.3327C46.2427 38.1877 46.6179 38.1131 46.9969 38.1131V38.1131Z" fill="#EBECF0"/>
<path d="M46.9967 43.0762C46.5858 43.0762 46.1841 42.9543 45.8424 42.726C45.5007 42.4977 45.2344 42.1732 45.0771 41.7936C44.9198 41.4139 44.8787 40.9961 44.9589 40.5931C45.039 40.19 45.2369 39.8198 45.5275 39.5292C45.8181 39.2386 46.1883 39.0408 46.5914 38.9606C46.9944 38.8804 47.4122 38.9216 47.7919 39.0788C48.1715 39.2361 48.496 39.5024 48.7243 39.8441C48.9526 40.1858 49.0745 40.5875 49.0745 40.9984C49.0741 41.5494 48.8551 42.0776 48.4655 42.4672C48.0759 42.8568 47.5477 43.0758 46.9967 43.0762V43.0762ZM46.9967 39.0801C46.6082 39.0576 46.2221 39.1535 45.8893 39.3553C45.5565 39.5571 45.2929 39.8551 45.1333 40.21C44.9736 40.5649 44.9255 40.9599 44.9953 41.3427C45.0651 41.7256 45.2495 42.0782 45.5241 42.3539C45.7988 42.6296 46.1506 42.8154 46.5332 42.8868C46.9157 42.9581 47.3109 42.9116 47.6664 42.7534C48.022 42.5952 48.3211 42.3328 48.5242 42.0008C48.7273 41.6689 48.8248 41.2831 48.8038 40.8945C48.7793 40.4225 48.5812 39.9762 48.2477 39.6413C47.9142 39.3064 47.4686 39.1066 46.9967 39.0801Z" fill="#666666"/>
<path d="M46.6645 49.0653C46.5374 49.0653 46.4115 49.0403 46.294 48.9916C46.1766 48.9429 46.0699 48.8715 45.9801 48.7815C45.8902 48.6916 45.819 48.5848 45.7705 48.4673C45.722 48.3498 45.6971 48.2238 45.6973 48.0967V47.4426C45.6974 47.3654 45.6725 47.2902 45.6263 47.2282C45.5802 47.1662 45.5153 47.1208 45.4412 47.0988C44.8758 46.9524 44.3339 46.7268 43.8317 46.4286L43.76 46.3979H43.4527L43.4059 46.4345L42.9421 46.8968C42.7596 47.0774 42.5133 47.1787 42.2565 47.1787C41.9998 47.1787 41.7535 47.0774 41.571 46.8968L41.0604 46.4754C40.8798 46.293 40.7785 46.0466 40.7785 45.7899C40.7785 45.5332 40.8798 45.2869 41.0604 45.1044L41.5213 44.6435C41.5625 44.5921 41.5932 44.5331 41.6116 44.4698C41.6299 44.4065 41.6355 44.3402 41.6281 44.2748V44.2148C41.3294 43.7126 41.1033 43.1707 40.9565 42.6052V42.576L40.9272 42.5218L40.8862 42.475H39.8737C39.6172 42.475 39.3712 42.3731 39.1898 42.1917C39.0084 42.0103 38.9065 41.7643 38.9065 41.5078V40.6664C38.9063 40.5393 38.9312 40.4134 38.9797 40.2959C39.0282 40.1784 39.0994 40.0716 39.1893 39.9816C39.2791 39.8916 39.3858 39.8203 39.5032 39.7716C39.6207 39.7229 39.7465 39.6978 39.8737 39.6978H40.7165L40.7575 39.6685V39.61C40.9004 39.0545 41.118 38.5209 41.4042 38.0239C41.4635 37.958 41.4964 37.8725 41.4964 37.7839C41.4964 37.6953 41.4635 37.6098 41.4042 37.5439L40.936 37.0684C40.7554 36.8859 40.6541 36.6396 40.6541 36.3829C40.6541 36.1261 40.7554 35.8798 40.936 35.6973L41.4042 35.2276C41.5869 35.047 41.8335 34.9456 42.0905 34.9456C42.3474 34.9456 42.594 35.047 42.7767 35.2276L43.2391 35.6915C43.3011 35.7554 43.3844 35.7942 43.4731 35.8007C43.5619 35.8072 43.6499 35.7808 43.7205 35.7266C44.2145 35.438 44.7457 35.2184 45.2993 35.074H45.3403L45.4061 35.0389L45.4354 34.9906V34.9131C45.4369 34.8936 45.4369 34.874 45.4354 34.8545V34.1961C45.4352 34.0689 45.4601 33.943 45.5086 33.8255C45.5571 33.708 45.6283 33.6012 45.7182 33.5112C45.808 33.4213 45.9147 33.3499 46.0321 33.3012C46.1496 33.2525 46.2754 33.2274 46.4026 33.2274H47.0684C47.3245 33.2293 47.5696 33.3321 47.7507 33.5133C47.9317 33.6946 48.034 33.9399 48.0355 34.1961V34.8545C48.0355 35.0564 48.1014 35.134 48.3443 35.2042C48.91 35.3505 49.452 35.5766 49.9538 35.8759H50.0197C50.0837 35.898 50.1526 35.9019 50.2188 35.8872C50.2849 35.8725 50.3457 35.8397 50.3943 35.7925L50.8566 35.3286C51.0391 35.148 51.2854 35.0467 51.5422 35.0467C51.7989 35.0467 52.0452 35.148 52.2277 35.3286L52.7018 35.8056C52.8823 35.9881 52.9836 36.2344 52.9836 36.4911C52.9836 36.7479 52.8823 36.9942 52.7018 37.1767L52.2204 37.6639V37.8102C52.2189 37.8263 52.2189 37.8425 52.2204 37.8585V37.9405C52.5193 38.4464 52.745 38.9923 52.8905 39.5617C52.9138 39.6347 52.9599 39.6984 53.0221 39.7432C53.0842 39.788 53.1592 39.8116 53.2358 39.8105H54.1138C54.2415 39.8097 54.3682 39.8342 54.4864 39.8827C54.6046 39.9311 54.712 40.0025 54.8025 40.0927C54.893 40.1829 54.9647 40.2901 55.0135 40.4082C55.0623 40.5263 55.0872 40.6528 55.0868 40.7806V41.4449C55.0635 41.6852 54.9516 41.9083 54.7728 42.0706C54.594 42.2329 54.3611 42.3228 54.1196 42.3228H53.2417L53.1934 42.377L53.1583 42.4413V42.4779C53.0145 43.0458 52.7914 43.5906 52.4954 44.0962V44.146C52.4732 44.2097 52.4691 44.2783 52.4836 44.3442C52.4981 44.41 52.5305 44.4706 52.5774 44.5191L53.0412 44.983C53.2282 45.1607 53.337 45.4055 53.3436 45.6634C53.3502 45.9213 53.254 46.1713 53.0763 46.3584C53.0349 46.4026 52.9893 46.4427 52.9403 46.4784L52.4706 46.9481C52.2881 47.1286 52.0418 47.2299 51.7851 47.2299C51.5283 47.2299 51.282 47.1286 51.0995 46.9481L50.643 46.4784L50.583 46.4315L50.5245 46.395H50.482C50.4339 46.3844 50.3839 46.3844 50.3357 46.395H50.2699C49.7417 46.7034 49.1707 46.9317 48.5755 47.0724C48.5029 47.096 48.4397 47.142 48.395 47.2038C48.3503 47.2656 48.3264 47.34 48.3267 47.4163V48.0689C48.3267 48.1961 48.3017 48.3221 48.253 48.4396C48.2043 48.5571 48.133 48.6639 48.043 48.7538C47.9531 48.8438 47.8463 48.9151 47.7288 48.9638C47.6112 49.0125 47.4853 49.0375 47.3581 49.0375H46.6645V49.0653ZM43.6195 46.2033H43.7556L43.8332 46.234C44.3258 46.5253 44.8574 46.745 45.412 46.8866C45.5186 46.9195 45.6117 46.9857 45.6779 47.0755C45.744 47.1654 45.7795 47.274 45.7793 47.3856V48.0382C45.7793 48.1442 45.8001 48.2493 45.8407 48.3473C45.8813 48.4453 45.9408 48.5343 46.0158 48.6093C46.0908 48.6843 46.1799 48.7438 46.2779 48.7844C46.3759 48.825 46.4809 48.8459 46.587 48.8459H47.2513C47.3573 48.8459 47.4624 48.825 47.5603 48.7844C47.6583 48.7438 47.7474 48.6843 47.8224 48.6093C47.8974 48.5343 47.9569 48.4453 47.9975 48.3473C48.0381 48.2493 48.059 48.1442 48.059 48.0382V48.0382V47.3856C48.0588 47.2739 48.0945 47.165 48.1609 47.0752C48.2273 46.9854 48.3208 46.9192 48.4277 46.8866C48.9842 46.7427 49.5177 46.5211 50.0124 46.2282L50.1016 46.1916H50.1367C50.211 46.1755 50.2878 46.1755 50.3621 46.1916H50.4104L50.4747 46.2282L50.5581 46.2984L51.0205 46.7622C51.1728 46.9112 51.3774 46.9946 51.5904 46.9946C51.8035 46.9946 52.0081 46.9112 52.1604 46.7622L52.6301 46.2925C52.7804 46.141 52.8648 45.9361 52.8648 45.7226C52.8648 45.5091 52.7804 45.3042 52.6301 45.1527L52.3374 44.7444C52.2692 44.6754 52.2215 44.5888 52.1996 44.4942C52.1776 44.3997 52.1823 44.301 52.213 44.2089C52.2226 44.1807 52.2344 44.1533 52.2482 44.127C52.5514 43.6321 52.7824 43.0966 52.9344 42.5364V42.4604C52.9477 42.4313 52.9634 42.4034 52.9812 42.377L53.0295 42.3228L53.0822 42.276H54.1211C54.2272 42.276 54.3322 42.2551 54.4302 42.2145C54.5282 42.1739 54.6172 42.1144 54.6922 42.0394C54.7672 41.9644 54.8267 41.8754 54.8673 41.7774C54.9079 41.6794 54.9288 41.5744 54.9288 41.4683V41.4683V40.6591C54.9272 40.4461 54.8414 40.2423 54.6901 40.0923C54.5387 39.9423 54.3342 39.8584 54.1211 39.8587H53.4685C53.3568 39.8589 53.248 39.8232 53.1581 39.7568C53.0683 39.6904 53.0022 39.5969 52.9695 39.49C52.8256 38.9353 52.6039 38.4038 52.3111 37.9112V37.7649C52.3096 37.7469 52.3096 37.7288 52.3111 37.7107C52.3096 37.6952 52.3096 37.6795 52.3111 37.6639C52.3096 37.6478 52.3096 37.6317 52.3111 37.6156V37.383L52.3462 37.342L52.81 36.8782C52.9604 36.7266 53.0448 36.5217 53.0448 36.3082C53.0448 36.0947 52.9604 35.8899 52.81 35.7383L52.3403 35.1984C52.1888 35.048 51.9839 34.9636 51.7704 34.9636C51.5569 34.9636 51.3521 35.048 51.2005 35.1984L50.7396 35.6593C50.67 35.7281 50.5827 35.7762 50.4873 35.7982C50.3919 35.8202 50.2923 35.8151 50.1996 35.7837L50.1162 35.7471C49.6174 35.4528 49.0802 35.2293 48.5199 35.0828C48.2111 34.9877 48.0911 34.8516 48.0911 34.5721V33.9225C48.09 33.7094 48.0045 33.5054 47.8535 33.3552C47.7024 33.2049 47.498 33.1206 47.2849 33.1206H46.6586C46.4444 33.1206 46.239 33.2057 46.0875 33.3572C45.936 33.5086 45.8509 33.7141 45.8509 33.9283V33.9283V34.5809C45.8524 34.6067 45.8524 34.6326 45.8509 34.6585C45.8524 34.6823 45.8524 34.7063 45.8509 34.7302V34.8896L45.8158 34.9321H45.7441L45.6666 34.973H45.6183C45.0833 35.1123 44.5699 35.324 44.0922 35.6022C43.993 35.6768 43.8705 35.7136 43.7466 35.7061C43.6227 35.6986 43.5056 35.6473 43.4161 35.5613L42.9406 35.0857C42.8695 35.0071 42.7835 34.9434 42.6877 34.898C42.5919 34.8527 42.4881 34.8267 42.3822 34.8215C42.2763 34.8164 42.1705 34.8321 42.0707 34.8679C41.9709 34.9037 41.8792 34.9588 41.8008 35.0301C41.7438 35.0786 41.6945 35.1353 41.6544 35.1984L41.1847 35.6681C41.0344 35.8196 40.95 36.0245 40.95 36.238C40.95 36.4515 41.0344 36.6564 41.1847 36.8079L41.6486 37.2688C41.7301 37.3626 41.775 37.4826 41.775 37.6068C41.775 37.7311 41.7301 37.8511 41.6486 37.9449C41.3856 38.4226 41.1878 38.9334 41.0604 39.4637V39.61L41.0252 39.6524V39.6817L40.9828 39.7168H39.8737C39.7676 39.7168 39.6626 39.7377 39.5646 39.7783C39.4666 39.8189 39.3776 39.8784 39.3026 39.9534C39.2276 40.0284 39.1681 40.1174 39.1275 40.2154C39.0869 40.3134 39.066 40.4184 39.066 40.5245V41.1903C39.0299 41.4014 39.0792 41.6182 39.203 41.793C39.3267 41.9677 39.5148 42.0862 39.7259 42.1224C39.7743 42.1299 39.8232 42.1338 39.8722 42.1341H40.7984L40.8453 42.1692L40.8936 42.2277C40.9145 42.2574 40.9321 42.2893 40.9462 42.3228V42.377C41.1117 42.9873 41.3719 43.568 41.7173 44.0977L41.7481 44.1694C41.7686 44.2268 41.7804 44.287 41.7832 44.3479C41.7849 44.4167 41.7728 44.4852 41.7477 44.5492C41.7226 44.6133 41.6849 44.6717 41.6369 44.721L41.173 45.1849C41.0226 45.3364 40.9383 45.5413 40.9383 45.7548C40.9383 45.9683 41.0226 46.1732 41.173 46.3247L41.6427 46.793C41.7947 46.9426 41.9994 47.0265 42.2126 47.0265C42.4259 47.0265 42.6306 46.9426 42.7826 46.793L43.2684 46.313L43.3401 46.2589H43.3752L43.4527 46.2296H43.5991L43.6195 46.2033ZM46.9967 43.9602C46.4093 43.9604 45.8351 43.7865 45.3467 43.4604C44.8582 43.1343 44.4775 42.6706 44.2526 42.1281C44.0277 41.5855 43.9688 40.9885 44.0833 40.4124C44.1978 39.8364 44.4806 39.3073 44.8959 38.892C45.3112 38.4767 45.8403 38.1939 46.4164 38.0794C46.9924 37.9649 47.5895 38.0238 48.132 38.2487C48.6746 38.4736 49.1382 38.8543 49.4643 39.3428C49.7904 39.8312 49.9644 40.4054 49.9641 40.9927C49.9641 41.7798 49.6514 42.5345 49.0949 43.091C48.5384 43.6475 47.7837 43.9602 46.9967 43.9602V43.9602ZM46.9967 38.1673C46.4423 38.167 45.9003 38.3311 45.4392 38.639C44.9782 38.9468 44.6188 39.3845 44.4066 39.8967C44.1943 40.4088 44.1388 40.9724 44.247 41.5162C44.3552 42.0599 44.6222 42.5593 45.0143 42.9512C45.4065 43.3431 45.906 43.6099 46.4498 43.7178C46.9936 43.8257 47.5571 43.7699 48.0692 43.5574C48.5812 43.3449 49.0187 42.9853 49.3263 42.5241C49.634 42.0629 49.7978 41.5208 49.7973 40.9664C49.7965 40.224 49.5011 39.5123 48.976 38.9874C48.4509 38.4626 47.739 38.1676 46.9967 38.1673V38.1673Z" fill="#666666"/>
<path d="M35 40.9984C35 43.3715 35.7037 45.6913 37.0221 47.6644C38.3405 49.6375 40.2144 51.1754 42.4068 52.0835C44.5993 52.9917 47.0117 53.2293 49.3392 52.7663C51.6667 52.3033 53.8046 51.1606 55.4826 49.4826C57.1606 47.8046 58.3033 45.6667 58.7663 43.3392C59.2293 41.0117 58.9917 38.5993 58.0835 36.4068C57.1754 34.2144 55.6375 32.3405 53.6644 31.0221C51.6913 29.7037 49.3715 29 46.9984 29C43.8162 29 40.7644 30.2641 38.5143 32.5143C36.2641 34.7644 35 37.8162 35 40.9984V40.9984Z" fill="#C9CBD2"/>
<path d="M36.8987 41.0161C36.8984 43.0275 37.4946 44.9938 38.6118 46.6663C39.7291 48.3388 41.3172 49.6425 43.1754 50.4124C45.0336 51.1823 47.0784 51.3839 49.0511 50.9917C51.0239 50.5995 52.8361 49.6311 54.2584 48.2089C55.6808 46.7868 56.6495 44.9747 57.042 43.002C57.4345 41.0293 57.2332 38.9845 56.4635 37.1262C55.6939 35.2679 54.3904 33.6796 52.718 32.5621C51.0457 31.4446 49.0795 30.8481 47.0681 30.8481C44.3712 30.8481 41.7848 31.9194 39.8777 33.8262C37.9707 35.733 36.8991 38.3192 36.8987 41.0161V41.0161Z" fill="#57555E"/>
<path d="M46.997 51.2263C44.9712 51.2263 42.9909 50.6256 41.3065 49.5002C39.6221 48.3747 38.3093 46.775 37.5341 44.9034C36.7588 43.0319 36.556 40.9724 36.9512 38.9856C37.3464 36.9987 38.3219 35.1736 39.7544 33.7412C41.1868 32.3087 43.0119 31.3332 44.9987 30.938C46.9856 30.5428 49.045 30.7456 50.9166 31.5209C52.7882 32.2961 54.3879 33.6089 55.5133 35.2933C56.6388 36.9777 57.2395 38.958 57.2395 40.9838V40.9955C57.2341 43.7092 56.1529 46.3101 54.2328 48.2279C52.3128 50.1458 49.7107 51.224 46.997 51.2263V51.2263ZM46.997 30.9066C45.0001 30.9066 43.0481 31.4987 41.3878 32.6081C39.7275 33.7175 38.4334 35.2943 37.6693 37.1391C36.9051 38.984 36.7052 41.014 37.0947 42.9725C37.4843 44.931 38.4459 46.7299 39.8578 48.1419C41.2698 49.5539 43.0688 50.5155 45.0273 50.905C46.9858 51.2946 49.0158 51.0947 50.8606 50.3305C52.7055 49.5663 54.2823 48.2723 55.3917 46.612C56.5011 44.9516 57.0932 42.9996 57.0932 41.0028C57.0932 38.3251 56.0295 35.7571 54.1361 33.8637C52.2427 31.9703 49.6746 30.9066 46.997 30.9066V30.9066Z" fill="#6B6A6A"/>
<path d="M45.1152 40.9984C45.1152 41.3706 45.2256 41.7344 45.4324 42.0438C45.6391 42.3533 45.933 42.5945 46.2768 42.7369C46.6207 42.8793 46.999 42.9166 47.364 42.844C47.7291 42.7713 48.0643 42.5921 48.3275 42.329C48.5907 42.0658 48.7699 41.7305 48.8425 41.3655C48.9151 41.0005 48.8778 40.6221 48.7354 40.2783C48.593 39.9345 48.3518 39.6406 48.0424 39.4338C47.7329 39.2271 47.3691 39.1167 46.9969 39.1167C46.4979 39.1167 46.0193 39.3149 45.6664 39.6678C45.3135 40.0207 45.1152 40.4993 45.1152 40.9984Z" fill="#312242"/>
<path d="M53.9657 39.7285H53.3248C53.2488 39.7294 53.1745 39.7063 53.1125 39.6624C53.0504 39.6185 53.0039 39.5561 52.9795 39.4841V39.4548C52.8401 38.9032 52.6244 38.3738 52.3386 37.8819V37.3946L52.7776 36.9556C52.9535 36.7779 53.0522 36.5378 53.0522 36.2877C53.0522 36.0376 52.9535 35.7975 52.7776 35.6197L52.3386 35.1925C52.1605 35.0147 51.9193 34.9149 51.6677 34.9149C51.4161 34.9149 51.1749 35.0147 50.9968 35.1925L50.5461 35.668C50.4972 35.7167 50.4347 35.7495 50.3668 35.762C50.2989 35.7745 50.2288 35.7663 50.1657 35.7382H50.1072C49.6125 35.4453 49.0791 35.2237 48.5225 35.0798C48.2781 35.0081 48.2138 34.9335 48.2138 34.7301V34.0116C48.2154 33.7653 48.1207 33.5281 47.9498 33.3507C47.7789 33.1732 47.5455 33.0696 47.2992 33.062H46.6423C46.395 33.0681 46.1601 33.1711 45.9879 33.3487C45.8158 33.5263 45.7203 33.7643 45.7219 34.0116V34.6584C45.7234 34.6803 45.7234 34.7023 45.7219 34.7242V34.8428C45.7219 34.913 45.5083 34.9554 45.5083 34.9554C44.969 35.0958 44.4516 35.3095 43.9704 35.5905C43.7568 35.7207 43.6266 35.7573 43.4773 35.6373L43.0032 35.1691C42.8249 34.9935 42.5841 34.8959 42.3339 34.8979C42.0836 34.8998 41.8444 35.001 41.6688 35.1793C41.6621 35.1853 41.6557 35.1916 41.6497 35.1983L41.1742 35.668C40.9982 35.847 40.8996 36.0879 40.8996 36.3389C40.8996 36.5899 40.9982 36.8308 41.1742 37.0098L41.6497 37.4663C41.709 37.531 41.7418 37.6156 41.7418 37.7034C41.7418 37.7911 41.709 37.8757 41.6497 37.9404C41.3689 38.4237 41.1553 38.9431 41.0147 39.4841V39.6216L40.9357 39.6977H40.027C39.7767 39.6977 39.5367 39.7972 39.3597 39.9742C39.1827 40.1511 39.0833 40.3912 39.0833 40.6415V40.6415V41.3424C39.0832 41.5932 39.1825 41.8339 39.3593 42.0118C39.5361 42.1897 39.7762 42.2905 40.027 42.292H40.8698L40.9181 42.3462V42.453C41.0841 43.0175 41.3305 43.5551 41.6497 44.0494L41.7331 44.1796C41.7541 44.2433 41.7568 44.3115 41.741 44.3767C41.7253 44.4418 41.6916 44.5013 41.6439 44.5483L41.2049 45.0341C41.0283 45.2127 40.9292 45.4538 40.9292 45.705C40.9292 45.9562 41.0283 46.1973 41.2049 46.3759L41.6732 46.8397C41.8516 47.0167 42.0927 47.1161 42.344 47.1161C42.5954 47.1161 42.8365 47.0167 43.0149 46.8397L43.4539 46.4007L43.508 46.3598H43.8621C44.3521 46.6467 44.8795 46.8644 45.4292 47.0065C45.5052 47.0276 45.5717 47.0738 45.6179 47.1376C45.6641 47.2014 45.6874 47.279 45.6838 47.3577V47.9503C45.6834 48.0758 45.708 48.2001 45.7562 48.316C45.8043 48.4319 45.8751 48.537 45.9643 48.6253C46.0535 48.7135 46.1594 48.7832 46.2758 48.8301C46.3922 48.877 46.5168 48.9002 46.6423 48.8985H47.3124C47.5535 48.8983 47.7852 48.805 47.9592 48.638C48.0515 48.5497 48.125 48.4437 48.1752 48.3262C48.2255 48.2088 48.2516 48.0824 48.2518 47.9547V47.3197C48.2495 47.2437 48.2719 47.1691 48.3157 47.1071C48.3595 47.045 48.4224 46.999 48.4947 46.9758H48.5254C49.0776 46.838 49.6079 46.6243 50.1013 46.3408H50.4159L50.9558 46.8573C51.1343 47.0343 51.3754 47.1336 51.6267 47.1336C51.8781 47.1336 52.1192 47.0343 52.2976 46.8573L52.76 46.3934C52.9358 46.2159 53.0345 45.9761 53.0345 45.7262C53.0345 45.4763 52.9358 45.2365 52.76 45.059L52.3488 44.601C52.3051 44.5578 52.2737 44.5036 52.258 44.4442C52.2423 44.3847 52.2429 44.3222 52.2596 44.263V44.2147C52.5539 43.7185 52.7761 43.183 52.9195 42.6242V42.5232L52.9488 42.4822H53.8516C54.1019 42.4822 54.3419 42.3828 54.5189 42.2058C54.6959 42.0288 54.7953 41.7888 54.7953 41.5385V41.5385V40.6722C54.7959 40.4415 54.7125 40.2185 54.5606 40.0448C54.4087 39.8711 54.1988 39.7587 53.9701 39.7285H53.9657ZM46.9964 43.9996C46.1999 43.9996 45.436 43.6833 44.8727 43.1203C44.3094 42.5572 43.9928 41.7935 43.9924 40.9971V40.9971C43.9921 40.4029 44.168 39.8219 44.4979 39.3277C44.8278 38.8335 45.2969 38.4483 45.8458 38.2207C46.3946 37.9931 46.9987 37.9334 47.5815 38.0492C48.1643 38.1649 48.6997 38.4509 49.12 38.8709C49.5403 39.291 49.8265 39.8263 49.9425 40.409C50.0586 40.9918 49.9992 41.5959 49.7718 42.1448C49.5445 42.6938 49.1595 43.1631 48.6654 43.4932C48.1714 43.8234 47.5906 43.9996 46.9964 43.9996Z" fill="#6B6A6A"/>
<path d="M46.9963 43.0165C46.5968 43.0168 46.2062 42.8986 45.8739 42.6768C45.5416 42.4551 45.2826 42.1397 45.1296 41.7707C44.9766 41.4017 44.9364 40.9955 45.0143 40.6037C45.0922 40.2119 45.2845 39.8519 45.567 39.5695C45.8495 39.287 46.2094 39.0946 46.6013 39.0168C46.9931 38.9389 47.3992 38.979 47.7682 39.132C48.1373 39.285 48.4526 39.5441 48.6744 39.8764C48.8962 40.2086 49.0144 40.5992 49.0141 40.9987C49.0141 41.5339 48.8015 42.0471 48.4231 42.4255C48.0447 42.8039 47.5314 43.0165 46.9963 43.0165V43.0165ZM46.9963 39.1287C46.6264 39.1287 46.2649 39.2384 45.9574 39.4439C45.6499 39.6494 45.4102 39.9414 45.2686 40.2831C45.1271 40.6248 45.0901 41.0008 45.1622 41.3636C45.2344 41.7263 45.4125 42.0595 45.674 42.321C45.9355 42.5826 46.2687 42.7607 46.6315 42.8328C46.9942 42.905 47.3702 42.8679 47.7119 42.7264C48.0536 42.5849 48.3457 42.3452 48.5511 42.0377C48.7566 41.7301 48.8663 41.3686 48.8663 40.9987C48.8648 40.5033 48.6672 40.0285 48.3169 39.6782C47.9665 39.3278 47.4918 39.1303 46.9963 39.1287V39.1287Z" fill="#6B6A6A"/>
<path d="M40.0818 42.1968H40.9363L40.9714 42.232L41.0548 42.3212L41.0914 42.3871V42.4529C41.232 42.999 41.4498 43.5222 41.7382 44.0068L41.8274 44.1532C41.8511 44.2291 41.8536 44.3101 41.8348 44.3874C41.816 44.4648 41.7765 44.5355 41.7206 44.5921L41.2743 45.0735C41.1938 45.1539 41.1298 45.2493 41.0862 45.3544C41.0426 45.4595 41.0202 45.5721 41.0202 45.6859C41.0202 45.7997 41.0426 45.9123 41.0862 46.0174C41.1298 46.1225 41.1938 46.2179 41.2743 46.2983L41.744 46.7562C41.8244 46.8368 41.9198 46.9007 42.0249 46.9443C42.13 46.988 42.2426 47.0104 42.3564 47.0104C42.4702 47.0104 42.5828 46.988 42.6879 46.9443C42.793 46.9007 42.8884 46.8368 42.9687 46.7562L43.4238 46.3114L43.4765 46.269H43.8979C44.3831 46.5571 44.9068 46.7749 45.4533 46.9157C45.5452 46.9405 45.626 46.9956 45.6826 47.0721C45.7392 47.1486 45.7682 47.242 45.765 47.3371V47.9312C45.765 48.046 45.7877 48.1596 45.832 48.2654C45.8763 48.3713 45.9411 48.4673 46.0228 48.5479C46.1045 48.6285 46.2014 48.6921 46.3078 48.7349C46.4143 48.7777 46.5282 48.799 46.6429 48.7974H47.2896C47.4033 48.8021 47.5168 48.7844 47.6236 48.7453C47.7304 48.7061 47.8284 48.6463 47.9121 48.5693C47.9958 48.4923 48.0635 48.3995 48.1114 48.2963C48.1592 48.1931 48.1863 48.0814 48.191 47.9678V47.2786C48.1872 47.1846 48.215 47.0921 48.2699 47.0158C48.3248 46.9394 48.4036 46.8836 48.4939 46.8572C49.0389 46.7232 49.5625 46.5134 50.0493 46.2339L50.1268 46.1973H50.4707L50.5365 46.2514L50.9872 46.7021C51.0677 46.7827 51.1632 46.8467 51.2684 46.8903C51.3736 46.9339 51.4864 46.9564 51.6003 46.9564C51.7142 46.9564 51.827 46.9339 51.9322 46.8903C52.0374 46.8467 52.1329 46.7827 52.2134 46.7021V46.7021L52.6699 46.2456C52.7505 46.1651 52.8145 46.0696 52.8581 45.9644C52.9017 45.8592 52.9242 45.7464 52.9242 45.6325C52.9242 45.5186 52.9017 45.4058 52.8581 45.3006C52.8145 45.1954 52.7505 45.0999 52.6699 45.0194V45.0194L52.2602 44.5687C52.2061 44.5146 52.1675 44.4469 52.1487 44.3727C52.1299 44.2986 52.1315 44.2207 52.1534 44.1473V44.0932C52.4406 43.6075 52.6569 43.0832 52.7957 42.5363V42.5012L52.8323 42.4353L52.9333 42.3827L52.9743 42.3475H53.9122C54.1421 42.3472 54.3624 42.2556 54.5248 42.0929C54.6872 41.9302 54.7784 41.7097 54.7784 41.4799V41.4799V40.678C54.7786 40.5641 54.7563 40.4513 54.7129 40.3461C54.6695 40.2408 54.6057 40.1451 54.5252 40.0646C54.4448 39.984 54.3492 39.92 54.244 39.8764C54.1388 39.8328 54.0261 39.8103 53.9122 39.8103H53.2771C53.1831 39.8144 53.0905 39.7867 53.0141 39.7318C52.9376 39.6768 52.8819 39.5978 52.8557 39.5074C52.7215 38.9629 52.5117 38.4398 52.2324 37.9535V37.8072C52.2309 37.7916 52.2309 37.7759 52.2324 37.7603V37.3887L52.6831 36.938C52.8446 36.7755 52.9353 36.5556 52.9353 36.3264C52.9353 36.0972 52.8446 35.8773 52.6831 35.7148L52.2441 35.2641C52.1638 35.1835 52.0683 35.1196 51.9633 35.076C51.8582 35.0324 51.7455 35.0099 51.6318 35.0099C51.518 35.0099 51.4053 35.0324 51.3002 35.076C51.1952 35.1196 51.0997 35.1835 51.0194 35.2641V35.2641L50.5687 35.7323C50.5087 35.7907 50.4327 35.8299 50.3503 35.8447C50.2679 35.8596 50.1829 35.8495 50.1063 35.8157H50.0405C49.555 35.5282 49.0313 35.3105 48.4851 35.169C48.2188 35.0914 48.1295 34.9905 48.1295 34.7476V34.0833C48.1297 33.8584 48.0425 33.6422 47.8863 33.4803C47.7302 33.3185 47.5173 33.2235 47.2926 33.2156H46.6766C46.5627 33.2156 46.4499 33.238 46.3447 33.2817C46.2395 33.3253 46.144 33.3892 46.0635 33.4698C45.9831 33.5504 45.9193 33.6461 45.8758 33.7513C45.8324 33.8566 45.8101 33.9694 45.8103 34.0833V34.0833V34.7242C45.8118 34.7456 45.8118 34.7671 45.8103 34.7885V34.9349C45.8103 35.03 45.5967 35.0812 45.5426 35.0944C45.0178 35.23 44.5116 35.4295 44.0354 35.6884C43.7911 35.8347 43.6199 35.8903 43.4414 35.7411H43.4121L42.9424 35.2729C42.7818 35.1218 42.5696 35.0378 42.3491 35.0378C42.1286 35.0378 41.9164 35.1218 41.7557 35.2729L41.286 35.7411C41.1236 35.9038 41.0324 36.1243 41.0324 36.3542C41.0324 36.5841 41.1236 36.8046 41.286 36.9673L41.7557 37.415C41.825 37.4928 41.8633 37.5933 41.8633 37.6974C41.8633 37.8016 41.825 37.9021 41.7557 37.9798C41.4901 38.4549 41.2902 38.9639 41.1617 39.4928V39.6713H40.0818C39.8521 39.6713 39.6317 39.7626 39.4693 39.925C39.3068 40.0875 39.2156 40.3078 39.2156 40.5375V41.2326C39.216 41.461 39.3066 41.6801 39.4677 41.8421C39.6289 42.0041 39.8475 42.0958 40.076 42.0973L40.0818 42.1968ZM46.997 38.1671C47.5521 38.1671 48.0948 38.3317 48.5564 38.6399C49.018 38.9482 49.3779 39.3864 49.5906 39.8992C49.8033 40.4119 49.8593 40.9762 49.7514 41.5207C49.6435 42.0652 49.3767 42.5656 48.9846 42.9585C48.5924 43.3514 48.0927 43.6193 47.5484 43.7283C47.0041 43.8373 46.4397 43.7825 45.9265 43.5709C45.4133 43.3593 44.9744 43.0003 44.6651 42.5393C44.3559 42.0783 44.1902 41.536 44.1891 40.9809C44.1883 40.6117 44.2604 40.2459 44.4011 39.9046C44.5419 39.5632 44.7486 39.253 45.0094 38.9916C45.2702 38.7303 45.58 38.5229 45.9211 38.3814C46.2622 38.2399 46.6278 38.1671 46.997 38.1671V38.1671Z" fill="#EBECF0"/>
<path d="M46.9968 43.0282C46.595 43.0285 46.2021 42.9096 45.8679 42.6865C45.5337 42.4635 45.2731 42.1463 45.1192 41.7752C44.9653 41.404 44.925 40.9955 45.0033 40.6014C45.0816 40.2073 45.2751 39.8453 45.5592 39.5612C45.8433 39.277 46.2053 39.0836 46.5994 39.0053C46.9936 38.9269 47.402 38.9673 47.7732 39.1212C48.1444 39.2751 48.4615 39.5356 48.6846 39.8698C48.9076 40.2041 49.0266 40.5969 49.0263 40.9987C49.0247 41.5365 48.8104 42.0518 48.4301 42.4321C48.0499 42.8124 47.5346 43.0267 46.9968 43.0282V43.0282ZM46.9968 39.1112C46.6237 39.1112 46.259 39.2217 45.9487 39.4289C45.6384 39.636 45.3965 39.9305 45.2535 40.275C45.1104 40.6196 45.0727 40.9988 45.1451 41.3648C45.2174 41.7308 45.3966 42.0672 45.66 42.3314C45.9234 42.5956 46.2592 42.7758 46.625 42.8493C46.9907 42.9228 47.3701 42.8862 47.7151 42.7443C48.0601 42.6023 48.3553 42.3613 48.5634 42.0516C48.7715 41.742 48.8832 41.3777 48.8843 41.0046C48.8851 40.7562 48.8368 40.5101 48.7423 40.2804C48.6478 40.0508 48.5089 39.842 48.3336 39.6661C48.1582 39.4902 47.9499 39.3506 47.7205 39.2554C47.4911 39.1602 47.2451 39.1112 46.9968 39.1112Z" fill="#6B6A6A"/>
<path d="M46.9969 43.8297C46.4369 43.8297 45.8895 43.6636 45.4239 43.3525C44.9582 43.0414 44.5953 42.5992 44.3811 42.0818C44.1668 41.5645 44.1107 40.9952 44.2199 40.446C44.3292 39.8967 44.5988 39.3922 44.9948 38.9963C45.3908 38.6003 45.8953 38.3306 46.4445 38.2214C46.9937 38.1121 47.563 38.1682 48.0804 38.3825C48.5977 38.5968 49.0399 38.9597 49.351 39.4253C49.6621 39.8909 49.8282 40.4383 49.8282 40.9983C49.8267 41.7488 49.5279 42.468 48.9972 42.9987C48.4666 43.5293 47.7473 43.8281 46.9969 43.8297ZM46.9969 38.3689C46.4759 38.3689 45.9667 38.5234 45.5336 38.8128C45.1005 39.1022 44.7629 39.5135 44.5636 39.9948C44.3642 40.4761 44.312 41.0056 44.4137 41.5165C44.5153 42.0275 44.7661 42.4968 45.1345 42.8651C45.5028 43.2334 45.9721 43.4843 46.483 43.5859C46.9939 43.6875 47.5235 43.6354 48.0048 43.436C48.486 43.2367 48.8974 42.8991 49.1868 42.466C49.4762 42.0329 49.6307 41.5236 49.6307 41.0027C49.6307 40.3042 49.3532 39.6343 48.8592 39.1403C48.3653 38.6464 47.6954 38.3689 46.9969 38.3689V38.3689Z" fill="#6B6A6A"/>
</svg>
