<svg width="60" height="60" viewBox="0 0 60 60" fill="none" xmlns="http://www.w3.org/2000/svg">
<path d="M40.1413 49.367C40.1413 49.8178 39.8974 50.3078 39.5979 50.3078H18.5464C18.244 50.3078 18.0001 49.8178 18 49.367C17.9999 48.9163 18.4513 48.4263 18.7538 48.4263L39.4073 48.4263C39.7068 48.424 40.1413 48.9162 40.1413 49.367Z" fill="#45494D"/>
<path d="M19.5018 47.5854C19.5379 47.5552 19.5835 47.5386 19.6307 47.5386H38.8051C38.8585 47.5386 38.9096 47.5598 38.9471 47.5975L40.0955 48.7505C40.2206 48.8761 40.1312 49.0894 39.9535 49.0894H18.2557C18.0693 49.0894 17.9843 48.858 18.1268 48.7384L19.5018 47.5854Z" fill="url(#paint0_linear_447_3081)"/>
<rect x="26.3077" y="42.9231" width="5.53846" height="5.53846" fill="url(#paint1_linear_447_3081)"/>
<path d="M6.9231 11.3008C6.9231 10.9223 7.22761 10.6155 7.60326 10.6155H52.3968C52.7724 10.6155 53.0769 10.9223 53.0769 11.3008V42.2379C53.0769 42.6163 52.7724 42.9232 52.3968 42.9232H7.60326C7.22761 42.9232 6.9231 42.6163 6.9231 42.2379V11.3008Z" fill="url(#paint2_linear_447_3081)"/>
<path fill-rule="evenodd" clip-rule="evenodd" d="M7.64848 9.69238H52.3515C53.2619 9.69238 54 10.4351 54 11.3513V42.1873C54 43.1035 53.2619 43.8462 52.3515 43.8462H7.64848C6.73805 43.8462 6 43.1035 6 42.1873V11.3513C6 10.4351 6.73805 9.69238 7.64848 9.69238ZM7.64848 10.6682C7.2736 10.6682 6.9697 10.974 6.9697 11.3513V42.1873C6.9697 42.5646 7.2736 42.8704 7.64848 42.8704H52.3515C52.7264 42.8704 53.0303 42.5646 53.0303 42.1873V11.3513C53.0303 10.974 52.7264 10.6682 52.3515 10.6682H7.64848Z" fill="#243438"/>
<path d="M30.6301 31.2831C37.8207 35.8375 44.8455 38.9387 52.1539 40.8145V11.9959C52.1539 11.7461 51.8551 11.5386 51.5002 11.5386H12.0383C16.0918 19.6134 23.0678 26.4941 30.6317 31.2831H30.6301ZM30.6878 36.1195C22.0119 31.1239 13.3257 24.2042 7.84619 15.6594V41.5428C7.84619 41.7935 8.14179 42.0001 8.49668 42.0001H43.595C39.3075 40.5393 35.0321 38.6245 30.6894 36.1229" fill="#EEFAFF" fill-opacity="0.1"/>
<defs>
<linearGradient id="paint0_linear_447_3081" x1="29.0592" y1="47.5386" x2="29.0592" y2="48.9526" gradientUnits="userSpaceOnUse">
<stop stop-color="#C5CED5"/>
<stop offset="1" stop-color="#C6CED6"/>
</linearGradient>
<linearGradient id="paint1_linear_447_3081" x1="29.077" y1="42.9231" x2="29.077" y2="48.4616" gradientUnits="userSpaceOnUse">
<stop stop-color="#AEAEAE"/>
<stop offset="1" stop-color="#BFBEBE"/>
</linearGradient>
<linearGradient id="paint2_linear_447_3081" x1="6.9231" y1="10.6155" x2="52.6773" y2="43.0859" gradientUnits="userSpaceOnUse">
<stop stop-color="#96E6FF"/>
<stop offset="1" stop-color="#28A6DE"/>
</linearGradient>
</defs>
</svg>
