<svg width="60" height="60" viewBox="0 0 60 60" fill="none" xmlns="http://www.w3.org/2000/svg">
<path d="M7 10.68C7 8.6476 8.6476 7 10.68 7H15.857H49.32C51.3524 7 53 8.6476 53 10.68V49.3198C53 51.3522 51.3524 52.9998 49.32 52.9998H10.68C8.6476 52.9998 7 51.3522 7 49.3198V12.9046V10.68Z" fill="url(#paint0_linear_447_2912)"/>
<rect x="14.3601" y="11.6001" width="30.36" height="34.04" rx="1.84001" fill="#FFF7DD" fill-opacity="0.5"/>
<rect x="11.6001" y="15.28" width="35.88" height="36.7998" rx="1.84001" fill="#FFFFFD"/>
<g filter="url(#filter0_b_447_2912)">
<path d="M7 24.4769C7 23.4623 7.82245 22.6399 8.83699 22.6399H15.857H51.163C52.1776 22.6399 53 23.4623 53 24.4769V51.1629C53 52.1774 52.1776 52.9999 51.163 52.9999H8.83699C7.82245 52.9999 7 52.1774 7 51.1629V28.4855V24.4769Z" fill="url(#paint1_linear_447_2912)" fill-opacity="0.8"/>
</g>
<path d="M29.54 38.4891C30.686 38.4891 31.8064 38.1323 32.7593 37.4637C33.7122 36.7951 34.4549 35.8448 34.8934 34.733C35.332 33.6212 35.4467 32.3978 35.2232 31.2176C34.9996 30.0373 34.4477 28.9531 33.6373 28.1022C32.827 27.2513 31.7945 26.6718 30.6705 26.437C29.5464 26.2022 28.3814 26.3227 27.3225 26.7832C26.2637 27.2438 25.3588 28.0236 24.7221 29.0242C24.0853 30.0248 23.7455 31.2012 23.7455 32.4046C23.7455 34.0183 24.356 35.5659 25.4427 36.707C26.5294 37.8481 28.0032 38.4891 29.54 38.4891ZM29.54 41.3283C24.2049 41.3283 19.88 43.1172 19.88 45.3229C19.88 47.5285 24.2049 49.3201 29.54 49.3201C34.8751 49.3201 39.2 47.5311 39.2 45.3255C39.2 43.1199 34.8751 41.3283 29.54 41.3283Z" fill="url(#paint2_linear_447_2912)"/>
<defs>
<filter id="filter0_b_447_2912" x="3.62593" y="19.2658" width="52.7481" height="37.1082" filterUnits="userSpaceOnUse" color-interpolation-filters="sRGB">
<feFlood flood-opacity="0" result="BackgroundImageFix"/>
<feGaussianBlur in="BackgroundImage" stdDeviation="1.68703"/>
<feComposite in2="SourceAlpha" operator="in" result="effect1_backgroundBlur_447_2912"/>
<feBlend mode="normal" in="SourceGraphic" in2="effect1_backgroundBlur_447_2912" result="shape"/>
</filter>
<linearGradient id="paint0_linear_447_2912" x1="41.8833" y1="7.8493" x2="41.1945" y2="51.4807" gradientUnits="userSpaceOnUse">
<stop offset="0.0001" stop-color="#14CCBC"/>
<stop offset="0.51875" stop-color="#34D8C7"/>
<stop offset="1" stop-color="#5AE7D6"/>
</linearGradient>
<linearGradient id="paint1_linear_447_2912" x1="31.0303" y1="23.182" x2="29.9281" y2="51.8734" gradientUnits="userSpaceOnUse">
<stop stop-color="#8FF1E6"/>
<stop offset="0.51875" stop-color="#58D1C5"/>
<stop offset="1" stop-color="#24A69A"/>
</linearGradient>
<linearGradient id="paint2_linear_447_2912" x1="29.54" y1="26.3201" x2="29.54" y2="49.3201" gradientUnits="userSpaceOnUse">
<stop stop-color="white"/>
<stop offset="1" stop-color="white" stop-opacity="0.8"/>
</linearGradient>
</defs>
</svg>
