<svg width="60" height="60" viewBox="0 0 60 60" fill="none" xmlns="http://www.w3.org/2000/svg">
<path d="M25.0812 3C24.6597 3 24.2554 3.20299 23.9574 3.56432C23.6593 3.92565 23.4918 4.41572 23.4918 4.92671V7.78592H14.5894C14.1679 7.78592 13.7636 7.98891 13.4655 8.35024C13.1675 8.71157 13 9.20164 13 9.71263V53.0733C13 53.5843 13.1675 54.0744 13.4655 54.4357C13.7636 54.797 14.1679 55 14.5894 55H46.4106C46.8321 55 47.2364 54.797 47.5345 54.4357C47.8325 54.0744 48 53.5843 48 53.0733V9.71263C48 9.20164 47.8325 8.71157 47.5345 8.35024C47.2364 7.98891 46.8321 7.78592 46.4106 7.78592H37.5082V4.92671C37.5082 4.41572 37.3407 3.92565 37.0426 3.56432C36.7446 3.20299 36.3403 3 35.9188 3H25.0812Z" fill="url(#paint0_linear_447_2581)"/>
<path d="M13 14.2951C13 13.687 13.1674 13.1038 13.4654 12.6734C13.7634 12.2431 14.1676 12.0009 14.5894 12H46.4106C46.8324 12.0009 47.2366 12.2431 47.5346 12.6734C47.8326 13.1038 48 13.687 48 14.2951V48.7049C48 49.313 47.8326 49.8962 47.5346 50.3266C47.2366 50.7569 46.8324 50.9991 46.4106 51H14.5894C14.1676 50.9991 13.7634 50.7569 13.4654 50.3266C13.1674 49.8962 13 49.313 13 48.7049V14.2951Z" fill="url(#paint1_linear_447_2581)"/>
<g filter="url(#filter0_d_447_2581)">
<path d="M34.0731 30.1405C33.5807 30.1398 33.1088 29.9437 32.761 29.5953C32.4131 29.2469 32.2177 28.7747 32.2177 28.2824V19.9249C32.2166 19.7306 32.1546 19.5415 32.0405 19.3842C31.9264 19.2269 31.7659 19.1092 31.5815 19.0477C31.3971 18.9863 31.1981 18.9841 31.0125 19.0415C30.8268 19.0989 30.6637 19.213 30.5462 19.3678L22.1888 30.511C22.0842 30.6485 22.0202 30.8125 22.0041 30.9845C21.9879 31.1564 22.0202 31.3295 22.0973 31.484C22.1745 31.6385 22.2933 31.7684 22.4404 31.8589C22.5876 31.9493 22.7571 31.9968 22.9298 31.9959H26.6461C27.1384 31.9966 27.6103 32.1927 27.9582 32.5411C28.306 32.8895 28.5014 33.3617 28.5014 33.854V42.2114C28.5026 42.4058 28.5646 42.5949 28.6787 42.7522C28.7928 42.9095 28.9533 43.0272 29.1376 43.0886C29.322 43.1501 29.521 43.1523 29.7067 43.0949C29.8923 43.0375 30.0554 42.9234 30.1729 42.7686L38.5304 31.6254C38.6349 31.4879 38.6989 31.3239 38.7151 31.1519C38.7312 30.98 38.6989 30.8069 38.6218 30.6524C38.5447 30.4979 38.4258 30.368 38.2787 30.2775C38.1316 30.1871 37.962 30.1396 37.7893 30.1405H34.0731Z" fill="url(#paint2_linear_447_2581)" shape-rendering="crispEdges"/>
</g>
<defs>
<filter id="filter0_d_447_2581" x="20" y="17" width="20.7192" height="28.1365" filterUnits="userSpaceOnUse" color-interpolation-filters="sRGB">
<feFlood flood-opacity="0" result="BackgroundImageFix"/>
<feColorMatrix in="SourceAlpha" type="matrix" values="0 0 0 0 0 0 0 0 0 0 0 0 0 0 0 0 0 0 127 0" result="hardAlpha"/>
<feOffset/>
<feGaussianBlur stdDeviation="1"/>
<feComposite in2="hardAlpha" operator="out"/>
<feColorMatrix type="matrix" values="0 0 0 0 0 0 0 0 0 0 0 0 0 0 0 0 0 0 0.25 0"/>
<feBlend mode="normal" in2="BackgroundImageFix" result="effect1_dropShadow_447_2581"/>
<feBlend mode="normal" in="SourceGraphic" in2="effect1_dropShadow_447_2581" result="shape"/>
</filter>
<linearGradient id="paint0_linear_447_2581" x1="16.6613" y1="4.8835" x2="55.8077" y2="48.0989" gradientUnits="userSpaceOnUse">
<stop stop-color="#5B6976"/>
<stop offset="1" stop-color="#3F4A54"/>
</linearGradient>
<linearGradient id="paint1_linear_447_2581" x1="18.0342" y1="11.7815" x2="57.1127" y2="36.7994" gradientUnits="userSpaceOnUse">
<stop stop-color="#FFAA44"/>
<stop offset="1" stop-color="#FF5A44"/>
</linearGradient>
<linearGradient id="paint2_linear_447_2581" x1="26.4925" y1="23.1179" x2="36.1088" y2="42.8847" gradientUnits="userSpaceOnUse">
<stop stop-color="white"/>
<stop offset="1" stop-color="white" stop-opacity="0.5"/>
</linearGradient>
</defs>
</svg>
