<svg width="60" height="60" viewBox="0 0 60 60" fill="none" xmlns="http://www.w3.org/2000/svg">
<rect x="7" y="7" width="40" height="40" rx="3" fill="#313FA0"/>
<path d="M13 50.1423V15.8553C13 15.098 13.3008 14.3718 13.8363 13.8363C14.3718 13.3008 15.098 13 15.8553 13H50.1423C50.5174 12.9997 50.889 13.0733 51.2357 13.2166C51.5825 13.3599 51.8975 13.5702 52.1629 13.8354C52.4284 14.1005 52.6389 14.4154 52.7826 14.762C52.9262 15.1086 53.0002 15.4801 53.0002 15.8553V50.1423C53.0002 50.9002 52.6991 51.6271 52.1631 52.1631C51.6271 52.6991 50.9002 53.0002 50.1423 53.0002H15.8553C15.4801 53.0002 15.1086 52.9262 14.762 52.7826C14.4154 52.6389 14.1005 52.4284 13.8354 52.1629C13.5702 51.8975 13.3599 51.5825 13.2166 51.2357C13.0733 50.889 12.9997 50.5174 13 50.1423V50.1423Z" fill="#E1F5FF"/>
<path d="M52.9999 21.7487H13V15.8553C13 15.098 13.3008 14.3718 13.8363 13.8363C14.3718 13.3008 15.098 13 15.8553 13H50.142C50.5172 12.9997 50.8888 13.0733 51.2355 13.2166C51.5822 13.3599 51.8973 13.5702 52.1627 13.8354C52.4281 14.1005 52.6387 14.4154 52.7823 14.762C52.926 15.1086 52.9999 15.4801 52.9999 15.8553V21.7487Z" fill="#8C9EFF"/>
<path d="M36.0199 30.1499H22.183C21.6824 30.1499 21.2024 30.3487 20.8484 30.7027C20.4945 31.0566 20.2957 31.5367 20.2957 32.0372C20.2957 32.5378 20.4945 33.0178 20.8484 33.3718C21.2024 33.7257 21.6824 33.9246 22.183 33.9246H36.0199C36.5204 33.9246 37.0005 33.7257 37.3544 33.3718C37.7084 33.0178 37.9072 32.5378 37.9072 32.0372C37.9072 31.5367 37.7084 31.0566 37.3544 30.7027C37.0005 30.3487 36.5204 30.1499 36.0199 30.1499V30.1499ZM43.5665 40.6327H22.183C21.695 40.6509 21.233 40.8576 20.8942 41.2093C20.5554 41.561 20.3661 42.0304 20.3661 42.5187C20.3661 43.0071 20.5554 43.4764 20.8942 43.8281C21.233 44.1798 21.695 44.3865 22.183 44.4047H43.5665C43.8201 44.4142 44.073 44.3724 44.3101 44.2819C44.5472 44.1914 44.7636 44.054 44.9464 43.8779C45.1291 43.7019 45.2745 43.4907 45.3738 43.2572C45.4731 43.0237 45.5243 42.7725 45.5243 42.5187C45.5243 42.2649 45.4731 42.0138 45.3738 41.7802C45.2745 41.5467 45.1291 41.3356 44.9464 41.1595C44.7636 40.9834 44.5472 40.846 44.3101 40.7555C44.073 40.665 43.8201 40.6232 43.5665 40.6327Z" fill="#FFD600"/>
<rect x="15.6245" y="15.6245" width="3.49947" height="3.49947" rx="0.874868" fill="#F35E5E"/>
<rect x="26.123" y="15.6245" width="3.49947" height="3.49947" rx="0.874868" fill="#90EF7A"/>
<rect x="20.8738" y="15.6245" width="3.49947" height="3.49947" rx="0.874868" fill="#F8DF5C"/>
</svg>
