<svg width="60" height="60" viewBox="0 0 60 60" fill="none" xmlns="http://www.w3.org/2000/svg">
<path d="M9.98138 13.9693C9.98138 13.1769 10.2962 12.4169 10.8565 11.8565C11.4169 11.2962 12.1769 10.9814 12.9693 10.9814H45.8588V7.99069C45.8591 7.59808 45.7821 7.20924 45.6321 6.84641C45.4821 6.48358 45.2621 6.15387 44.9846 5.87612C44.7071 5.59837 44.3776 5.37804 44.0149 5.22771C43.6522 5.07738 43.2634 5 42.8708 5H6.99069C6.19751 5 5.43682 5.31509 4.87595 5.87595C4.31509 6.43682 4 7.19751 4 7.99069V43.8708C4 44.2634 4.07738 44.6522 4.22771 45.0149C4.37804 45.3776 4.59837 45.7071 4.87612 45.9846C5.15387 46.2621 5.48358 46.4821 5.84641 46.6321C6.20924 46.7821 6.59808 46.8591 6.99069 46.8588H9.98138V13.9693Z" fill="#313FA0"/>
<path d="M9.9812 49.8492V13.9691C9.9812 13.1767 10.296 12.4167 10.8564 11.8563C11.4167 11.296 12.1767 10.9812 12.9692 10.9812H48.8493C49.2419 10.9808 49.6307 11.0578 49.9936 11.2078C50.3564 11.3578 50.6861 11.5779 50.9638 11.8554C51.2416 12.1329 51.4619 12.4624 51.6123 12.8251C51.7626 13.1878 51.84 13.5765 51.84 13.9691V49.8492C51.84 50.6424 51.5249 51.4031 50.964 51.964C50.4031 52.5248 49.6424 52.8399 48.8493 52.8399H12.9692C12.5765 52.8399 12.1878 52.7626 11.8251 52.6122C11.4624 52.4619 11.1329 52.2416 10.8554 51.9638C10.5779 51.6861 10.3579 51.3564 10.2079 50.9935C10.0579 50.6307 9.98084 50.2419 9.9812 49.8492V49.8492Z" fill="#E1F5FF"/>
<path d="M51.84 20.1364H9.9812V13.9691C9.9812 13.1767 10.296 12.4167 10.8564 11.8563C11.4167 11.296 12.1767 10.9812 12.9692 10.9812H48.8493C49.2419 10.9808 49.6307 11.0578 49.9935 11.2078C50.3564 11.3578 50.6861 11.5779 50.9638 11.8554C51.2416 12.1329 51.4619 12.4624 51.6123 12.8251C51.7626 13.1878 51.84 13.5765 51.84 13.9691V20.1364Z" fill="#8C9EFF"/>
<path d="M13.9043 15.5576C13.9038 15.8167 13.9801 16.0701 14.1237 16.2858C14.2672 16.5015 14.4715 16.6698 14.7108 16.7693C14.95 16.8689 15.2133 16.8952 15.4675 16.845C15.7217 16.7947 15.9553 16.6703 16.1387 16.4872C16.3221 16.3042 16.4471 16.0709 16.4978 15.8168C16.5486 15.5627 16.5228 15.2993 16.4238 15.0599C16.3248 14.8204 16.1569 14.6158 15.9415 14.4718C15.7261 14.3278 15.4729 14.2509 15.2138 14.2509C15.0419 14.2505 14.8717 14.2841 14.7129 14.3496C14.554 14.4151 14.4096 14.5113 14.288 14.6326C14.1664 14.754 14.0699 14.8982 14.004 15.0569C13.9382 15.2156 13.9043 15.3858 13.9043 15.5576V15.5576Z" fill="#FF4343"/>
<path d="M17.8298 15.5576C17.8293 15.8168 17.9057 16.0704 18.0494 16.2861C18.1931 16.5019 18.3975 16.6701 18.6369 16.7696C18.8763 16.869 19.1398 16.8952 19.3941 16.8448C19.6483 16.7943 19.8819 16.6696 20.0652 16.4863C20.2485 16.303 20.3733 16.0694 20.4237 15.8151C20.4742 15.5609 20.448 15.2974 20.3485 15.058C20.2491 14.8186 20.0808 14.6141 19.8651 14.4704C19.6493 14.3268 19.3958 14.2503 19.1366 14.2509C18.79 14.2509 18.4576 14.3886 18.2126 14.6336C17.9675 14.8787 17.8298 15.211 17.8298 15.5576V15.5576Z" fill="#FFD600"/>
<path d="M21.7527 15.5576C21.7521 15.8167 21.8285 16.0701 21.972 16.2858C22.1156 16.5015 22.3199 16.6698 22.5591 16.7693C22.7984 16.8689 23.0617 16.8952 23.3159 16.845C23.5701 16.7947 23.8037 16.6703 23.9871 16.4872C24.1705 16.3042 24.2955 16.0709 24.3462 15.8168C24.397 15.5627 24.3712 15.2993 24.2722 15.0599C24.1731 14.8204 24.0053 14.6158 23.7899 14.4718C23.5745 14.3278 23.3212 14.2509 23.0621 14.2509C22.8903 14.2505 22.7201 14.2841 22.5612 14.3496C22.4024 14.4151 22.258 14.5113 22.1364 14.6326C22.0148 14.754 21.9183 14.8982 21.8524 15.0569C21.7866 15.2156 21.7527 15.3858 21.7527 15.5576V15.5576Z" fill="#65FF40"/>
<path d="M34.18 29.0756H19.7897C19.2691 29.0756 18.7699 29.2824 18.4018 29.6505C18.0337 30.0186 17.8269 30.5179 17.8269 31.0384C17.8269 31.559 18.0337 32.0583 18.4018 32.4264C18.7699 32.7945 19.2691 33.0012 19.7897 33.0012H34.18C34.7006 33.0012 35.1999 32.7945 35.5679 32.4264C35.936 32.0583 36.1428 31.559 36.1428 31.0384C36.1428 30.5179 35.936 30.0186 35.5679 29.6505C35.1999 29.2824 34.7006 29.0756 34.18 29.0756V29.0756ZM42.0285 39.9777H19.7897C19.2822 39.9967 18.8017 40.2116 18.4494 40.5774C18.097 40.9431 17.9001 41.4313 17.9001 41.9392C17.9001 42.447 18.097 42.9352 18.4494 43.3009C18.8017 43.6667 19.2822 43.8816 19.7897 43.9006H42.0285C42.2923 43.9104 42.5553 43.867 42.8019 43.7729C43.0484 43.6787 43.2735 43.5358 43.4636 43.3527C43.6536 43.1696 43.8048 42.9501 43.9081 42.7072C44.0114 42.4643 44.0646 42.2031 44.0646 41.9392C44.0646 41.6752 44.0114 41.414 43.9081 41.1711C43.8048 40.9282 43.6536 40.7087 43.4636 40.5256C43.2735 40.3425 43.0484 40.1996 42.8019 40.1054C42.5553 40.0113 42.2923 39.9679 42.0285 39.9777Z" fill="#FFD600"/>
<path d="M39.8823 46.7714C39.8823 48.3653 40.355 49.9234 41.2405 51.2487C42.126 52.574 43.3846 53.6069 44.8572 54.2169C46.3298 54.8268 47.9502 54.9864 49.5134 54.6755C51.0767 54.3645 52.5127 53.597 53.6397 52.4699C54.7668 51.3429 55.5343 49.9069 55.8453 48.3436C56.1562 46.7804 55.9966 45.16 55.3867 43.6874C54.7767 42.2148 53.7438 40.9562 52.4185 40.0707C51.0932 39.1852 49.5351 38.7125 47.9412 38.7125C45.8039 38.7125 43.7541 39.5616 42.2427 41.0729C40.7314 42.5843 39.8823 44.6341 39.8823 46.7714V46.7714Z" fill="#C9CBD2"/>
<path d="M41.1108 46.7717C41.1108 48.1224 41.5114 49.4428 42.2618 50.5659C43.0122 51.689 44.0788 52.5643 45.3268 53.0812C46.5747 53.5981 47.9478 53.7334 49.2726 53.4699C50.5974 53.2064 51.8143 52.5559 52.7694 51.6008C53.7245 50.6457 54.3749 49.4288 54.6385 48.104C54.902 46.7793 54.7667 45.4061 54.2498 44.1582C53.7329 42.9103 52.8576 41.8437 51.7345 41.0932C50.6114 40.3428 49.291 39.9423 47.9403 39.9423C46.129 39.9423 44.3919 40.6618 43.1111 41.9426C41.8304 43.2233 41.1108 44.9604 41.1108 46.7717V46.7717Z" fill="#57555E"/>
<path d="M47.9401 53.641C46.5794 53.641 45.2494 53.2376 44.118 52.4816C42.9867 51.7257 42.1049 50.6513 41.5842 49.3942C41.0635 48.1371 40.9273 46.7539 41.1927 45.4194C41.4582 44.0849 42.1134 42.8591 43.0755 41.8969C44.0376 40.9348 45.2635 40.2796 46.598 40.0141C47.9325 39.7487 49.3157 39.8849 50.5728 40.4056C51.8298 40.9263 52.9043 41.8081 53.6602 42.9394C54.4162 44.0708 54.8196 45.4009 54.8196 46.7615V46.7694C54.816 48.5921 54.0898 50.339 52.8002 51.6271C51.5106 52.9153 49.7628 53.6395 47.9401 53.641V53.641ZM47.9401 39.993C46.5989 39.993 45.2878 40.3907 44.1726 41.1359C43.0575 41.881 42.1883 42.9401 41.675 44.1792C41.1618 45.4183 41.0275 46.7818 41.2891 48.0972C41.5508 49.4127 42.1966 50.621 43.145 51.5694C44.0934 52.5177 45.3017 53.1636 46.6171 53.4252C47.9326 53.6869 49.2961 53.5526 50.5352 53.0393C51.7743 52.5261 52.8334 51.6569 53.5785 50.5417C54.3236 49.4266 54.7214 48.1155 54.7214 46.7743C54.7214 44.9758 54.0069 43.2509 52.7352 41.9792C51.4634 40.7075 49.7386 39.993 47.9401 39.993V39.993Z" fill="#6B6A6A"/>
<path d="M46.6008 46.7713C46.6008 47.1266 46.742 47.4673 46.9932 47.7185C47.2444 47.9697 47.5851 48.1109 47.9404 48.1109C48.2956 48.1109 48.6364 47.9697 48.8876 47.7185C49.1388 47.4673 49.2799 47.1266 49.2799 46.7713V46.7713C49.2799 46.5954 49.2453 46.4212 49.178 46.2587C49.1106 46.0962 49.012 45.9485 48.8876 45.8241C48.7632 45.6997 48.6155 45.601 48.453 45.5337C48.2905 45.4664 48.1163 45.4318 47.9404 45.4318C47.7645 45.4318 47.5903 45.4664 47.4278 45.5337C47.2652 45.601 47.1176 45.6997 46.9932 45.8241C46.8688 45.9485 46.7701 46.0962 46.7028 46.2587C46.6355 46.4212 46.6008 46.5954 46.6008 46.7713V46.7713Z" fill="#EBECF0"/>
<path d="M43.1561 47.592H43.7458L43.7743 47.6127L43.8018 47.6481L43.8254 47.6962V47.7237C43.9397 48.1359 44.1175 48.5278 44.3522 48.8854V48.9247C44.357 48.9553 44.357 48.9865 44.3522 49.0171C44.3521 49.0963 44.3206 49.1723 44.2647 49.2284L43.9532 49.5389C43.8413 49.6511 43.7785 49.8031 43.7785 49.9615C43.7785 50.12 43.8413 50.272 43.9532 50.3841L44.2686 50.6996C44.3808 50.8115 44.5328 50.8743 44.6912 50.8743C44.8497 50.8743 45.0016 50.8115 45.1138 50.6996L45.4244 50.3881L45.4647 50.3606H45.7595C46.0971 50.5595 46.461 50.7097 46.8406 50.8068C46.9017 50.8248 46.9552 50.8621 46.9933 50.9131C47.0314 50.9641 47.052 51.0261 47.0519 51.0898V51.5281C47.0514 51.6863 47.1135 51.8383 47.2248 51.9509C47.336 52.0634 47.4873 52.1273 47.6455 52.1286H48.0956C48.2537 52.1276 48.4049 52.0641 48.5163 51.9519C48.6277 51.8398 48.6902 51.6881 48.6902 51.5301V51.0918C48.6899 51.0286 48.7099 50.967 48.7472 50.916C48.7846 50.8651 48.8373 50.8275 48.8976 50.8087C49.272 50.7097 49.6306 50.5585 49.9629 50.3596L50.015 50.335H50.1978L50.2381 50.3556L50.2853 50.395L50.5968 50.7065C50.709 50.8184 50.861 50.8812 51.0194 50.8812C51.1779 50.8812 51.3298 50.8184 51.442 50.7065L51.7565 50.391C51.8122 50.3356 51.8563 50.2697 51.8864 50.1972C51.9165 50.1247 51.932 50.047 51.932 49.9684C51.932 49.8899 51.9165 49.8122 51.8864 49.7396C51.8563 49.6671 51.8122 49.6013 51.7565 49.5458L51.5777 49.251C51.5387 49.2122 51.5113 49.1634 51.4986 49.1099C51.4859 49.0564 51.4885 49.0004 51.5059 48.9483V48.9119C51.7045 48.5774 51.8548 48.2164 51.9521 47.8397V47.8122L51.9767 47.764L52.0042 47.7277L52.0317 47.7041H52.7197C52.8776 47.7033 53.0289 47.64 53.1403 47.528C53.2517 47.416 53.3143 47.2645 53.3143 47.1065V46.5434C53.3117 46.387 53.2481 46.2377 53.137 46.1275C53.0259 46.0174 52.8761 45.955 52.7197 45.9537H52.2813C52.2183 45.9526 52.1572 45.9313 52.1071 45.8929C52.0571 45.8545 52.0207 45.8011 52.0032 45.7405C51.8983 45.3553 51.7384 44.9872 51.5285 44.6476V44.3272L51.5482 44.3036L51.8597 43.9921C51.9716 43.8799 52.0344 43.7279 52.0344 43.5695C52.0344 43.411 51.9716 43.2591 51.8597 43.1469L51.5442 42.8324C51.4888 42.7768 51.423 42.7326 51.3504 42.7025C51.2779 42.6724 51.2002 42.6569 51.1216 42.6569C51.0431 42.6569 50.9654 42.6724 50.8928 42.7025C50.8203 42.7326 50.7545 42.7768 50.699 42.8324L50.3885 43.1429C50.3493 43.1828 50.2996 43.2108 50.2451 43.2235C50.1906 43.2362 50.1337 43.2331 50.0809 43.2147H50.0376C49.703 43.0162 49.342 42.866 48.9654 42.7685C48.7816 42.7125 48.7217 42.6447 48.7177 42.4737V42.0383C48.7157 41.8812 48.6518 41.7312 48.54 41.6208C48.4281 41.5105 48.2773 41.4486 48.1202 41.4486H47.7133C47.5562 41.4507 47.4062 41.5145 47.2959 41.6264C47.1855 41.7382 47.1236 41.889 47.1237 42.0461V42.4855C47.1246 42.4999 47.1246 42.5143 47.1237 42.5287V42.6407H47.1001L47.0558 42.6643H47.0283C46.6622 42.7571 46.3104 42.8992 45.9826 43.0869C45.9282 43.1369 45.857 43.1647 45.7831 43.1647C45.7092 43.1647 45.638 43.1369 45.5836 43.0869L45.1473 42.8196C45.0351 42.7077 44.8831 42.6449 44.7247 42.6449C44.5662 42.6449 44.4143 42.7077 44.3021 42.8196L43.9876 43.1351C43.9319 43.1905 43.8878 43.2564 43.8577 43.3289C43.8276 43.4014 43.8121 43.4792 43.8121 43.5577C43.8121 43.6362 43.8276 43.714 43.8577 43.7865C43.8878 43.859 43.9319 43.9249 43.9876 43.9803L44.2981 44.2908C44.3509 44.3427 44.3822 44.4126 44.3858 44.4865C44.3895 44.5604 44.3652 44.633 44.3178 44.6899C44.1298 45.016 43.987 45.3661 43.8932 45.7306V45.8289H43.1561C42.9979 45.8299 42.8465 45.8936 42.7351 46.0059C42.6237 46.1183 42.5613 46.2702 42.5615 46.4284V46.8746C42.5309 47.0303 42.5634 47.1919 42.6519 47.3236C42.7404 47.4554 42.8775 47.5467 43.0333 47.5773C43.0736 47.5866 43.1148 47.5916 43.1561 47.592V47.592ZM47.9404 44.8333C48.3237 44.8333 48.6984 44.947 49.0171 45.16C49.3358 45.3729 49.5842 45.6756 49.7309 46.0297C49.8776 46.3839 49.916 46.7736 49.8412 47.1495C49.7664 47.5255 49.5818 47.8708 49.3108 48.1418C49.0397 48.4129 48.6944 48.5975 48.3184 48.6722C47.9425 48.747 47.5528 48.7086 47.1987 48.5619C46.8446 48.4153 46.5419 48.1669 46.3289 47.8481C46.116 47.5294 46.0023 47.1547 46.0023 46.7714C46.0023 46.5169 46.0524 46.2649 46.1498 46.0297C46.2472 45.7946 46.39 45.581 46.5699 45.401C46.7499 45.221 46.9635 45.0783 47.1987 44.9809C47.4338 44.8835 47.6858 44.8333 47.9404 44.8333V44.8333Z" fill="#EBECF0"/>
<path d="M47.9402 48.1667C47.6642 48.1667 47.3944 48.0849 47.1649 47.9315C46.9354 47.7782 46.7565 47.5602 46.6509 47.3052C46.5453 47.0502 46.5176 46.7696 46.5715 46.4989C46.6253 46.2282 46.7583 45.9795 46.9534 45.7844C47.1486 45.5892 47.3973 45.4563 47.668 45.4024C47.9387 45.3486 48.2193 45.3762 48.4743 45.4818C48.7293 45.5875 48.9473 45.7663 49.1006 45.9958C49.254 46.2253 49.3358 46.4952 49.3358 46.7712C49.3355 47.1412 49.1884 47.496 48.9268 47.7577C48.6651 48.0194 48.3103 48.1665 47.9402 48.1667V48.1667ZM47.9402 45.4827C47.6793 45.4676 47.4199 45.532 47.1964 45.6675C46.9729 45.8031 46.7959 46.0032 46.6886 46.2416C46.5814 46.48 46.5491 46.7453 46.596 47.0024C46.6429 47.2596 46.7667 47.4964 46.9512 47.6816C47.1356 47.8668 47.3719 47.9916 47.6289 48.0395C47.8858 48.0874 48.1513 48.0562 48.3901 47.9499C48.6289 47.8437 48.8298 47.6674 48.9662 47.4445C49.1026 47.2215 49.1681 46.9624 49.154 46.7014C49.1375 46.3844 49.0045 46.0846 48.7805 45.8597C48.5564 45.6347 48.2572 45.5005 47.9402 45.4827Z" fill="#666666"/>
<path d="M47.7171 52.1897C47.6317 52.1897 47.5472 52.1729 47.4683 52.1402C47.3894 52.1075 47.3177 52.0595 47.2574 51.9991C47.1971 51.9387 47.1492 51.8669 47.1167 51.788C47.0841 51.7091 47.0674 51.6245 47.0675 51.5391V51.0998C47.0675 51.0479 47.0508 50.9974 47.0198 50.9558C46.9888 50.9142 46.9452 50.8837 46.8955 50.8688C46.5157 50.7705 46.1518 50.619 45.8144 50.4187L45.7663 50.3981H45.5599L45.5284 50.4226L45.2169 50.7332C45.0943 50.8545 44.9289 50.9225 44.7564 50.9225C44.584 50.9225 44.4186 50.8545 44.296 50.7332L43.953 50.4502C43.8317 50.3276 43.7637 50.1622 43.7637 49.9897C43.7637 49.8173 43.8317 49.6518 43.953 49.5293L44.2626 49.2197C44.2903 49.1852 44.3109 49.1456 44.3232 49.1031C44.3356 49.0605 44.3393 49.016 44.3343 48.972V48.9318C44.1337 48.5945 43.9819 48.2305 43.8832 47.8507V47.831L43.8636 47.7947L43.8361 47.7632H43.156C42.9837 47.7632 42.8184 47.6948 42.6966 47.5729C42.5748 47.4511 42.5063 47.2859 42.5063 47.1136V46.5485C42.5062 46.4631 42.5229 46.3785 42.5555 46.2996C42.5881 46.2206 42.6359 46.1489 42.6963 46.0885C42.7566 46.0281 42.8283 45.9801 42.9071 45.9474C42.986 45.9147 43.0706 45.8979 43.156 45.8979H43.7221L43.7496 45.8782V45.8389C43.8456 45.4658 43.9917 45.1074 44.184 44.7736C44.2238 44.7293 44.2459 44.6719 44.2459 44.6124C44.2459 44.5528 44.2238 44.4954 44.184 44.4512L43.8695 44.1318C43.7482 44.0092 43.6801 43.8438 43.6801 43.6714C43.6801 43.4989 43.7482 43.3335 43.8695 43.2109L44.184 42.8954C44.3067 42.7741 44.4723 42.706 44.6449 42.706C44.8175 42.706 44.9831 42.7741 45.1058 42.8954L45.4164 43.207C45.458 43.2499 45.514 43.276 45.5736 43.2803C45.6332 43.2847 45.6923 43.267 45.7397 43.2306C46.0715 43.0367 46.4283 42.8893 46.8002 42.7923H46.8277L46.8719 42.7687L46.8916 42.7362V42.6841C46.8925 42.6711 46.8925 42.6579 46.8916 42.6448V42.2026C46.8914 42.1172 46.9081 42.0326 46.9407 41.9537C46.9733 41.8747 47.0212 41.803 47.0815 41.7426C47.1418 41.6822 47.2135 41.6342 47.2924 41.6015C47.3712 41.5688 47.4558 41.552 47.5412 41.552H47.9884C48.1604 41.5533 48.3251 41.6222 48.4466 41.744C48.5682 41.8658 48.637 42.0305 48.638 42.2026V42.6448C48.638 42.7805 48.6822 42.8325 48.8454 42.8797C49.2253 42.9779 49.5893 43.1298 49.9264 43.3308H49.9706C50.0137 43.3457 50.06 43.3483 50.1044 43.3385C50.1488 43.3286 50.1896 43.3065 50.2222 43.2748L50.5328 42.9633C50.6554 42.842 50.8208 42.7739 50.9932 42.7739C51.1657 42.7739 51.3311 42.842 51.4537 42.9633L51.7721 43.2836C51.8934 43.4062 51.9614 43.5717 51.9614 43.7441C51.9614 43.9165 51.8934 44.082 51.7721 44.2045L51.4488 44.5318V44.6301C51.4478 44.6409 51.4478 44.6517 51.4488 44.6625V44.7175C51.6496 45.0574 51.8011 45.424 51.8989 45.8065C51.9145 45.8555 51.9455 45.8983 51.9872 45.9283C52.029 45.9584 52.0794 45.9743 52.1308 45.9735H52.7205C52.8063 45.973 52.8914 45.9895 52.9708 46.022C53.0502 46.0546 53.1223 46.1025 53.1831 46.1631C53.2439 46.2237 53.292 46.2957 53.3248 46.375C53.3576 46.4543 53.3743 46.5393 53.3741 46.6251V47.0713C53.3584 47.2328 53.2832 47.3826 53.1631 47.4916C53.043 47.6006 52.8866 47.661 52.7244 47.661H52.1348L52.1023 47.6974L52.0787 47.7406V47.7652C51.9822 48.1466 51.8323 48.5126 51.6335 48.8521V48.8856C51.6186 48.9283 51.6159 48.9744 51.6256 49.0187C51.6353 49.0629 51.6571 49.1036 51.6886 49.1362L52.0001 49.4477C52.1257 49.5671 52.1988 49.7315 52.2032 49.9047C52.2076 50.078 52.1431 50.2459 52.0237 50.3715C51.9958 50.4012 51.9652 50.4282 51.9323 50.4521L51.6168 50.7676C51.4943 50.8889 51.3288 50.9569 51.1564 50.9569C50.984 50.9569 50.8185 50.8889 50.696 50.7676L50.3893 50.4521L50.349 50.4207L50.3097 50.3961H50.2812C50.2488 50.389 50.2153 50.389 50.1829 50.3961H50.1387C49.784 50.6033 49.4004 50.7566 49.0006 50.8511C48.9519 50.867 48.9095 50.8979 48.8794 50.9394C48.8494 50.9809 48.8333 51.0309 48.8336 51.0821V51.5204C48.8336 51.6059 48.8167 51.6905 48.784 51.7694C48.7513 51.8483 48.7034 51.9201 48.643 51.9805C48.5826 52.0409 48.5109 52.0888 48.4319 52.1215C48.353 52.1542 48.2684 52.171 48.183 52.171H47.7171V52.1897ZM45.6719 50.2674H45.7633L45.8154 50.288C46.1463 50.4836 46.5034 50.6312 46.8758 50.7263C46.9474 50.7484 47.01 50.7929 47.0544 50.8532C47.0988 50.9136 47.1227 50.9866 47.1225 51.0615V51.4998C47.1225 51.571 47.1366 51.6416 47.1638 51.7074C47.1911 51.7732 47.231 51.833 47.2814 51.8834C47.3318 51.9338 47.3916 51.9737 47.4574 52.001C47.5232 52.0283 47.5938 52.0423 47.665 52.0423H48.1112C48.1825 52.0423 48.253 52.0283 48.3188 52.001C48.3846 51.9737 48.4444 51.9338 48.4948 51.8834C48.5452 51.833 48.5852 51.7732 48.6124 51.7074C48.6397 51.6416 48.6537 51.571 48.6537 51.4998V51.4998V51.0615C48.6536 50.9864 48.6776 50.9133 48.7222 50.853C48.7668 50.7927 48.8296 50.7482 48.9014 50.7263C49.2752 50.6297 49.6335 50.4808 49.9657 50.2841L50.0257 50.2595H50.0493C50.0991 50.2487 50.1508 50.2487 50.2006 50.2595H50.2331L50.2763 50.2841L50.3323 50.3312L50.6429 50.6428C50.7452 50.7429 50.8826 50.7989 51.0257 50.7989C51.1688 50.7989 51.3062 50.7429 51.4085 50.6428L51.7239 50.3273C51.825 50.2255 51.8816 50.0879 51.8816 49.9445C51.8816 49.8011 51.825 49.6635 51.7239 49.5617L51.5274 49.2875C51.4816 49.2411 51.4496 49.183 51.4348 49.1195C51.4201 49.056 51.4232 48.9896 51.4439 48.9278C51.4503 48.9089 51.4582 48.8905 51.4674 48.8728C51.6711 48.5404 51.8263 48.1807 51.9284 47.8045V47.7534C51.9373 47.7339 51.9478 47.7151 51.9598 47.6974L51.9923 47.661L52.0276 47.6296H52.7254C52.7967 47.6296 52.8672 47.6155 52.933 47.5883C52.9988 47.561 53.0586 47.521 53.109 47.4707C53.1594 47.4203 53.1994 47.3605 53.2266 47.2947C53.2539 47.2288 53.2679 47.1583 53.2679 47.087V47.087V46.5436C53.2669 46.4005 53.2092 46.2636 53.1076 46.1628C53.0059 46.0621 52.8685 46.0057 52.7254 46.006H52.2871C52.2121 46.0061 52.139 45.9821 52.0786 45.9375C52.0183 45.8929 51.9739 45.8301 51.952 45.7583C51.8553 45.3857 51.7064 45.0287 51.5097 44.6979V44.5996C51.5087 44.5875 51.5087 44.5753 51.5097 44.5632C51.5087 44.5528 51.5087 44.5423 51.5097 44.5318C51.5087 44.521 51.5087 44.5101 51.5097 44.4994V44.3431L51.5333 44.3156L51.8448 44.004C51.9458 43.9022 52.0025 43.7646 52.0025 43.6212C52.0025 43.4778 51.9458 43.3402 51.8448 43.2384L51.5294 42.8758C51.4276 42.7748 51.29 42.7181 51.1466 42.7181C51.0032 42.7181 50.8656 42.7748 50.7638 42.8758L50.4542 43.1854C50.4075 43.2316 50.3488 43.2639 50.2847 43.2787C50.2207 43.2934 50.1538 43.29 50.0915 43.2689L50.0355 43.2443C49.7005 43.0467 49.3396 42.8965 48.9633 42.7981C48.7559 42.7343 48.6753 42.6429 48.6753 42.4552V42.0188C48.6746 41.8757 48.6172 41.7387 48.5157 41.6378C48.4142 41.5369 48.2769 41.4802 48.1338 41.4802H47.7132C47.5693 41.4802 47.4313 41.5374 47.3296 41.6391C47.2278 41.7409 47.1707 41.8788 47.1707 42.0227V42.0227V42.4611C47.1717 42.4784 47.1717 42.4958 47.1707 42.5131C47.1717 42.5292 47.1717 42.5453 47.1707 42.5613V42.6684L47.1471 42.6969H47.0989L47.0468 42.7244H47.0144C46.6551 42.818 46.3102 42.9602 45.9894 43.147C45.9227 43.1971 45.8405 43.2219 45.7573 43.2168C45.6741 43.2118 45.5954 43.1773 45.5353 43.1195L45.2159 42.8001C45.1681 42.7473 45.1104 42.7045 45.046 42.6741C44.9817 42.6436 44.912 42.6261 44.8409 42.6227C44.7697 42.6192 44.6986 42.6298 44.6316 42.6538C44.5646 42.6779 44.503 42.7149 44.4503 42.7628C44.4121 42.7953 44.379 42.8334 44.352 42.8758L44.0366 43.1913C43.9355 43.2931 43.8789 43.4307 43.8789 43.5741C43.8789 43.7175 43.9355 43.8551 44.0366 43.9569L44.3481 44.2664C44.4029 44.3294 44.433 44.41 44.433 44.4935C44.433 44.5769 44.4029 44.6575 44.3481 44.7205C44.1715 45.0414 44.0386 45.3845 43.953 45.7406V45.8389L43.9294 45.8674V45.8871L43.9009 45.9106H43.156C43.0847 45.9106 43.0142 45.9247 42.9484 45.9519C42.8825 45.9792 42.8227 46.0192 42.7724 46.0695C42.722 46.1199 42.682 46.1797 42.6548 46.2455C42.6275 46.3114 42.6135 46.3819 42.6135 46.4531V46.9003C42.5893 47.0421 42.6224 47.1877 42.7055 47.3051C42.7886 47.4225 42.9149 47.5021 43.0567 47.5264C43.0892 47.5314 43.1221 47.534 43.155 47.5342H43.7771L43.8085 47.5578L43.841 47.5971C43.855 47.6171 43.8669 47.6385 43.8764 47.661V47.6974C43.9875 48.1073 44.1623 48.4973 44.3943 48.8531L44.4149 48.9013C44.4287 48.9399 44.4367 48.9803 44.4385 49.0212C44.4397 49.0674 44.4316 49.1134 44.4147 49.1564C44.3978 49.1994 44.3725 49.2387 44.3402 49.2718L44.0287 49.5833C43.9277 49.6851 43.871 49.8227 43.871 49.9661C43.871 50.1095 43.9277 50.2471 44.0287 50.3489L44.3442 50.6634C44.4462 50.764 44.5837 50.8203 44.727 50.8203C44.8702 50.8203 45.0077 50.764 45.1098 50.6634L45.4361 50.3411L45.4842 50.3047H45.5078L45.5599 50.2851H45.6582L45.6719 50.2674ZM47.9402 48.7607C47.5457 48.7609 47.1601 48.6441 46.832 48.4251C46.5039 48.2061 46.2482 47.8946 46.0971 47.5302C45.9461 47.1658 45.9065 46.7648 45.9834 46.3779C46.0603 45.991 46.2503 45.6356 46.5292 45.3566C46.8081 45.0777 47.1635 44.8878 47.5504 44.8108C47.9373 44.7339 48.3384 44.7735 48.7028 44.9246C49.0672 45.0756 49.3786 45.3313 49.5976 45.6594C49.8167 45.9875 49.9335 46.3732 49.9333 46.7676C49.9333 47.2962 49.7233 47.8032 49.3495 48.177C48.9758 48.5508 48.4688 48.7607 47.9402 48.7607V48.7607ZM47.9402 44.8699C47.5678 44.8697 47.2038 44.9799 46.8941 45.1867C46.5844 45.3935 46.3431 45.6875 46.2005 46.0315C46.058 46.3755 46.0207 46.754 46.0934 47.1192C46.166 47.4844 46.3454 47.8198 46.6088 48.0831C46.8721 48.3463 47.2077 48.5255 47.5729 48.598C47.9381 48.6704 48.3167 48.633 48.6606 48.4902C49.0045 48.3475 49.2984 48.106 49.505 47.7962C49.7116 47.4864 49.8217 47.1223 49.8213 46.75C49.8207 46.2513 49.6224 45.7733 49.2697 45.4208C48.917 45.0683 48.4388 44.8701 47.9402 44.8699V44.8699Z" fill="#666666"/>
<path d="M39.8823 46.7714C39.8823 48.3653 40.355 49.9234 41.2405 51.2487C42.126 52.574 43.3846 53.6069 44.8572 54.2169C46.3298 54.8268 47.9502 54.9864 49.5134 54.6755C51.0767 54.3645 52.5127 53.597 53.6397 52.4699C54.7668 51.3429 55.5343 49.9069 55.8453 48.3436C56.1562 46.7804 55.9966 45.16 55.3867 43.6874C54.7767 42.2148 53.7438 40.9562 52.4185 40.0707C51.0932 39.1852 49.5351 38.7125 47.9412 38.7125C45.8039 38.7125 43.7541 39.5616 42.2427 41.0729C40.7314 42.5843 39.8823 44.6341 39.8823 46.7714V46.7714Z" fill="#C9CBD2"/>
<path d="M41.1575 46.7833C41.1573 48.1342 41.5577 49.4549 42.3081 50.5783C43.0585 51.7017 44.1252 52.5773 45.3733 53.0944C46.6214 53.6116 47.9948 53.747 49.3198 53.4835C50.6448 53.2201 51.862 52.5696 52.8173 51.6144C53.7727 50.6592 54.4233 49.4422 54.687 48.1172C54.9506 46.7922 54.8154 45.4188 54.2984 44.1706C53.7815 42.9225 52.906 41.8556 51.7827 41.1051C50.6595 40.3545 49.3388 39.9539 47.9879 39.9539C46.1765 39.9539 44.4393 40.6734 43.1584 41.9541C41.8775 43.2348 41.1577 44.9719 41.1575 46.7833V46.7833Z" fill="#57555E"/>
<path d="M47.9401 53.641C46.5794 53.641 45.2494 53.2376 44.118 52.4816C42.9867 51.7257 42.1049 50.6513 41.5842 49.3942C41.0635 48.1371 40.9273 46.7539 41.1927 45.4194C41.4582 44.0849 42.1134 42.8591 43.0755 41.8969C44.0376 40.9348 45.2635 40.2796 46.598 40.0141C47.9325 39.7487 49.3157 39.8849 50.5728 40.4056C51.8298 40.9263 52.9043 41.8081 53.6602 42.9394C54.4162 44.0708 54.8196 45.4009 54.8196 46.7615V46.7694C54.816 48.5921 54.0898 50.339 52.8002 51.6271C51.5106 52.9153 49.7628 53.6395 47.9401 53.641V53.641ZM47.9401 39.993C46.5989 39.993 45.2878 40.3907 44.1726 41.1359C43.0575 41.881 42.1883 42.9401 41.675 44.1792C41.1618 45.4183 41.0275 46.7818 41.2891 48.0972C41.5508 49.4127 42.1966 50.621 43.145 51.5694C44.0934 52.5177 45.3017 53.1636 46.6171 53.4252C47.9326 53.6869 49.2961 53.5526 50.5352 53.0393C51.7743 52.5261 52.8334 51.6569 53.5785 50.5417C54.3236 49.4266 54.7214 48.1155 54.7214 46.7743C54.7214 44.9758 54.0069 43.2509 52.7352 41.9792C51.4634 40.7075 49.7386 39.993 47.9401 39.993V39.993Z" fill="#6B6A6A"/>
<path d="M46.6765 46.7713C46.6765 47.0213 46.7506 47.2656 46.8895 47.4735C47.0284 47.6813 47.2258 47.8433 47.4567 47.939C47.6877 48.0346 47.9418 48.0597 48.187 48.0109C48.4321 47.9621 48.6573 47.8418 48.8341 47.665C49.0108 47.4883 49.1312 47.2631 49.18 47.0179C49.2287 46.7727 49.2037 46.5186 49.108 46.2877C49.0124 46.0567 48.8504 45.8593 48.6426 45.7204C48.4347 45.5816 48.1904 45.5074 47.9404 45.5074C47.6052 45.5074 47.2837 45.6406 47.0467 45.8776C46.8097 46.1146 46.6765 46.4361 46.6765 46.7713Z" fill="#312242"/>
<path d="M52.6212 45.9183H52.1908C52.1397 45.919 52.0898 45.9034 52.0481 45.8739C52.0065 45.8445 51.9752 45.8025 51.9588 45.7542V45.7346C51.8652 45.3641 51.7203 45.0085 51.5284 44.6781V44.3508L51.8232 44.0559C51.9414 43.9365 52.0076 43.7753 52.0076 43.6073C52.0076 43.4393 51.9414 43.2781 51.8232 43.1587L51.5284 42.8717C51.4088 42.7523 51.2467 42.6853 51.0777 42.6853C50.9088 42.6853 50.7467 42.7523 50.6271 42.8717L50.3244 43.1911C50.2916 43.2238 50.2496 43.2458 50.204 43.2542C50.1584 43.2626 50.1113 43.2571 50.0689 43.2383H50.0296C49.6974 43.0415 49.3391 42.8926 48.9652 42.796C48.8011 42.7478 48.7579 42.6977 48.7579 42.5611V42.0786C48.759 41.9131 48.6953 41.7538 48.5806 41.6346C48.4658 41.5154 48.309 41.4459 48.1436 41.4407H47.7023C47.5363 41.4449 47.3785 41.514 47.2629 41.6333C47.1473 41.7526 47.0831 41.9125 47.0842 42.0786V42.513C47.0852 42.5277 47.0852 42.5425 47.0842 42.5572V42.6368C47.0842 42.684 46.9407 42.7125 46.9407 42.7125C46.5785 42.8067 46.2309 42.9503 45.9078 43.139C45.7643 43.2265 45.6768 43.251 45.5766 43.1704L45.2581 42.856C45.1384 42.738 44.9766 42.6725 44.8086 42.6738C44.6405 42.6751 44.4798 42.7431 44.3618 42.8628C44.3573 42.8668 44.3531 42.8711 44.3491 42.8756L44.0297 43.1911C43.9115 43.3113 43.8452 43.4731 43.8452 43.6417C43.8452 43.8103 43.9115 43.9721 44.0297 44.0923L44.3491 44.3989C44.3888 44.4424 44.4109 44.4992 44.4109 44.5581C44.4109 44.6171 44.3888 44.6739 44.3491 44.7174C44.1605 45.042 44.017 45.3908 43.9225 45.7542V45.8466L43.8695 45.8977H43.2591C43.091 45.8977 42.9298 45.9645 42.8109 46.0834C42.692 46.2022 42.6252 46.3635 42.6252 46.5316V46.5316V47.0024C42.6252 47.1708 42.6919 47.3325 42.8107 47.452C42.9294 47.5715 43.0907 47.6391 43.2591 47.6402H43.8252L43.8577 47.6765V47.7483C43.9692 48.1274 44.1346 48.4885 44.3491 48.8205L44.4051 48.908C44.4191 48.9508 44.421 48.9966 44.4104 49.0404C44.3998 49.0841 44.3772 49.124 44.3451 49.1556L44.0503 49.4819C43.9316 49.6019 43.8651 49.7638 43.8651 49.9325C43.8651 50.1013 43.9316 50.2632 44.0503 50.3832L44.3648 50.6947C44.4846 50.8136 44.6466 50.8803 44.8154 50.8803C44.9842 50.8803 45.1462 50.8136 45.266 50.6947L45.5608 50.3999L45.5972 50.3723H45.835C46.1641 50.5651 46.5184 50.7113 46.8876 50.8067C46.9386 50.8209 46.9833 50.852 47.0143 50.8948C47.0454 50.9376 47.061 50.9897 47.0586 51.0426V51.4406C47.0583 51.5249 47.0749 51.6084 47.1072 51.6863C47.1395 51.7641 47.1871 51.8347 47.247 51.894C47.3069 51.9533 47.378 52 47.4562 52.0315C47.5344 52.063 47.6181 52.0787 47.7023 52.0775H48.1525C48.3144 52.0774 48.47 52.0147 48.5869 51.9026C48.6488 51.8432 48.6982 51.772 48.732 51.6931C48.7658 51.6143 48.7833 51.5294 48.7834 51.4436V51.0171C48.7818 50.9661 48.7969 50.9159 48.8263 50.8743C48.8558 50.8326 48.898 50.8017 48.9466 50.7861H48.9672C49.338 50.6935 49.6943 50.55 50.0257 50.3596H50.237L50.5996 50.7065C50.7195 50.8254 50.8814 50.8921 51.0502 50.8921C51.219 50.8921 51.381 50.8254 51.5008 50.7065L51.8114 50.3949C51.9295 50.2757 51.9958 50.1146 51.9958 49.9468C51.9958 49.779 51.9295 49.6179 51.8114 49.4986L51.5352 49.191C51.5059 49.162 51.4848 49.1256 51.4743 49.0857C51.4637 49.0458 51.4641 49.0037 51.4753 48.964V48.9316C51.6729 48.5983 51.8222 48.2386 51.9185 47.8633V47.7955L51.9382 47.7679H52.5446C52.7127 47.7679 52.8739 47.7012 52.9928 47.5823C53.1117 47.4634 53.1785 47.3022 53.1785 47.134V47.134V46.5522C53.1788 46.3973 53.1228 46.2475 53.0208 46.1308C52.9188 46.0142 52.7778 45.9386 52.6242 45.9183H52.6212ZM47.9402 48.7871C47.4052 48.7871 46.8922 48.5747 46.5138 48.1965C46.1355 47.8183 45.9228 47.3054 45.9225 46.7704V46.7704C45.9223 46.3713 46.0405 45.9811 46.2621 45.6492C46.4837 45.3173 46.7987 45.0585 47.1674 44.9056C47.536 44.7528 47.9418 44.7127 48.3332 44.7904C48.7247 44.8682 49.0843 45.0602 49.3665 45.3424C49.6488 45.6245 49.8411 45.984 49.919 46.3754C49.9969 46.7669 49.957 47.1726 49.8044 47.5413C49.6517 47.9101 49.3931 48.2252 49.0612 48.447C48.7294 48.6687 48.3393 48.7871 47.9402 48.7871Z" fill="#6B6A6A"/>
<path d="M47.9398 48.1266C47.6714 48.1268 47.4091 48.0474 47.1859 47.8985C46.9627 47.7495 46.7887 47.5377 46.6859 47.2898C46.5832 47.042 46.5562 46.7692 46.6085 46.506C46.6608 46.2428 46.79 46.0011 46.9798 45.8114C47.1695 45.6216 47.4112 45.4924 47.6744 45.4401C47.9376 45.3878 48.2104 45.4148 48.4582 45.5176C48.7061 45.6203 48.9179 45.7943 49.0669 46.0175C49.2158 46.2407 49.2952 46.503 49.295 46.7714C49.295 47.1308 49.1522 47.4755 48.8981 47.7297C48.6439 47.9838 48.2992 48.1266 47.9398 48.1266V48.1266ZM47.9398 45.5154C47.6913 45.5154 47.4485 45.589 47.242 45.727C47.0354 45.865 46.8744 46.0612 46.7794 46.2907C46.6843 46.5202 46.6594 46.7728 46.7079 47.0164C46.7563 47.26 46.876 47.4838 47.0516 47.6595C47.2273 47.8351 47.4511 47.9548 47.6947 48.0032C47.9384 48.0517 48.1909 48.0268 48.4204 47.9318C48.6499 47.8367 48.8461 47.6757 48.9841 47.4692C49.1221 47.2626 49.1958 47.0198 49.1958 46.7714C49.1947 46.4386 49.0621 46.1197 48.8267 45.8844C48.5914 45.6491 48.2725 45.5164 47.9398 45.5154V45.5154Z" fill="#6B6A6A"/>
<path d="M43.2959 47.5761H43.8699L43.8935 47.5997L43.9495 47.6597L43.9741 47.7039V47.7481C44.0685 48.1149 44.2148 48.4664 44.4084 48.7919L44.4684 48.8901C44.4843 48.9412 44.486 48.9956 44.4734 49.0475C44.4607 49.0994 44.4342 49.1469 44.3967 49.185L44.0969 49.5083C44.0428 49.5623 43.9999 49.6264 43.9706 49.6969C43.9413 49.7675 43.9262 49.8432 43.9262 49.9196C43.9262 49.996 43.9413 50.0717 43.9706 50.1423C43.9999 50.2128 44.0428 50.2769 44.0969 50.3309L44.4124 50.6385C44.4663 50.6926 44.5304 50.7356 44.601 50.7649C44.6716 50.7941 44.7473 50.8092 44.8237 50.8092C44.9001 50.8092 44.9758 50.7941 45.0463 50.7649C45.1169 50.7356 45.181 50.6926 45.235 50.6385L45.5406 50.3397L45.576 50.3112H45.859C46.185 50.5048 46.5367 50.651 46.9038 50.7456C46.9655 50.7622 47.0198 50.7993 47.0578 50.8507C47.0958 50.9021 47.1153 50.9648 47.1131 51.0287V51.4277C47.1131 51.5048 47.1284 51.5811 47.1581 51.6522C47.1878 51.7233 47.2314 51.7878 47.2863 51.8419C47.3411 51.896 47.4062 51.9387 47.4777 51.9675C47.5492 51.9963 47.6257 52.0106 47.7028 52.0095H48.1372C48.2135 52.0127 48.2897 52.0008 48.3615 51.9745C48.4332 51.9482 48.499 51.908 48.5553 51.8563C48.6115 51.8045 48.657 51.7422 48.6891 51.6729C48.7212 51.6036 48.7394 51.5286 48.7426 51.4523V50.9894C48.74 50.9263 48.7587 50.8641 48.7955 50.8128C48.8324 50.7615 48.8854 50.724 48.946 50.7063C49.3121 50.6163 49.6638 50.4754 49.9907 50.2877L50.0428 50.2631H50.2737L50.318 50.2995L50.6207 50.6022C50.6747 50.6563 50.7389 50.6992 50.8096 50.7286C50.8802 50.7579 50.956 50.7729 51.0325 50.7729C51.109 50.7729 51.1847 50.7579 51.2554 50.7286C51.326 50.6992 51.3902 50.6563 51.4442 50.6022V50.6022L51.7509 50.2955C51.805 50.2415 51.848 50.1773 51.8773 50.1066C51.9066 50.036 51.9217 49.9602 51.9217 49.8837C51.9217 49.8072 51.9066 49.7315 51.8773 49.6608C51.848 49.5902 51.805 49.526 51.7509 49.4719V49.4719L51.4757 49.1692C51.4393 49.1329 51.4135 49.0874 51.4008 49.0376C51.3882 48.9878 51.3893 48.9355 51.404 48.8862V48.8498C51.5969 48.5236 51.7422 48.1715 51.8354 47.8041V47.7806L51.86 47.7363L51.9278 47.701L51.9553 47.6774H52.5853C52.7397 47.6771 52.8877 47.6156 52.9967 47.5063C53.1058 47.3971 53.1671 47.249 53.1671 47.0946V47.0946V46.556C53.1672 46.4795 53.1523 46.4037 53.1231 46.333C53.0939 46.2623 53.0511 46.1981 52.997 46.144C52.943 46.0898 52.8788 46.0469 52.8081 46.0176C52.7375 45.9883 52.6618 45.9732 52.5853 45.9732H52.1587C52.0956 45.9759 52.0334 45.9573 51.982 45.9204C51.9307 45.8835 51.8933 45.8305 51.8757 45.7698C51.7855 45.404 51.6446 45.0527 51.457 44.726V44.6278C51.456 44.6173 51.456 44.6068 51.457 44.5963V44.3467L51.7597 44.044C51.8682 43.9348 51.9291 43.7871 51.9291 43.6332C51.9291 43.4792 51.8682 43.3316 51.7597 43.2224L51.4649 42.9197C51.4109 42.8656 51.3468 42.8226 51.2762 42.7933C51.2057 42.764 51.13 42.749 51.0536 42.749C50.9772 42.749 50.9015 42.764 50.8309 42.7933C50.7604 42.8226 50.6962 42.8656 50.6423 42.9197V42.9197L50.3396 43.2342C50.2993 43.2734 50.2482 43.2997 50.1929 43.3097C50.1375 43.3197 50.0805 43.3129 50.029 43.2902H49.9848C49.6587 43.0971 49.307 42.9508 48.9401 42.8558C48.7612 42.8037 48.7013 42.7359 48.7013 42.5727V42.1266C48.7014 41.9755 48.6428 41.8303 48.5379 41.7216C48.4331 41.6129 48.2901 41.5491 48.1391 41.5438H47.7254C47.6489 41.5438 47.5731 41.5588 47.5025 41.5881C47.4318 41.6174 47.3677 41.6604 47.3136 41.7145C47.2596 41.7686 47.2167 41.8329 47.1876 41.9036C47.1584 41.9743 47.1434 42.0501 47.1436 42.1266V42.1266V42.557C47.1445 42.5714 47.1445 42.5859 47.1436 42.6003V42.6985C47.1436 42.7624 47.0001 42.7968 46.9637 42.8057C46.6112 42.8967 46.2713 43.0308 45.9514 43.2047C45.7873 43.303 45.6723 43.3403 45.5524 43.2401H45.5328L45.2173 42.9256C45.1094 42.8241 44.9669 42.7676 44.8188 42.7676C44.6707 42.7676 44.5281 42.8241 44.4202 42.9256L44.1048 43.2401C43.9957 43.3493 43.9344 43.4974 43.9344 43.6519C43.9344 43.8063 43.9957 43.9544 44.1048 44.0636L44.4202 44.3644C44.4668 44.4166 44.4925 44.4841 44.4925 44.5541C44.4925 44.624 44.4668 44.6915 44.4202 44.7437C44.2418 45.0628 44.1076 45.4047 44.0212 45.7599V45.8798H43.2959C43.1416 45.8798 42.9936 45.9411 42.8845 46.0502C42.7754 46.1594 42.7141 46.3073 42.7141 46.4617V46.9285C42.7144 47.0819 42.7752 47.2291 42.8835 47.3379C42.9917 47.4466 43.1385 47.5083 43.292 47.5093L43.2959 47.5761ZM47.9406 44.8695C48.3134 44.8695 48.6779 44.98 48.988 45.1871C49.298 45.3942 49.5398 45.6885 49.6826 46.0329C49.8255 46.3773 49.8631 46.7563 49.7906 47.122C49.7182 47.4877 49.5389 47.8238 49.2756 48.0877C49.0122 48.3516 48.6765 48.5315 48.3109 48.6048C47.9454 48.678 47.5663 48.6412 47.2216 48.499C46.8769 48.3569 46.5821 48.1158 46.3744 47.8062C46.1667 47.4965 46.0554 47.1323 46.0546 46.7594C46.0541 46.5114 46.1025 46.2658 46.1971 46.0365C46.2916 45.8072 46.4304 45.5989 46.6056 45.4233C46.7808 45.2478 46.9889 45.1085 47.218 45.0135C47.447 44.9184 47.6926 44.8695 47.9406 44.8695V44.8695Z" fill="#EBECF0"/>
<path d="M47.9403 48.1345C47.6704 48.1347 47.4065 48.0548 47.1821 47.905C46.9576 47.7552 46.7826 47.5421 46.6792 47.2928C46.5759 47.0435 46.5488 46.7692 46.6014 46.5045C46.654 46.2398 46.7839 45.9966 46.9747 45.8058C47.1656 45.615 47.4087 45.485 47.6734 45.4324C47.9381 45.3798 48.2125 45.4069 48.4618 45.5103C48.7111 45.6136 48.9241 45.7886 49.0739 46.0131C49.2238 46.2376 49.3036 46.5015 49.3034 46.7713C49.3024 47.1326 49.1584 47.4787 48.903 47.7341C48.6476 47.9895 48.3015 48.1334 47.9403 48.1345V48.1345ZM47.9403 45.5035C47.6897 45.5035 47.4448 45.5778 47.2364 45.7169C47.0279 45.8561 46.8654 46.0538 46.7694 46.2853C46.6733 46.5167 46.648 46.7714 46.6966 47.0172C46.7452 47.2631 46.8655 47.489 47.0424 47.6664C47.2194 47.8439 47.4449 47.9649 47.6906 48.0143C47.9362 48.0637 48.191 48.0391 48.4227 47.9438C48.6545 47.8484 48.8527 47.6865 48.9925 47.4786C49.1323 47.2706 49.2073 47.0259 49.2081 46.7753C49.2086 46.6085 49.1762 46.4432 49.1127 46.2889C49.0492 46.1346 48.9559 45.9944 48.8382 45.8763C48.7204 45.7581 48.5804 45.6644 48.4264 45.6004C48.2723 45.5365 48.1071 45.5035 47.9403 45.5035Z" fill="#6B6A6A"/>
<path d="M47.9403 48.6732C47.5642 48.6732 47.1965 48.5617 46.8837 48.3527C46.571 48.1438 46.3273 47.8468 46.1833 47.4993C46.0394 47.1518 46.0017 46.7694 46.0751 46.4005C46.1485 46.0316 46.3296 45.6928 46.5956 45.4268C46.8615 45.1609 47.2004 44.9797 47.5693 44.9064C47.9382 44.833 48.3205 44.8706 48.668 45.0146C49.0155 45.1585 49.3125 45.4023 49.5215 45.715C49.7304 46.0277 49.842 46.3954 49.842 46.7715C49.8409 47.2756 49.6402 47.7587 49.2838 48.1151C48.9274 48.4715 48.4443 48.6722 47.9403 48.6732ZM47.9403 45.0054C47.5904 45.0054 47.2484 45.1092 46.9575 45.3036C46.6665 45.498 46.4398 45.7742 46.3059 46.0975C46.172 46.4207 46.137 46.7764 46.2052 47.1196C46.2735 47.4627 46.442 47.778 46.6894 48.0254C46.9368 48.2728 47.252 48.4412 47.5952 48.5095C47.9383 48.5778 48.294 48.5427 48.6173 48.4088C48.9405 48.2749 49.2168 48.0482 49.4112 47.7573C49.6056 47.4664 49.7093 47.1243 49.7093 46.7745C49.7093 46.3053 49.5229 45.8553 49.1912 45.5236C48.8594 45.1918 48.4095 45.0054 47.9403 45.0054V45.0054Z" fill="#6B6A6A"/>
</svg>
