<svg width="60" height="60" viewBox="0 0 60 60" fill="none" xmlns="http://www.w3.org/2000/svg">
<circle cx="30.2839" cy="30.2839" r="25.9982" fill="url(#paint0_linear_605_1048)"/>
<path d="M29.9722 32.1221C34.4708 32.1221 38.1363 28.5121 38.1363 24.1246V16.0715H29.9722C25.4736 16.0715 21.808 19.6815 21.808 24.0691C21.808 28.5121 25.4736 32.1221 29.9722 32.1221ZM33.1379 34.1771H26.862C21.4748 34.1771 17.1428 37.5094 17.1428 41.6747V42.1746C17.1428 43.8407 21.4748 43.8407 26.862 43.8407H33.1379C38.5251 43.8407 42.8571 43.7852 42.8571 42.1746V41.6747C42.8571 37.5649 38.4696 34.1771 33.1379 34.1771Z" fill="url(#paint1_linear_605_1048)"/>
<defs>
<linearGradient id="paint0_linear_605_1048" x1="30.2839" y1="4.28564" x2="30.2839" y2="56.2821" gradientUnits="userSpaceOnUse">
<stop stop-color="#2A57FE"/>
<stop offset="1" stop-color="#2BCCFF"/>
</linearGradient>
<linearGradient id="paint1_linear_605_1048" x1="30" y1="16.0715" x2="30" y2="43.8407" gradientUnits="userSpaceOnUse">
<stop stop-color="white"/>
<stop offset="1" stop-color="white" stop-opacity="0.5"/>
</linearGradient>
</defs>
</svg>
