<svg width="60" height="60" viewBox="0 0 60 60" fill="none" xmlns="http://www.w3.org/2000/svg">
<path d="M7.00952 16.1968V50.7016C7.01037 51.3115 7.25312 51.8961 7.68445 52.327C8.11578 52.7579 8.70043 53 9.31001 53H50.6995C51.3091 53 51.8937 52.7579 52.325 52.327C52.7564 51.8961 52.9991 51.3115 53 50.7016V16.1968H7.00952Z" fill="#3981D3"/>
<path d="M50.69 7H9.30049C8.69091 7 8.10626 7.26319 7.67493 7.73177C7.2436 8.20034 7.00085 8.836 7 9.49913V17H52.9776V9.49913C52.9776 8.83632 52.7356 8.20065 52.3048 7.73198C51.8739 7.2633 51.2896 7 50.6803 7H50.69Z" fill="#8C9EFF"/>
<rect x="11" y="21" width="38" height="28" fill="#F9FCFF"/>
<rect x="10" y="10" width="4" height="4" rx="1" fill="#F35E5E"/>
<rect x="22" y="10" width="4" height="4" rx="1" fill="#90EF7A"/>
<rect x="16" y="10" width="4" height="4" rx="1" fill="#F8DF5C"/>
<rect x="25" y="25" width="19" height="4" fill="#01C6F5"/>
<rect x="16" y="25" width="4" height="4" fill="#01C6F5"/>
<rect x="16" y="33" width="4" height="4" fill="#01C6F5"/>
<rect x="16" y="41" width="4" height="4" fill="#01C6F5"/>
<rect x="25" y="33" width="19" height="4" fill="#01C6F5"/>
<rect x="25" y="41" width="19" height="4" fill="#01C6F5"/>
</svg>
