<svg width="60" height="60" viewBox="0 0 60 60" fill="none" xmlns="http://www.w3.org/2000/svg">
<path d="M7 11C7 8.79086 8.79086 7 11 7H15.857H49C51.2091 7 53 8.79086 53 11V48.9998C53 51.2089 51.2091 52.9998 49 52.9998H11C8.79086 52.9998 7 51.2089 7 48.9998V12.9046V11Z" fill="url(#paint0_linear_447_2134)"/>
<rect x="14.7751" y="11.7322" width="29.9043" height="33.7332" rx="2.43056" fill="#FFF7DD" fill-opacity="0.5"/>
<rect x="11.7847" y="15.5867" width="35.8851" height="36.7998" rx="2.43056" fill="#FFFFFD"/>
<g filter="url(#filter0_b_447_2134)">
<path d="M7 22.3444C7 21.375 7.78585 20.5891 8.75525 20.5891H24.0149C25.7407 20.5891 27.3785 21.351 28.4902 22.671L30.6653 25.2538C31.777 26.5738 33.4147 27.3357 35.1405 27.3357H53V51.2448C53 52.2142 52.2141 53.0001 51.2448 53.0001H8.75525C7.78585 53.0001 7 52.2142 7 51.2448V22.3444Z" fill="url(#paint1_linear_447_2134)" fill-opacity="0.85"/>
</g>
<defs>
<filter id="filter0_b_447_2134" x="3" y="16.5891" width="54" height="40.4109" filterUnits="userSpaceOnUse" color-interpolation-filters="sRGB">
<feFlood flood-opacity="0" result="BackgroundImageFix"/>
<feGaussianBlur in="BackgroundImage" stdDeviation="2"/>
<feComposite in2="SourceAlpha" operator="in" result="effect1_backgroundBlur_447_2134"/>
<feBlend mode="normal" in="SourceGraphic" in2="effect1_backgroundBlur_447_2134" result="shape"/>
</filter>
<linearGradient id="paint0_linear_447_2134" x1="41.8833" y1="7.8493" x2="41.1945" y2="51.4807" gradientUnits="userSpaceOnUse">
<stop stop-color="#FEB417"/>
<stop offset="0.51875" stop-color="#FDB307"/>
<stop offset="1" stop-color="#DFBC45"/>
<stop offset="1" stop-color="#DB9801"/>
</linearGradient>
<linearGradient id="paint1_linear_447_2134" x1="24.6435" y1="21.1068" x2="23.3879" y2="51.7219" gradientUnits="userSpaceOnUse">
<stop stop-color="#FFD459"/>
<stop offset="0.51875" stop-color="#FFCC40"/>
<stop offset="1" stop-color="#FEC529"/>
</linearGradient>
</defs>
</svg>
