<svg width="60" height="60" viewBox="0 0 60 60" fill="none" xmlns="http://www.w3.org/2000/svg">
<path d="M10.0627 8.89071C10.1455 7.82366 11.0354 7 12.1057 7H47.8943C48.9646 7 49.8545 7.82366 49.9373 8.89071L52.8289 46.1926C52.9212 47.3831 51.98 48.4 50.7859 48.4H9.21407C8.01998 48.4 7.07883 47.3831 7.17112 46.1926L10.0627 8.89071Z" fill="url(#paint0_radial_454_1084)"/>
<g filter="url(#filter0_i_454_1084)">
<path d="M21.1436 17.4344C16.4971 22.1348 19.0069 30.2613 18.4723 36.2822C23.8148 36.2822 30.7596 36.9627 33.965 35.4968C38.5059 33.4201 42.0618 30.2516 41.7114 24.2407C41.1773 15.0786 29.4243 9.05769 21.1436 17.4344Z" fill="url(#paint1_linear_454_1084)"/>
</g>
<g filter="url(#filter1_i_454_1084)">
<path d="M7 46.5601H53L52.6212 51.1206C52.533 52.1828 51.6451 53.0001 50.5792 53.0001H9.42083C8.35491 53.0001 7.46701 52.1828 7.37878 51.1206L7 46.5601Z" fill="url(#paint2_linear_454_1084)"/>
</g>
<rect x="7" y="46.7273" width="46" height="0.92" fill="white" fill-opacity="0.5"/>
<ellipse cx="30.2032" cy="24.5111" rx="5.06724" ry="4.96589" fill="#DFE1E3"/>
<circle cx="47.5" cy="50.5" r="1.5" fill="url(#paint3_radial_454_1084)"/>
<defs>
<filter id="filter0_i_454_1084" x="18.2654" y="13.4399" width="23.47" height="23" filterUnits="userSpaceOnUse" color-interpolation-filters="sRGB">
<feFlood flood-opacity="0" result="BackgroundImageFix"/>
<feBlend mode="normal" in="SourceGraphic" in2="BackgroundImageFix" result="shape"/>
<feColorMatrix in="SourceAlpha" type="matrix" values="0 0 0 0 0 0 0 0 0 0 0 0 0 0 0 0 0 0 127 0" result="hardAlpha"/>
<feOffset/>
<feGaussianBlur stdDeviation="0.5"/>
<feComposite in2="hardAlpha" operator="arithmetic" k2="-1" k3="1"/>
<feColorMatrix type="matrix" values="0 0 0 0 0 0 0 0 0 0 0 0 0 0 0 0 0 0 0.25 0"/>
<feBlend mode="normal" in2="shape" result="effect1_innerShadow_454_1084"/>
</filter>
<filter id="filter1_i_454_1084" x="7" y="46.5601" width="46" height="6.95221" filterUnits="userSpaceOnUse" color-interpolation-filters="sRGB">
<feFlood flood-opacity="0" result="BackgroundImageFix"/>
<feBlend mode="normal" in="SourceGraphic" in2="BackgroundImageFix" result="shape"/>
<feColorMatrix in="SourceAlpha" type="matrix" values="0 0 0 0 0 0 0 0 0 0 0 0 0 0 0 0 0 0 127 0" result="hardAlpha"/>
<feOffset dy="0.512269"/>
<feGaussianBlur stdDeviation="2.04908"/>
<feComposite in2="hardAlpha" operator="arithmetic" k2="-1" k3="1"/>
<feColorMatrix type="matrix" values="0 0 0 0 0 0 0 0 0 0 0 0 0 0 0 0 0 0 0.5 0"/>
<feBlend mode="normal" in2="shape" result="effect1_innerShadow_454_1084"/>
</filter>
<radialGradient id="paint0_radial_454_1084" cx="0" cy="0" r="1" gradientUnits="userSpaceOnUse" gradientTransform="translate(43.5 12) rotate(136.762) scale(45.9837 49.4585)">
<stop stop-color="#D0C7B5"/>
<stop offset="1" stop-color="#DFDBD7"/>
</radialGradient>
<linearGradient id="paint1_linear_454_1084" x1="30.0003" y1="13.4399" x2="30.0003" y2="36.4399" gradientUnits="userSpaceOnUse">
<stop stop-color="#F2A325"/>
<stop offset="1" stop-color="#DE8E30"/>
</linearGradient>
<linearGradient id="paint2_linear_454_1084" x1="7.80233" y1="50.8534" x2="51.9302" y2="50.8534" gradientUnits="userSpaceOnUse">
<stop stop-color="#323232"/>
<stop offset="0.258333" stop-color="#434343"/>
<stop offset="0.544792" stop-color="#5D5D5D"/>
<stop offset="0.794792" stop-color="#414141"/>
<stop offset="0.992708" stop-color="#323232"/>
</linearGradient>
<radialGradient id="paint3_radial_454_1084" cx="0" cy="0" r="1" gradientUnits="userSpaceOnUse" gradientTransform="translate(47.5 50.5) rotate(81.8699) scale(2.12132)">
<stop stop-color="#9EFF9E"/>
<stop offset="1" stop-color="#0EC50E"/>
</radialGradient>
</defs>
</svg>
