<svg width="60" height="60" viewBox="0 0 60 60" fill="none" xmlns="http://www.w3.org/2000/svg">
<path d="M12 18C12 16.5 12.0695 8.87796 18.5 7.5C25.5 6 28 11 34.5 11C40 11 41.5 7.5 42 4" stroke="url(#paint0_radial_447_2082)" stroke-width="2" stroke-linecap="round"/>
<path d="M13.2682 20.696H10.4026C9.64616 20.696 9.03296 20.0828 9.03296 19.3263V16.4607C9.03296 15.7043 9.64616 15.0911 10.4026 15.0911H13.2682C14.0247 15.0911 14.6379 15.7043 14.6379 16.4607V19.3263C14.6378 20.0828 14.0246 20.696 13.2682 20.696Z" fill="#ADB8BC"/>
<path d="M53.4991 47H6.50099C5.11975 47 4 45.683 4 44.0584V18.9416C4 17.317 5.11975 16 6.50099 16H53.499C54.8803 16 56 17.317 56 18.9416V44.0583C56.0001 45.683 54.8804 47 53.4991 47V47Z" fill="url(#paint1_linear_447_2082)"/>
<path d="M43.1193 38.8152V41.6248C43.1193 41.7318 43.0983 41.8378 43.0573 41.9367C43.0163 42.0356 42.9563 42.1255 42.8806 42.2012C42.8049 42.2769 42.715 42.337 42.6161 42.3779C42.5172 42.4189 42.4112 42.44 42.3041 42.44H17.6805C17.4642 42.44 17.2569 42.3541 17.104 42.2012C16.9511 42.0483 16.8652 41.841 16.8652 41.6248V38.8152C16.8652 38.599 16.9511 38.3917 17.104 38.2388C17.2569 38.0859 17.4642 38 17.6805 38H42.3042C42.5204 38 42.7277 38.0859 42.8806 38.2388C43.0335 38.3917 43.1193 38.599 43.1193 38.8152V38.8152Z" fill="url(#paint2_linear_447_2082)"/>
<path d="M13.2399 29H10.4305C10.2142 29 10.0069 29.0859 9.85401 29.2388C9.70112 29.3917 9.61523 29.599 9.61523 29.8152V32.6248C9.61523 32.841 9.70112 33.0483 9.85401 33.2012C10.0069 33.3541 10.2142 33.44 10.4305 33.44H13.24C13.4562 33.44 13.6636 33.3541 13.8165 33.2012C13.9693 33.0483 14.0552 32.841 14.0552 32.6248V29.8152C14.0552 29.599 13.9693 29.3916 13.8164 29.2388C13.6635 29.0859 13.4561 29 13.2399 29V29ZM20.5059 29H17.6963C17.4801 29 17.2728 29.0859 17.1199 29.2388C16.967 29.3917 16.8811 29.599 16.8811 29.8152V32.6248C16.8811 32.841 16.967 33.0483 17.1199 33.2012C17.2728 33.3541 17.4801 33.44 17.6963 33.44H20.5059C20.7221 33.44 20.9295 33.3541 21.0823 33.2012C21.2352 33.0483 21.3211 32.841 21.3211 32.6248V29.8152C21.3211 29.599 21.2352 29.3917 21.0823 29.2388C20.9294 29.0859 20.7221 29 20.5059 29ZM27.7718 29H24.9622C24.746 29 24.5387 29.0859 24.3858 29.2388C24.2329 29.3917 24.147 29.599 24.147 29.8152V32.6248C24.147 32.841 24.2329 33.0483 24.3858 33.2012C24.5387 33.3541 24.746 33.44 24.9622 33.44H27.7718C27.988 33.44 28.1953 33.3541 28.3482 33.2012C28.5011 33.0483 28.587 32.841 28.587 32.6248V29.8152C28.587 29.7082 28.5659 29.6021 28.525 29.5032C28.484 29.4043 28.424 29.3144 28.3483 29.2387C28.2726 29.163 28.1827 29.103 28.0838 29.062C27.9849 29.0211 27.8788 29 27.7718 29V29ZM35.0378 29H32.2282C32.012 29 31.8047 29.0859 31.6518 29.2388C31.4989 29.3917 31.413 29.599 31.413 29.8152V32.6248C31.413 32.841 31.4989 33.0483 31.6518 33.2012C31.8047 33.3541 32.012 33.44 32.2282 33.44H35.0378C35.254 33.44 35.4613 33.3541 35.6142 33.2012C35.7671 33.0483 35.853 32.841 35.853 32.6248V29.8152C35.853 29.599 35.7671 29.3917 35.6142 29.2388C35.4613 29.0859 35.254 29 35.0378 29ZM42.3037 29H39.4941C39.2779 29 39.0705 29.0859 38.9177 29.2388C38.7648 29.3917 38.6789 29.599 38.6789 29.8152V32.6248C38.6789 32.841 38.7648 33.0483 38.9177 33.2012C39.0705 33.3541 39.2779 33.44 39.4941 33.44H42.3037C42.5199 33.44 42.7272 33.3541 42.8801 33.2012C43.033 33.0483 43.1189 32.841 43.1189 32.6248V29.8152C43.1189 29.7082 43.0978 29.6021 43.0569 29.5032C43.0159 29.4043 42.9558 29.3144 42.8801 29.2387C42.8044 29.163 42.7146 29.103 42.6157 29.062C42.5167 29.0211 42.4107 29 42.3037 29V29ZM49.5697 29H46.7601C46.653 29 46.547 29.0211 46.4481 29.0621C46.3492 29.103 46.2594 29.1631 46.1837 29.2388C46.108 29.3145 46.0479 29.4043 46.0069 29.5032C45.966 29.6022 45.9449 29.7082 45.9449 29.8152V32.6248C45.9449 32.841 46.0308 33.0483 46.1837 33.2012C46.3365 33.3541 46.5439 33.44 46.7601 33.44H49.5697C49.6767 33.44 49.7827 33.4189 49.8816 33.3779C49.9805 33.337 50.0704 33.2769 50.1461 33.2012C50.2218 33.1255 50.2819 33.0356 50.3228 32.9367C50.3638 32.8378 50.3849 32.7318 50.3849 32.6248V29.8152C50.3849 29.599 50.299 29.3917 50.1461 29.2388C49.9932 29.0859 49.7859 29 49.5697 29V29Z" fill="url(#paint3_linear_447_2082)"/>
<path d="M13.2399 22H10.4305C10.2142 22 10.0069 22.0859 9.85401 22.2388C9.70112 22.3917 9.61523 22.599 9.61523 22.8152V25.6248C9.61523 25.841 9.70112 26.0483 9.85401 26.2012C10.0069 26.3541 10.2142 26.44 10.4305 26.44H13.24C13.4562 26.44 13.6636 26.3541 13.8165 26.2012C13.9693 26.0483 14.0552 25.841 14.0552 25.6248V22.8152C14.0552 22.599 13.9692 22.3917 13.8164 22.2388C13.6635 22.0859 13.4561 22 13.2399 22ZM20.5059 22H17.6963C17.4801 22 17.2728 22.0859 17.1199 22.2388C16.967 22.3917 16.8811 22.599 16.8811 22.8152V25.6248C16.8811 25.841 16.967 26.0483 17.1199 26.2012C17.2728 26.3541 17.4801 26.44 17.6963 26.44H20.5059C20.7221 26.44 20.9295 26.3541 21.0823 26.2012C21.2352 26.0483 21.3211 25.841 21.3211 25.6248V22.8152C21.3211 22.599 21.2352 22.3917 21.0823 22.2388C20.9294 22.0859 20.7221 22 20.5059 22ZM27.7718 22H24.9622C24.746 22 24.5387 22.0859 24.3858 22.2388C24.2329 22.3917 24.147 22.599 24.147 22.8152V25.6248C24.147 25.841 24.2329 26.0483 24.3858 26.2012C24.5387 26.3541 24.746 26.44 24.9622 26.44H27.7718C27.988 26.44 28.1953 26.3541 28.3482 26.2012C28.5011 26.0483 28.587 25.841 28.587 25.6248V22.8152C28.587 22.599 28.5011 22.3917 28.3482 22.2388C28.1953 22.0859 27.988 22 27.7718 22ZM35.0378 22H32.2282C32.012 22 31.8047 22.0859 31.6518 22.2388C31.4989 22.3917 31.413 22.599 31.413 22.8152V25.6248C31.413 25.841 31.4989 26.0483 31.6518 26.2012C31.8047 26.3541 32.012 26.44 32.2282 26.44H35.0378C35.254 26.44 35.4613 26.3541 35.6142 26.2012C35.7671 26.0483 35.853 25.841 35.853 25.6248V22.8152C35.853 22.599 35.7671 22.3917 35.6142 22.2388C35.4613 22.0859 35.254 22 35.0378 22V22ZM42.3037 22H39.4941C39.2779 22 39.0705 22.0859 38.9177 22.2388C38.7648 22.3917 38.6789 22.599 38.6789 22.8152V25.6248C38.6789 25.841 38.7648 26.0483 38.9177 26.2012C39.0705 26.3541 39.2779 26.44 39.4941 26.44H42.3037C42.5199 26.44 42.7272 26.3541 42.8801 26.2012C43.033 26.0483 43.1189 25.841 43.1189 25.6248V22.8152C43.1189 22.599 43.033 22.3917 42.8801 22.2388C42.7272 22.0859 42.5199 22 42.3037 22ZM49.5697 22H46.7601C46.653 22 46.547 22.0211 46.4481 22.0621C46.3492 22.103 46.2594 22.1631 46.1837 22.2388C46.108 22.3145 46.0479 22.4043 46.0069 22.5032C45.966 22.6022 45.9449 22.7082 45.9449 22.8152V25.6248C45.9449 25.841 46.0308 26.0483 46.1837 26.2012C46.3365 26.3541 46.5439 26.44 46.7601 26.44H49.5697C49.6767 26.44 49.7827 26.4189 49.8816 26.3779C49.9805 26.337 50.0704 26.2769 50.1461 26.2012C50.2218 26.1255 50.2819 26.0356 50.3228 25.9367C50.3638 25.8378 50.3849 25.7318 50.3849 25.6248V22.8152C50.3849 22.599 50.299 22.3917 50.1461 22.2388C49.9932 22.0859 49.7859 22 49.5697 22V22Z" fill="url(#paint4_linear_447_2082)"/>
<defs>
<radialGradient id="paint0_radial_447_2082" cx="0" cy="0" r="1" gradientUnits="userSpaceOnUse" gradientTransform="translate(43.5 1.00001) rotate(158.199) scale(35.0036 71.2615)">
<stop stop-color="#819096"/>
<stop offset="1" stop-color="#606060"/>
</radialGradient>
<linearGradient id="paint1_linear_447_2082" x1="30" y1="16" x2="30" y2="47" gradientUnits="userSpaceOnUse">
<stop stop-color="#C5CFD1"/>
<stop offset="1" stop-color="#ADB8BC"/>
</linearGradient>
<linearGradient id="paint2_linear_447_2082" x1="29.9923" y1="38" x2="29.9923" y2="42.44" gradientUnits="userSpaceOnUse">
<stop stop-color="#597B91"/>
<stop offset="1" stop-color="#465E6D"/>
</linearGradient>
<linearGradient id="paint3_linear_447_2082" x1="30.0001" y1="29" x2="30.0001" y2="33.44" gradientUnits="userSpaceOnUse">
<stop stop-color="#597B91"/>
<stop offset="1" stop-color="#486070"/>
</linearGradient>
<linearGradient id="paint4_linear_447_2082" x1="30.0001" y1="22" x2="30.0001" y2="26.44" gradientUnits="userSpaceOnUse">
<stop stop-color="#597B91"/>
<stop offset="1" stop-color="#486070"/>
</linearGradient>
</defs>
</svg>
