<svg width="60" height="60" viewBox="0 0 60 60" fill="none" xmlns="http://www.w3.org/2000/svg">
<path d="M16.5732 10H49.431C51.1736 10.001 52.8444 10.6516 54.0762 11.8087C55.308 12.9658 56 14.5347 56 16.1706V40.8452C55.9967 42.4786 55.3031 44.0441 54.0715 45.198C52.84 46.3519 51.171 47 49.431 47H16.5732C15.7102 47.0005 14.8556 46.8414 14.0581 46.5317C13.2606 46.2221 12.5359 45.7679 11.9255 45.1952C11.3151 44.6225 10.8308 43.9426 10.5004 43.1941C10.1701 42.4457 10 41.6435 10 40.8333V16.1706C10 14.5341 10.6925 12.9645 11.9253 11.8073C13.158 10.6501 14.8299 10 16.5732 10V10Z" fill="#DFECFD"/>
<path d="M10.569 14H43.4268C45.1701 14 46.842 14.6323 48.0747 15.7579C49.3075 16.8835 50 18.4101 50 20.0019V44.0019C50 44.7899 49.8299 45.5702 49.4996 46.2982C49.1692 47.0261 48.6849 47.6875 48.0745 48.2446C47.4641 48.8016 46.7394 49.2433 45.9419 49.5445C45.1444 49.8457 44.2898 50.0005 43.4268 50H10.569C8.82681 50 7.15595 49.3681 5.92402 48.2432C4.69209 47.1183 4 45.5927 4 44.0019V20.0019C4 18.4108 4.69196 16.8847 5.92377 15.7593C7.15558 14.6338 8.82642 14.001 10.569 14V14Z" fill="url(#paint0_linear_447_2063)"/>
<path d="M40.8476 29.9142L34.9683 35.8283C34.8978 35.8855 34.8393 35.9562 34.7962 36.0363C34.7531 36.1164 34.7261 36.2044 34.7169 36.295C34.7077 36.3856 34.7165 36.4772 34.7427 36.5644C34.7688 36.6516 34.8119 36.7327 34.8695 36.8031V36.8146L34.9588 36.9044L36.1468 38.0991C36.2047 38.1699 36.2759 38.2286 36.3564 38.2717C36.4368 38.3148 36.5249 38.3416 36.6156 38.3505C36.7064 38.3594 36.798 38.3502 36.8852 38.3234C36.9724 38.2967 37.0535 38.2529 37.1239 38.1947V38.1947L37.2132 38.0742L43.0944 32.1601C43.1645 32.1026 43.2227 32.0317 43.2655 31.9515C43.3083 31.8714 43.335 31.7835 43.344 31.6929C43.353 31.6024 43.3442 31.5109 43.318 31.4238C43.2918 31.3367 43.2488 31.2557 43.1914 31.1853V31.1853C43.165 31.1521 43.135 31.122 43.102 31.0955L41.914 29.9008C41.7636 29.7726 41.5717 29.7042 41.3746 29.7084C41.1775 29.7127 40.9887 29.7892 40.8438 29.9237L40.8476 29.9142Z" fill="#C0C0C0"/>
<path d="M37.2246 25.208L43.1058 31.1221C43.1755 31.1801 43.2332 31.2513 43.2755 31.3316C43.3178 31.412 43.3439 31.5 43.3524 31.5905C43.3609 31.6811 43.3515 31.7724 43.3249 31.8593C43.2982 31.9462 43.2548 32.0269 43.1971 32.097V32.097C43.1702 32.1297 43.1403 32.1598 43.1077 32.1868L41.9197 33.3815C41.8625 33.452 41.792 33.5104 41.7123 33.5535C41.6325 33.5966 41.5452 33.6234 41.4551 33.6324C41.3651 33.6415 41.2741 33.6326 41.1875 33.6063C41.1009 33.5799 41.0202 33.5367 40.9503 33.479H40.9389C40.9063 33.4519 40.8764 33.4219 40.8495 33.3891L34.9683 27.4712C34.8978 27.4139 34.8393 27.3432 34.7962 27.2631C34.7531 27.183 34.7261 27.0951 34.7169 27.0045C34.7077 26.9138 34.7165 26.8223 34.7427 26.7351C34.7688 26.6479 34.8119 26.5667 34.8695 26.4963V26.4868C34.8953 26.4531 34.9253 26.4229 34.9588 26.3969L36.1468 25.2023C36.2946 25.0719 36.4844 25 36.681 25C36.8775 25 37.0674 25.0719 37.2151 25.2023L37.2246 25.208Z" fill="#EBEBEB"/>
<path d="M13.5078 29.9142L19.3872 35.8283C19.4576 35.8855 19.5161 35.9562 19.5593 36.0363C19.6024 36.1164 19.6294 36.2044 19.6386 36.295C19.6477 36.3856 19.639 36.4772 19.6128 36.5644C19.5866 36.6516 19.5435 36.7327 19.486 36.8031V36.8146L19.3967 36.9044L18.2086 38.0991C18.1508 38.1699 18.0796 38.2286 17.9991 38.2717C17.9187 38.3148 17.8306 38.3416 17.7398 38.3505C17.6491 38.3594 17.5575 38.3502 17.4703 38.3234C17.3831 38.2967 17.302 38.2529 17.2316 38.1947V38.1947L17.1423 38.0742L11.261 32.1601C11.1909 32.1026 11.1328 32.0317 11.09 31.9515C11.0471 31.8714 11.0205 31.7835 11.0115 31.6929C11.0025 31.6024 11.0113 31.5109 11.0375 31.4238C11.0637 31.3367 11.1067 31.2557 11.1641 31.1853V31.1853C11.1905 31.1521 11.2204 31.122 11.2534 31.0955L12.4415 29.9008C12.5919 29.7726 12.7838 29.7042 12.9809 29.7084C13.178 29.7127 13.3668 29.7892 13.5116 29.9237L13.5078 29.9142Z" fill="#C0C0C0"/>
<path d="M17.1309 25.208L11.2496 31.1221C11.1799 31.1801 11.1223 31.2513 11.08 31.3316C11.0377 31.412 11.0115 31.5 11.0031 31.5905C10.9946 31.6811 11.0039 31.7724 11.0306 31.8593C11.0572 31.9462 11.1007 32.0269 11.1584 32.097V32.097C11.1853 32.1297 11.2152 32.1598 11.2477 32.1868L12.4358 33.3815C12.493 33.452 12.5635 33.5104 12.6432 33.5535C12.7229 33.5966 12.8103 33.6234 12.9004 33.6324C12.9904 33.6415 13.0814 33.6326 13.168 33.6063C13.2546 33.5799 13.3352 33.5367 13.4052 33.479H13.4166C13.4492 33.4519 13.4791 33.4219 13.5059 33.3891L19.3872 27.4712C19.4576 27.4139 19.5161 27.3432 19.5593 27.2631C19.6024 27.183 19.6294 27.0951 19.6386 27.0045C19.6477 26.9138 19.639 26.8223 19.6128 26.7351C19.5866 26.6479 19.5435 26.5667 19.486 26.4963V26.4868C19.4602 26.4531 19.4301 26.4229 19.3967 26.3969L18.2086 25.2023C18.0609 25.0719 17.8711 25 17.6745 25C17.4779 25 17.2881 25.0719 17.1404 25.2023L17.1309 25.208Z" fill="#EBEBEB"/>
<rect width="14.8747" height="4.04902" rx="1.30783" transform="matrix(0.571432 -0.82065 0.817646 0.575722 21.4341 37.3999)" fill="url(#paint1_linear_447_2063)"/>
<defs>
<linearGradient id="paint0_linear_447_2063" x1="8.6728" y1="13.7333" x2="45.9503" y2="53.3927" gradientUnits="userSpaceOnUse">
<stop stop-color="#3E92CC"/>
<stop offset="1" stop-color="#29638B"/>
</linearGradient>
<linearGradient id="paint1_linear_447_2063" x1="15.7743" y1="0.947154" x2="0.0996697" y2="4.8518" gradientUnits="userSpaceOnUse">
<stop stop-color="#E4E4E4"/>
<stop offset="1" stop-color="#CECECE"/>
</linearGradient>
</defs>
</svg>
