<svg width="60" height="60" viewBox="0 0 60 60" fill="none" xmlns="http://www.w3.org/2000/svg">
<rect x="7.39983" y="7.39983" width="45.2003" height="45.2003" rx="3.59849" fill="url(#paint0_linear_447_2523)" stroke="#FBF3E3" stroke-width="0.799664"/>
<path d="M17.2034 19H15.8216L13.5833 15.1136H13.5545C13.5593 15.2336 13.5641 15.3559 13.5689 15.4807C13.5737 15.6006 13.5785 15.723 13.5833 15.8477C13.5929 15.9677 13.6001 16.09 13.6049 16.2148C13.6097 16.3347 13.6145 16.4571 13.6193 16.5818V19H12.6477V13.8614H14.0223L16.2534 17.7117H16.275C16.2702 17.5918 16.2654 17.4742 16.2606 17.3591C16.2558 17.2391 16.251 17.1216 16.2462 17.0064C16.2462 16.8865 16.2438 16.7689 16.239 16.6538C16.2342 16.5338 16.2294 16.4139 16.2246 16.2939V13.8614H17.2034V19ZM21.8417 17.028C21.8417 17.3543 21.7961 17.6446 21.705 17.8989C21.6186 18.1532 21.4914 18.3691 21.3235 18.5466C21.1604 18.7193 20.9613 18.8513 20.7262 18.9424C20.4911 19.0288 20.2248 19.072 19.9273 19.072C19.6538 19.072 19.3995 19.0288 19.1644 18.9424C18.9341 18.8513 18.735 18.7193 18.5671 18.5466C18.3991 18.3691 18.2672 18.1532 18.1712 17.8989C18.0801 17.6446 18.0345 17.3543 18.0345 17.028C18.0345 16.5914 18.1113 16.2244 18.2648 15.9269C18.4183 15.6246 18.639 15.3943 18.9269 15.236C19.2148 15.0776 19.5555 14.9985 19.9489 14.9985C20.3183 14.9985 20.6446 15.0776 20.9277 15.236C21.2108 15.3943 21.4339 15.6246 21.597 15.9269C21.7601 16.2244 21.8417 16.5914 21.8417 17.028ZM19.1284 17.028C19.1284 17.2871 19.1548 17.5054 19.2076 17.683C19.2652 17.8557 19.3539 17.9876 19.4739 18.0788C19.5938 18.1652 19.7498 18.2083 19.9417 18.2083C20.1336 18.2083 20.2871 18.1652 20.4023 18.0788C20.5222 17.9876 20.6086 17.8557 20.6614 17.683C20.719 17.5054 20.7478 17.2871 20.7478 17.028C20.7478 16.7689 20.719 16.553 20.6614 16.3803C20.6086 16.2076 20.5222 16.078 20.4023 15.9917C20.2823 15.9053 20.1264 15.8621 19.9345 15.8621C19.6514 15.8621 19.4451 15.9605 19.3156 16.1572C19.1908 16.3491 19.1284 16.6394 19.1284 17.028ZM24.2393 18.2155C24.3592 18.2155 24.4744 18.2035 24.5848 18.1795C24.6951 18.1556 24.8055 18.1268 24.9158 18.0932V18.892C24.8007 18.94 24.6567 18.9808 24.484 19.0144C24.3161 19.0528 24.1313 19.072 23.9298 19.072C23.6947 19.072 23.4836 19.0336 23.2965 18.9568C23.1142 18.8801 22.9678 18.7481 22.8575 18.561C22.7519 18.3691 22.6991 18.1052 22.6991 17.7693V15.8765H22.1882V15.4231L22.7783 15.0633L23.0878 14.2356H23.7715V15.0705H24.8726V15.8765H23.7715V17.7693C23.7715 17.9181 23.8147 18.0308 23.901 18.1076C23.9874 18.1795 24.1002 18.2155 24.2393 18.2155ZM27.1799 14.9985C27.5446 14.9985 27.8565 15.0681 28.1155 15.2072C28.3794 15.3463 28.5833 15.5479 28.7273 15.8117C28.8712 16.0756 28.9432 16.3995 28.9432 16.7833V17.3015H26.4099C26.4195 17.6038 26.5082 17.8413 26.6761 18.014C26.8489 18.1867 27.0864 18.2731 27.3886 18.2731C27.6429 18.2731 27.8732 18.2491 28.0796 18.2011C28.2859 18.1484 28.4994 18.0692 28.7201 17.9636V18.7913C28.5282 18.8872 28.3243 18.9568 28.1083 19C27.8972 19.048 27.6405 19.072 27.3383 19.072C26.9448 19.072 26.597 19 26.2947 18.8561C25.9924 18.7073 25.7549 18.4842 25.5822 18.1867C25.4095 17.8893 25.3231 17.515 25.3231 17.064C25.3231 16.6034 25.3999 16.222 25.5534 15.9197C25.7118 15.6126 25.9301 15.3823 26.2083 15.2288C26.4866 15.0752 26.8105 14.9985 27.1799 14.9985ZM27.1871 15.7614C26.9808 15.7614 26.8081 15.8285 26.669 15.9629C26.5346 16.0972 26.4554 16.3059 26.4315 16.589H27.9356C27.9356 16.4307 27.9068 16.2891 27.8493 16.1644C27.7965 16.0396 27.7149 15.9413 27.6046 15.8693C27.4942 15.7973 27.3551 15.7614 27.1871 15.7614Z" fill="#CFB989"/>
<rect x="15" y="24" width="31.9156" height="0.839885" fill="#DAC494"/>
<rect x="15" y="40.7979" width="31.9156" height="0.839885" fill="#DAC494"/>
<rect x="15" y="32.3989" width="31.9156" height="0.839885" fill="#DAC494"/>
<g filter="url(#filter0_d_447_2523)">
<path d="M38.0001 40.2642C38.0001 39.0137 38.9789 38 40.1863 38L53 38L43.5257 47.428L38 53L38.0001 40.2642Z" fill="url(#paint1_linear_447_2523)"/>
</g>
<path d="M53.0001 49.2264C53.0001 51.3105 51.3689 53 49.3566 53L38.0002 53L47.4284 43.282L53.0002 38L53.0001 49.2264Z" fill="#CFB989"/>
<defs>
<filter id="filter0_d_447_2523" x="36.3455" y="36.3455" width="18.309" height="18.309" filterUnits="userSpaceOnUse" color-interpolation-filters="sRGB">
<feFlood flood-opacity="0" result="BackgroundImageFix"/>
<feColorMatrix in="SourceAlpha" type="matrix" values="0 0 0 0 0 0 0 0 0 0 0 0 0 0 0 0 0 0 127 0" result="hardAlpha"/>
<feOffset/>
<feGaussianBlur stdDeviation="0.827239"/>
<feComposite in2="hardAlpha" operator="out"/>
<feColorMatrix type="matrix" values="0 0 0 0 0 0 0 0 0 0 0 0 0 0 0 0 0 0 0.25 0"/>
<feBlend mode="normal" in2="BackgroundImageFix" result="effect1_dropShadow_447_2523"/>
<feBlend mode="normal" in="SourceGraphic" in2="effect1_dropShadow_447_2523" result="shape"/>
</filter>
<linearGradient id="paint0_linear_447_2523" x1="9.68333" y1="8.5082" x2="41.1968" y2="51.9893" gradientUnits="userSpaceOnUse">
<stop stop-color="#EBD08A"/>
<stop offset="0.826042" stop-color="#FFECBA"/>
<stop offset="1" stop-color="#FFE5A0"/>
</linearGradient>
<linearGradient id="paint1_linear_447_2523" x1="38.0226" y1="37.7142" x2="47.3368" y2="46.4739" gradientUnits="userSpaceOnUse">
<stop stop-color="#FFF1CD"/>
<stop offset="1" stop-color="#F3DCA0"/>
</linearGradient>
</defs>
</svg>
