<svg width="60" height="60" viewBox="0 0 60 60" fill="none" xmlns="http://www.w3.org/2000/svg">
<path d="M43.2452 53.0764C43.2452 53.5552 42.9857 54.0755 42.6672 54.0755H20.2791C19.9574 54.0755 19.6981 53.5551 19.698 53.0764C19.6979 52.5978 20.178 52.0774 20.4996 52.0774L42.4645 52.0774C42.783 52.0751 43.2452 52.5977 43.2452 53.0764Z" fill="#45494D"/>
<path d="M21.2873 51.1805C21.3245 51.1492 21.3716 51.1321 21.4202 51.1321H41.7154C41.7704 51.1321 41.8231 51.154 41.8618 51.1931L43.0864 52.4269C43.2157 52.5572 43.1235 52.779 42.9399 52.779H19.954C19.7614 52.779 19.6737 52.5384 19.8211 52.4144L21.2873 51.1805Z" fill="url(#paint0_linear_447_2777)"/>
<rect x="28.5283" y="46.2263" width="5.88679" height="5.88679" fill="url(#paint1_linear_447_2777)"/>
<path d="M7.92456 14.5359C7.92456 14.1566 8.23528 13.8491 8.61858 13.8491H54.3249C54.7082 13.8491 55.0189 14.1566 55.0189 14.5359V45.5397C55.0189 45.919 54.7082 46.2265 54.3249 46.2265H8.61858C8.23528 46.2265 7.92456 45.919 7.92456 45.5397V14.5359Z" fill="url(#paint2_linear_447_2777)"/>
<path fill-rule="evenodd" clip-rule="evenodd" d="M8.62813 12.8679H54.3152C55.2457 12.8679 56 13.6147 56 14.5358V45.5396C56 46.4608 55.2457 47.2075 54.3152 47.2075H8.62813C7.69766 47.2075 6.94336 46.4608 6.94336 45.5396V14.5358C6.94336 13.6147 7.69766 12.8679 8.62813 12.8679ZM8.62813 13.8491C8.245 13.8491 7.9344 14.1565 7.9344 14.5358V45.5396C7.9344 45.9189 8.24499 46.2264 8.62813 46.2264H54.3152C54.6983 46.2264 55.0089 45.9189 55.0089 45.5396V14.5358C55.0089 14.1565 54.6983 13.8491 54.3152 13.8491H8.62813Z" fill="#243438"/>
<path d="M32.1136 34.5445C39.438 39.092 46.5935 42.1884 54.0378 44.0614V15.2867C54.0378 15.0372 53.7335 14.8301 53.372 14.8301H13.1759C17.3048 22.8926 24.4106 29.7628 32.1152 34.5445H32.1136ZM32.1723 39.3735C23.3351 34.3855 14.4872 27.4764 8.90576 18.9446V44.7886C8.90576 45.0389 9.20687 45.2452 9.56835 45.2452H45.3197C40.9525 43.7866 36.5975 41.8747 32.174 39.3769" fill="#EEFAFF" fill-opacity="0.1"/>
<path d="M4 18.7547C4 21.2774 4.74805 23.7433 6.14956 25.8409C7.55106 27.9384 9.54308 29.5732 11.8737 30.5385C14.2043 31.5039 16.7689 31.7565 19.243 31.2643C21.7172 30.7722 23.9899 29.5574 25.7737 27.7737C27.5574 25.9899 28.7722 23.7172 29.2643 21.243C29.7565 18.7689 29.5039 16.2043 28.5385 13.8737C27.5732 11.5431 25.9384 9.55106 23.8409 8.14956C21.7433 6.74805 19.2774 6 16.7547 6C13.372 6 10.1277 7.3438 7.73577 9.73577C5.3438 12.1277 4 15.372 4 18.7547Z" fill="#27A4D6"/>
<path d="M20.8737 9.33609C22.5423 9.33482 24.2025 9.57135 25.8042 10.0386C23.9405 8.02706 21.4698 6.68063 18.7692 6.20481C16.0686 5.72898 13.2865 6.1499 10.8476 7.4033C8.40858 8.65671 6.44673 10.6737 5.26146 13.1465C4.07619 15.6193 3.7326 18.4121 4.28315 21.0984C5.49007 17.6612 7.73441 14.6835 10.7062 12.5765C13.6781 10.4696 17.2308 9.33731 20.8737 9.33609Z" fill="#35C8F0"/>
<path d="M20.4644 6.61211C23.8267 8.92071 25.9457 12.3028 25.9457 16.0675C25.9457 23.0312 18.6901 28.6774 9.75088 28.6774C9.54311 28.6774 9.33038 28.6774 9.12426 28.6675C10.5886 29.748 12.2702 30.4976 14.0527 30.8641C15.8352 31.2307 17.6761 31.2057 19.448 30.7907C21.2199 30.3757 22.8804 29.5806 24.3147 28.4606C25.7491 27.3405 26.9229 25.9222 27.7551 24.3038C28.5872 22.6854 29.0578 20.9054 29.1342 19.0872C29.2107 17.269 28.8911 15.4559 28.1978 13.7733C27.5044 12.0907 26.4537 10.5789 25.1185 9.34244C23.7832 8.10596 22.1952 7.17437 20.4644 6.61211Z" fill="#1B7DAE"/>
<path d="M20.6616 18.9342C20.4146 18.786 20.1547 18.6607 19.8849 18.5599C19.5749 18.4659 19.7299 18.0059 19.7299 18.0059C19.7299 18.0059 19.9129 18.2829 20.4389 18.3769C20.965 18.4709 21.8274 18.5913 22.0715 18.9013C22.3155 19.2113 22.3485 19.396 22.4705 19.5163C22.568 19.6461 22.6412 19.7925 22.6865 19.9484C22.6865 19.9484 22.1786 19.8676 22.0715 19.6384C21.9643 19.4092 21.8554 19.053 21.7631 19.1437C21.6708 19.2344 21.7301 19.5757 21.3921 19.5757C21.054 19.5757 20.96 19.2673 20.716 19.2063C20.4719 19.1453 20.655 18.9293 20.655 18.9293L20.6616 18.9342ZM19.2764 12.5246L20.1388 12.3696L20.5709 11.9062L20.4488 11.4692L20.6319 10.7931L20.3796 10.4271C20.3796 10.4271 20.3796 9.71963 20.1026 9.60255C19.8255 9.48548 19.9179 8.71045 19.9179 8.71045L19.9508 8.55709L19.6458 8.83082L19.8305 9.63224L20.1075 10.4337L20.1388 11.8221L19.4924 12.2179L18.9977 12.8659L19.2748 12.5279L19.2764 12.5246ZM19.9228 10.9531L19.7398 10.7041L19.5238 10.7371L19.4627 11.1394L19.6788 11.1724L19.9228 10.9564V10.9531ZM22.3584 21.5809C22.3584 21.5809 22.3271 21.0268 22.0814 21.0268C21.8357 21.0268 21.7433 20.4117 21.7433 20.4117L21.2486 19.8874C21.2486 19.8874 21.2486 20.6558 21.2816 20.7795C21.3146 20.9032 20.9435 21.0878 20.8496 21.0268C20.6897 20.8439 20.5452 20.6481 20.4175 20.4414C20.4175 20.4414 20.556 20.1479 20.3565 20.1644C20.344 20.1616 20.3311 20.1616 20.3186 20.1644C20.2691 20.1644 20.1867 20.1446 20.0514 20.1281L19.4133 20.0506L19.3424 20.3112C19.1613 20.4649 18.9645 20.5992 18.7553 20.7119C18.541 20.8042 18.292 21.7013 18.0149 21.7013C17.7379 21.7013 17.3388 21.7342 17.3388 21.7342C17.3388 21.7342 16.8441 22.5587 17.009 22.8737C17.1657 23.1784 17.2293 23.5225 17.1921 23.8631C17.1607 24.2325 17.225 24.1715 17.7461 24.0791C18.2672 23.9868 18.7026 23.2761 19.2863 23.403C19.4632 23.4481 19.6261 23.5362 19.7605 23.6597C19.8949 23.7832 19.9966 23.938 20.0564 24.1105L20.5511 23.6801C20.5511 23.6801 20.4901 23.9884 20.3977 24.0181C20.3054 24.0478 20.4901 24.0791 20.6137 24.2951C20.7374 24.5112 21.4119 24.8162 22.2776 23.9851C23.1433 23.154 22.8316 22.445 22.8316 22.445L22.3584 21.5809ZM8.83659 20.8438C8.8976 20.2567 8.55955 20.4117 8.58924 19.5807C8.61892 18.7496 9.75178 16.807 9.66109 16.807C9.57039 16.807 9.04601 17.2077 8.85802 17.1781C8.67004 17.1484 7.86862 15.3295 7.86862 15.0525C7.81904 14.6094 7.74694 14.1691 7.6526 13.7333C7.6526 13.7333 7.89995 14.4424 8.08464 14.4753C8.26933 14.5083 8.33199 15.2768 8.4837 15.6461C8.63541 16.0155 9.13011 16.6355 9.44012 16.6042C9.75013 16.5729 10.7033 14.848 10.7033 14.848L10.1772 14.5397L9.62646 14.8695C9.54105 14.6569 9.42853 14.4563 9.29171 14.2725C9.10867 14.0565 9.1367 13.5321 9.26038 13.5321C9.38405 13.5321 9.52092 13.89 10.1525 14.3022C10.7841 14.7145 11.353 14.3022 11.4717 14.3962C11.5904 14.4902 12.0868 14.8909 12.1197 15.1366C12.3211 15.8428 12.5695 16.5348 12.8634 17.2077C12.9574 17.3298 13.3268 16.7757 13.4785 16.0666C13.6302 15.3576 14.3706 15.0212 14.6196 14.8332C14.8686 14.6452 14.8356 15.0492 14.989 15.4202C15.1424 15.7913 15.5431 16.0056 15.7294 16.1606C15.9157 16.3156 15.7624 16.807 16.0691 16.807C16.3758 16.807 16.6215 16.2827 16.6215 16.2827L16.4071 15.6973C16.1911 15.1102 16.4995 15.0492 16.7765 14.9272C17.0536 14.8052 17.5466 14.3401 17.8846 13.819C18.2227 13.298 17.6076 12.8016 17.4213 12.3349C17.2349 11.8683 17.6373 11.9029 17.8533 11.8699C18.0693 11.8369 18.2837 13.0721 18.2837 13.0721L18.6828 12.856C18.6147 12.5927 18.5202 12.3369 18.4008 12.0925C18.2161 11.7232 18.6481 11.7232 19.1692 11.1691C19.6903 10.615 19.3951 10.3446 19.4182 9.65862C19.4413 8.97264 18.7702 9.04354 18.7702 9.04354C18.7702 9.04354 18.6152 9.29089 18.8031 8.42682C18.9911 7.56274 20.2526 8.05744 20.5577 8.02776C20.8001 8.00302 21.1018 7.40609 21.2173 7.15214C19.3974 6.4102 17.4265 6.11399 15.4689 6.28821C13.5113 6.46243 11.6237 7.10203 9.96347 8.1537C8.30321 9.20536 6.91835 10.6386 5.92434 12.334C4.93032 14.0295 4.35594 15.9379 4.24907 17.9003C4.42754 17.9974 4.61918 18.0679 4.81797 18.1097C5.31267 18.2021 5.095 18.9722 5.12798 19.3712C5.15736 19.7973 5.26175 20.2149 5.43635 20.6047C5.62104 21.0037 5.37533 21.2527 5.28299 21.5298C5.19065 21.8068 5.40502 22.2388 5.59135 22.2388C5.77769 22.2388 5.25331 23.1953 5.8387 24.1797C6.4241 25.1642 7.28817 24.0874 7.68888 22.6692C8.08959 21.2511 8.76733 21.4325 8.82834 20.8471L8.83659 20.8438ZM16.7881 18.1609L17.0371 18.6556L17.5614 18.9029C17.5614 18.9029 17.7445 18.1625 18.0561 17.7948C18.3678 17.4271 17.8715 17.0857 17.6571 17.0247L16.7881 18.1609ZM21.9165 9.71634C21.9256 9.75019 21.9419 9.78169 21.9643 9.80868C21.9643 9.80868 21.9362 9.77405 21.9082 9.71634H21.9165ZM18.2144 19.6911C18.0495 19.6417 17.794 19.5675 17.4031 19.4586C16.4137 19.1816 16.6627 19.2756 16.3247 19.0596C15.9867 18.8436 16.2917 18.7496 16.356 18.4725C16.4203 18.1955 16.0477 17.3001 16.0477 17.3001L15.6766 16.9917L15.5843 17.5458L15.1852 17.6678L15.6799 18.8403C15.6799 18.8403 16.5044 19.5493 17.0371 19.7967C17.3372 19.9418 17.8467 19.8165 18.2062 19.6911H18.2144ZM9.29171 23.0007C9.29171 23.0007 9.78641 22.1086 9.87875 21.6815C9.9711 21.2544 9.81774 20.5734 9.81774 20.5734C9.81774 20.5734 9.16968 21.0681 9.29171 21.1274C9.41373 21.1868 9.10867 21.4572 9.04436 21.9519C8.98005 22.4466 9.29171 23.0007 9.29171 23.0007ZM21.6988 7.34672C21.4283 7.67652 21.0639 8.15473 21.0639 8.33612C21.0639 8.61315 21.496 8.61315 21.5273 8.83082C21.6279 9.13927 21.7565 9.43788 21.9115 9.72293C21.893 9.66174 21.8877 9.59733 21.896 9.53394C21.9042 9.47055 21.9258 9.40963 21.9593 9.3552C22.1143 9.07817 22.1424 8.43012 21.9907 8.15473C21.9165 8.02116 22.0104 7.78371 22.1259 7.56439C21.9841 7.49019 21.8439 7.41928 21.6988 7.35497V7.34672ZM18.4931 19.5757C18.5805 19.5411 18.6316 19.5147 18.6316 19.5147C18.5832 19.5342 18.5359 19.5562 18.4898 19.5807L18.4931 19.5757ZM18.3843 19.7274C18.2936 19.6911 18.3942 19.6235 18.4931 19.5724C18.4189 19.6054 18.3282 19.6433 18.2095 19.6829C18.4585 19.7587 18.4783 19.7653 18.3843 19.7274Z" fill="#E8EEEF"/>
<defs>
<linearGradient id="paint0_linear_447_2777" x1="31.3996" y1="51.1321" x2="31.3996" y2="52.6337" gradientUnits="userSpaceOnUse">
<stop stop-color="#C5CED5"/>
<stop offset="1" stop-color="#C6CED6"/>
</linearGradient>
<linearGradient id="paint1_linear_447_2777" x1="31.4717" y1="46.2263" x2="31.4717" y2="52.1131" gradientUnits="userSpaceOnUse">
<stop stop-color="#AEAEAE"/>
<stop offset="1" stop-color="#BFBEBE"/>
</linearGradient>
<linearGradient id="paint2_linear_447_2777" x1="7.92456" y1="13.8491" x2="54.0442" y2="47.174" gradientUnits="userSpaceOnUse">
<stop stop-color="#96E6FF"/>
<stop offset="1" stop-color="#28A6DE"/>
</linearGradient>
</defs>
</svg>
