<svg width="60" height="60" viewBox="0 0 60 60" fill="none" xmlns="http://www.w3.org/2000/svg">
<circle cx="30.0624" cy="30.0624" r="26.0624" fill="url(#paint0_linear_447_5072)"/>
<path d="M47.6398 27.6786C44.0716 26.9923 42.4355 22.8232 44.5842 19.8936L46.0936 17.8355L42.8328 14.5748L40.8055 15.9481C37.7975 17.9862 33.6922 16.1948 33.1404 12.6043L32.7523 10.0813H28.1412L27.5441 13.1868C26.8732 16.6759 22.8524 18.342 19.9105 16.3492L17.2922 14.5748L14.0314 17.8355L15.5408 19.8936C17.6895 22.8232 16.0526 26.9923 12.4852 27.6786L10.0813 28.1412V32.7523L12.6043 33.1404C16.1955 33.6929 17.9862 37.7983 15.9481 40.8062L14.5748 42.8328L17.8355 46.0936L19.8936 44.5842C22.8232 42.4355 26.9923 44.0716 27.6786 47.6398L28.1412 50.0437H32.7523L33.0251 48.2692C33.59 44.5988 37.8467 42.8351 40.8416 45.0315L42.2895 46.0936L45.5502 42.8328L44.1769 40.8062C42.1396 37.7983 43.9302 33.6929 47.5207 33.1404L50.0437 32.7523V28.1412L47.6398 27.6786ZM30.4468 33.905C29.9926 33.9051 29.5428 33.8157 29.1232 33.6419C28.7036 33.4681 28.3223 33.2134 28.0011 32.8923C27.68 32.5711 27.4252 32.1899 27.2514 31.7703C27.0776 31.3507 26.9881 30.9009 26.9881 30.4468C26.9881 29.9926 27.0776 29.5428 27.2514 29.1232C27.4252 28.7036 27.68 28.3224 28.0011 28.0012C28.3223 27.6801 28.7036 27.4254 29.1232 27.2516C29.5428 27.0778 29.9926 26.9884 30.4468 26.9885C31.3639 26.9886 32.2434 27.353 32.8919 28.0015C33.5404 28.6501 33.9047 29.5296 33.9047 30.4468C33.9047 31.3639 33.5404 32.2435 32.8919 32.892C32.2434 33.5405 31.3639 33.9049 30.4468 33.905Z" fill="url(#paint1_linear_447_5072)"/>
<path opacity="0.2" d="M30.4468 23.146C26.4145 23.146 23.146 26.4145 23.146 30.4468C23.146 34.4792 26.4145 37.7476 30.4468 37.7476C34.4792 37.7476 37.7476 34.4792 37.7476 30.4468C37.7476 26.4145 34.4792 23.146 30.4468 23.146ZM30.4468 33.9051C29.9926 33.9052 29.5429 33.8157 29.1233 33.642C28.7037 33.4682 28.3224 33.2135 28.0012 32.8923C27.68 32.5712 27.4253 32.1899 27.2515 31.7703C27.0776 31.3507 26.9882 30.901 26.9882 30.4468C26.9882 29.9926 27.0776 29.5429 27.2515 29.1233C27.4253 28.7037 27.68 28.3224 28.0012 28.0013C28.3224 27.6802 28.7037 27.4254 29.1233 27.2517C29.5429 27.0779 29.9926 26.9885 30.4468 26.9885C31.3639 26.9886 32.2435 27.353 32.892 28.0016C33.5404 28.6501 33.9047 29.5297 33.9047 30.4468C33.9047 31.3639 33.5404 32.2435 32.892 32.8921C32.2435 33.5406 31.3639 33.905 30.4468 33.9051Z" fill="black" stroke="black" stroke-width="2.77999"/>
<defs>
<linearGradient id="paint0_linear_447_5072" x1="30.0624" y1="4" x2="30.0624" y2="56.1249" gradientUnits="userSpaceOnUse">
<stop stop-color="#6F7795"/>
<stop offset="1" stop-color="#525870"/>
</linearGradient>
<linearGradient id="paint1_linear_447_5072" x1="30.0625" y1="10.0813" x2="30.0625" y2="50.0437" gradientUnits="userSpaceOnUse">
<stop stop-color="#DEE0E5"/>
<stop offset="1" stop-color="#BFC1C8"/>
</linearGradient>
</defs>
</svg>
