<svg width="60" height="60" viewBox="0 0 60 60" fill="none" xmlns="http://www.w3.org/2000/svg">
<circle cx="30" cy="30" r="26" fill="url(#paint0_linear_447_3046)"/>
<path fill-rule="evenodd" clip-rule="evenodd" d="M23.5093 18.3456C24.4394 17.8464 25.5712 17.8907 26.4585 18.4611L40.6869 27.6072C41.5059 28.1337 42 29.034 42 30C42 30.966 41.5059 31.8663 40.6869 32.3928L26.4585 41.5389C25.5712 42.1093 24.4394 42.1536 23.5093 41.6544C22.5792 41.1553 22 40.1927 22 39.1462V20.8538C22 19.8073 22.5792 18.8447 23.5093 18.3456Z" fill="url(#paint1_linear_447_3046)"/>
<defs>
<linearGradient id="paint0_linear_447_3046" x1="42.4507" y1="8.39437" x2="15.3521" y2="50.507" gradientUnits="userSpaceOnUse">
<stop stop-color="#FF934A"/>
<stop offset="0.4875" stop-color="#C6718A"/>
<stop offset="1" stop-color="#8861C2"/>
</linearGradient>
<linearGradient id="paint1_linear_447_3046" x1="32" y1="20.8538" x2="32" y2="39.1462" gradientUnits="userSpaceOnUse">
<stop stop-color="#FEFEFE"/>
<stop offset="1" stop-color="#F0F0F0" stop-opacity="0.5"/>
</linearGradient>
</defs>
</svg>
