<svg width="60" height="60" viewBox="0 0 60 60" fill="none" xmlns="http://www.w3.org/2000/svg">
<path d="M17 11.9527C17 11.696 17.0491 11.4418 17.1444 11.2047C17.2397 10.9676 17.3793 10.7523 17.5554 10.5709C17.7315 10.3895 17.9404 10.2458 18.1704 10.1478C18.4004 10.0498 18.6468 9.99962 18.8956 10H51.1044C51.6066 10 52.0884 10.2056 52.4438 10.5718C52.7992 10.9379 52.9992 11.4345 53 11.9527V51.0473C52.9992 51.5655 52.7992 52.0621 52.4438 52.4282C52.0884 52.7944 51.6066 53 51.1044 53H18.8956C18.6468 53.0004 18.4004 52.9502 18.1704 52.8522C17.9404 52.7542 17.7315 52.6105 17.5554 52.4291C17.3793 52.2477 17.2397 52.0323 17.1444 51.7952C17.0491 51.5581 17 51.304 17 51.0473V11.9527Z" fill="url(#paint0_linear_447_2195)"/>
<path d="M7 10.5514C7.0004 10.1346 7.13852 9.72945 7.39308 9.39841C7.64765 9.06738 8.00454 8.82881 8.40878 8.71944L25.589 4.06689C25.8308 4.00126 26.0832 3.9837 26.3318 4.01521C26.5805 4.04671 26.8204 4.12667 27.0379 4.2505C27.2555 4.37434 27.4463 4.53962 27.5996 4.73691C27.7529 4.93419 27.8656 5.15961 27.9313 5.40026C27.977 5.56353 28.0001 5.73222 28 5.9017V54.0997C28 54.6037 27.7988 55.087 27.4406 55.4434C27.0824 55.7998 26.5967 56 26.0901 56C25.921 55.9996 25.7526 55.9776 25.589 55.9345L8.40878 51.2705C8.00407 51.161 7.64683 50.922 7.39222 50.5904C7.1376 50.2588 6.99977 49.853 7 49.4357V10.5514Z" fill="url(#paint1_linear_447_2195)"/>
<path d="M37.2915 20.2667C37.2906 20.0724 37.3494 19.8826 37.4599 19.7228C37.5704 19.563 37.7273 19.441 37.9094 19.3733C38.0915 19.3055 38.29 19.2953 38.4781 19.344C38.6661 19.3927 38.8347 19.498 38.961 19.6456L48.1579 30.3753C48.3041 30.5481 48.3843 30.7671 48.3843 30.9935C48.3843 31.2199 48.3041 31.4389 48.1579 31.6118L38.961 42.3414C38.8347 42.489 38.6661 42.5943 38.4781 42.643C38.29 42.6917 38.0915 42.6815 37.9094 42.6137C37.7273 42.546 37.5704 42.424 37.4599 42.2642C37.3494 42.1044 37.2906 41.9146 37.2915 41.7203V34.7913H32.5421C32.2904 34.7913 32.0491 34.6914 31.8712 34.5135C31.6933 34.3355 31.5933 34.0942 31.5933 33.8426V28.1444C31.5933 27.8928 31.6933 27.6515 31.8712 27.4736C32.0491 27.2956 32.2904 27.1957 32.5421 27.1957H37.2915V20.2667ZM20.197 27.1957C19.9475 27.1953 19.7005 27.2441 19.47 27.3393C19.2394 27.4345 19.0299 27.5742 18.8534 27.7504C18.6769 27.9267 18.5369 28.136 18.4413 28.3664C18.3458 28.5968 18.2966 28.8437 18.2966 29.0932V32.8938C18.3156 33.3847 18.524 33.8492 18.8781 34.1898C19.2321 34.5304 19.7043 34.7206 20.1955 34.7206C20.6868 34.7206 21.159 34.5304 21.513 34.1898C21.8671 33.8492 22.0754 33.3847 22.0945 32.8938V29.0932C22.0945 28.5899 21.8945 28.1073 21.5387 27.7514C21.1829 27.3956 20.7002 27.1957 20.197 27.1957Z" fill="url(#paint2_linear_447_2195)"/>
<defs>
<linearGradient id="paint0_linear_447_2195" x1="52.4953" y1="31.5066" x2="25.4641" y2="26.4677" gradientUnits="userSpaceOnUse">
<stop stop-color="#FFAA44"/>
<stop offset="1" stop-color="#E37B00"/>
</linearGradient>
<linearGradient id="paint1_linear_447_2195" x1="10.0947" y1="9.85346" x2="27.7171" y2="51.6706" gradientUnits="userSpaceOnUse">
<stop stop-color="#29B2E7"/>
<stop offset="1" stop-color="#0C6DBC"/>
</linearGradient>
<linearGradient id="paint2_linear_447_2195" x1="44.0001" y1="31" x2="5.00007" y2="31" gradientUnits="userSpaceOnUse">
<stop stop-color="white"/>
<stop offset="1" stop-color="white" stop-opacity="0"/>
</linearGradient>
</defs>
</svg>
