<svg width="60" height="60" viewBox="0 0 60 60" fill="none" xmlns="http://www.w3.org/2000/svg">
<path d="M7 11.005C7 8.79312 8.79312 7 11.005 7H15.857H48.995C51.2069 7 53 8.79312 53 11.005V48.9948C53 51.2067 51.2069 52.9998 48.995 52.9998H11.005C8.79312 52.9998 7 51.2067 7 48.9948V12.9046V11.005Z" fill="url(#paint0_linear_454_1048)"/>
<rect x="14.7754" y="11.7324" width="29.9043" height="33.7332" rx="2.66204" fill="#FFF7DD" fill-opacity="0.5"/>
<rect x="11.7847" y="15.5864" width="35.8851" height="36.7998" rx="2.66204" fill="#FFFFFD"/>
<g filter="url(#filter0_b_454_1048)">
<path d="M7 24.5237C7 23.314 7.98071 22.3333 9.19048 22.3333H15.857H50.8095C52.0193 22.3333 53 23.314 53 24.5237V50.8093C53 52.019 52.0193 52.9997 50.8095 52.9997H9.19048C7.98071 52.9997 7 52.019 7 50.8093V28.2379V24.5237Z" fill="url(#paint1_linear_454_1048)" fill-opacity="0.85"/>
</g>
<g filter="url(#filter1_d_454_1048)">
<mask id="mask0_454_1048" style="mask-type:alpha" maskUnits="userSpaceOnUse" x="19" y="23" width="35" height="30">
<rect x="19.7483" y="23.3333" width="33.3221" height="29.5714" rx="1.79221" fill="url(#paint2_linear_454_1048)"/>
</mask>
<g mask="url(#mask0_454_1048)">
<path d="M37.3494 40.4872C37.7048 40.0977 38.318 40.0977 38.6734 40.4872L49.6841 52.5545C50.209 53.1297 49.8009 54.0546 49.0222 54.0546H27.0006C26.2219 54.0546 25.8138 53.1297 26.3387 52.5545L37.3494 40.4872Z" fill="url(#paint3_linear_454_1048)"/>
<path d="M49.5228 45.0938C49.8784 44.7017 50.4946 44.7017 50.8502 45.0938L56.8745 51.7353C57.3968 52.3112 56.9882 53.2335 56.2107 53.2335H44.1623C43.3848 53.2335 42.9762 52.3112 43.4985 51.7353L49.5228 45.0938Z" fill="url(#paint4_linear_454_1048)" fill-opacity="0.5"/>
</g>
</g>
<g filter="url(#filter2_d_454_1048)">
<circle cx="18" cy="31" r="4" fill="url(#paint5_linear_454_1048)"/>
</g>
<defs>
<filter id="filter0_b_454_1048" x="2.97668" y="18.3099" width="54.0466" height="38.7132" filterUnits="userSpaceOnUse" color-interpolation-filters="sRGB">
<feFlood flood-opacity="0" result="BackgroundImageFix"/>
<feGaussianBlur in="BackgroundImage" stdDeviation="2.01166"/>
<feComposite in2="SourceAlpha" operator="in" result="effect1_backgroundBlur_454_1048"/>
<feBlend mode="normal" in="SourceGraphic" in2="effect1_backgroundBlur_454_1048" result="shape"/>
</filter>
<filter id="filter1_d_454_1048" x="24.3106" y="38.4029" width="30.5519" height="16.2941" filterUnits="userSpaceOnUse" color-interpolation-filters="sRGB">
<feFlood flood-opacity="0" result="BackgroundImageFix"/>
<feColorMatrix in="SourceAlpha" type="matrix" values="0 0 0 0 0 0 0 0 0 0 0 0 0 0 0 0 0 0 127 0" result="hardAlpha"/>
<feOffset/>
<feGaussianBlur stdDeviation="0.896104"/>
<feComposite in2="hardAlpha" operator="out"/>
<feColorMatrix type="matrix" values="0 0 0 0 0 0 0 0 0 0 0 0 0 0 0 0 0 0 0.15 0"/>
<feBlend mode="normal" in2="BackgroundImageFix" result="effect1_dropShadow_454_1048"/>
<feBlend mode="normal" in="SourceGraphic" in2="effect1_dropShadow_454_1048" result="shape"/>
</filter>
<filter id="filter2_d_454_1048" x="10.8138" y="23.8138" width="14.3724" height="14.3724" filterUnits="userSpaceOnUse" color-interpolation-filters="sRGB">
<feFlood flood-opacity="0" result="BackgroundImageFix"/>
<feColorMatrix in="SourceAlpha" type="matrix" values="0 0 0 0 0 0 0 0 0 0 0 0 0 0 0 0 0 0 127 0" result="hardAlpha"/>
<feOffset/>
<feGaussianBlur stdDeviation="1.59309"/>
<feComposite in2="hardAlpha" operator="out"/>
<feColorMatrix type="matrix" values="0 0 0 0 0 0 0 0 0 0 0 0 0 0 0 0 0 0 0.15 0"/>
<feBlend mode="normal" in2="BackgroundImageFix" result="effect1_dropShadow_454_1048"/>
<feBlend mode="normal" in="SourceGraphic" in2="effect1_dropShadow_454_1048" result="shape"/>
</filter>
<linearGradient id="paint0_linear_454_1048" x1="41.8833" y1="7.8493" x2="41.1945" y2="51.4807" gradientUnits="userSpaceOnUse">
<stop stop-color="#EE7923"/>
<stop offset="0.51875" stop-color="#E6721C"/>
<stop offset="1" stop-color="#E5711C"/>
</linearGradient>
<linearGradient id="paint1_linear_454_1048" x1="24.6435" y1="22.8231" x2="23.5192" y2="51.7954" gradientUnits="userSpaceOnUse">
<stop stop-color="#FFAB6E"/>
<stop offset="1" stop-color="#E6721D"/>
</linearGradient>
<linearGradient id="paint2_linear_454_1048" x1="40.895" y1="23.3332" x2="20.6334" y2="55.0756" gradientUnits="userSpaceOnUse">
<stop stop-color="#97D7E5"/>
<stop offset="0.534375" stop-color="#FFD4AE"/>
<stop offset="1" stop-color="#FFE993"/>
</linearGradient>
<linearGradient id="paint3_linear_454_1048" x1="38.9725" y1="40.3591" x2="38.9725" y2="52.0084" gradientUnits="userSpaceOnUse">
<stop stop-color="#FFF8F3"/>
<stop offset="1" stop-color="#FFEBD9"/>
</linearGradient>
<linearGradient id="paint4_linear_454_1048" x1="48.8026" y1="46.4015" x2="54.9302" y2="52.7374" gradientUnits="userSpaceOnUse">
<stop stop-color="#FFF9F4"/>
<stop offset="1" stop-color="#FFEEDB"/>
</linearGradient>
<linearGradient id="paint5_linear_454_1048" x1="15.8182" y1="27.7273" x2="22" y2="36.8182" gradientUnits="userSpaceOnUse">
<stop stop-color="white"/>
<stop offset="0.931818" stop-color="#E5E5E5"/>
</linearGradient>
</defs>
</svg>
