<svg width="60" height="60" viewBox="0 0 60 60" fill="none" xmlns="http://www.w3.org/2000/svg">
<path d="M29.9939 43.9785C31.2977 43.9831 32.5468 44.5031 33.4688 45.4251C34.3907 46.347 34.9107 47.5961 34.9154 48.9C34.9154 51.6007 32.6962 57.3416 29.9954 57.3416C27.2947 57.3416 25.074 51.6022 25.074 48.8984C25.0796 47.5953 25.5997 46.3472 26.5212 45.4257C27.4426 44.5043 28.6908 43.9841 29.9939 43.9785Z" fill="url(#paint0_linear_453_1159)"/>
<path d="M25.3098 47.3506L25.4549 47.4957C26.6662 48.7005 28.3052 49.3768 30.0137 49.3768C31.7222 49.3768 33.3612 48.7005 34.5725 47.4957L34.6697 47.3985C34.3488 46.4132 33.7255 45.554 32.8885 44.9431C32.0515 44.3322 31.0433 44.0005 30.007 43.9952C28.9708 43.9899 27.9592 44.3112 27.116 44.9136C26.2728 45.5159 25.6408 46.3687 25.3098 47.3506Z" fill="#DEB957"/>
<path d="M29.9975 29.3069C38.837 29.3069 45.9883 34.3549 45.99 42.1592V45.863C45.9949 53.6951 38.8304 41.6159 29.9975 41.6098C21.1646 41.6036 13.9983 53.7429 14 45.88L14 42.1762C14 34.3487 21.1596 29.3084 29.9975 29.3069Z" fill="url(#paint1_linear_453_1159)"/>
<path d="M29.9664 2.00981C33.0131 2.01136 42.0109 10.5255 42.0409 25.9397C42.0128 35.9508 40.3104 40.8738 40.3104 40.8738C38.9904 46.4944 35.1505 46.5654 29.9945 46.5654C24.8384 46.5654 20.9686 46.516 19.6805 40.8723C19.6805 40.8723 17.98 35.9014 17.95 25.8918C17.95 10.5024 26.8896 1.98666 29.9664 2.00981Z" fill="url(#paint2_linear_453_1159)"/>
<path fill-rule="evenodd" clip-rule="evenodd" d="M40.5373 40.1155C38.6439 43.7129 34.8529 43.7656 29.9985 43.7656C25.1713 43.7656 21.3716 43.7293 19.4824 40.1816C19.6063 40.6424 19.6849 40.8724 19.6849 40.8724C20.973 46.5161 24.8429 46.5655 29.9989 46.5655C35.155 46.5655 38.9948 46.4945 40.3148 40.8739C40.3148 40.8739 40.402 40.6218 40.5373 40.1155Z" fill="#7D8185"/>
<path d="M29.9945 17.9783C30.8788 17.9782 31.7433 18.2404 32.4787 18.7317C33.214 19.2229 33.7871 19.9212 34.1256 20.7382C34.464 21.5552 34.5526 22.4543 34.3801 23.3216C34.2076 24.189 33.7817 24.9857 33.1564 25.611C32.5311 26.2363 31.7344 26.6622 30.867 26.8347C29.9997 27.0072 29.1007 26.9186 28.2836 26.5802C27.4666 26.2417 26.7683 25.6686 26.2771 24.9333C25.7858 24.1979 25.5236 23.3334 25.5237 22.4491C25.5225 21.8617 25.6374 21.2798 25.8616 20.7368C26.0859 20.1939 26.4152 19.7005 26.8306 19.2852C27.246 18.8698 27.7393 18.5405 28.2822 18.3162C28.8252 18.092 29.4071 17.9771 29.9945 17.9783Z" fill="url(#paint3_linear_453_1159)"/>
<path d="M30.0178 32.6125C31.2246 32.6125 32.2138 35.9167 32.2138 41.8027C32.2138 47.6887 31.2246 50.2706 29.9931 50.2459C28.7878 50.2443 27.7754 47.6887 27.7754 41.8027C27.7985 35.8935 28.7677 32.6095 30.0116 32.6187L30.0178 32.6125Z" fill="url(#paint4_linear_453_1159)"/>
<path d="M27.576 20.0291C28.1347 19.4611 28.8734 19.1048 29.6657 19.0211C30.4581 18.9374 31.2549 19.1315 31.92 19.5703C32.5851 20.009 33.0771 20.6651 33.312 21.4265C33.5468 22.1879 33.5099 23.0072 33.2076 23.7443C32.9053 24.4815 32.3563 25.0908 31.6545 25.468C30.9527 25.8452 30.1417 25.967 29.3601 25.8125C28.5784 25.6579 27.8747 25.2367 27.3693 24.6208C26.8639 24.0048 26.5881 23.2325 26.589 22.4357C26.5871 21.9894 26.6733 21.547 26.8427 21.134C27.012 20.7211 27.2612 20.3456 27.576 20.0291ZM26.8159 19.269C26.3979 19.6826 26.0679 20.1765 25.8459 20.721C25.6239 21.2655 25.5145 21.8494 25.5243 22.4373C25.527 23.3225 25.7909 24.1871 26.2829 24.9229C26.7749 25.6587 27.4731 26.233 28.29 26.5737C29.107 26.9144 30.0063 27.0065 30.8753 26.8383C31.7443 26.6701 32.5444 26.2492 33.1752 25.6283C33.5937 25.2156 33.9239 24.722 34.1457 24.1776C34.3675 23.6332 34.4762 23.0494 34.4652 22.4616C34.4664 21.8727 34.3512 21.2892 34.1264 20.7448C33.9015 20.2005 33.5714 19.7058 33.1549 19.2894C32.7384 18.8729 32.2438 18.5427 31.6994 18.3179C31.155 18.093 30.5716 17.9779 29.9826 17.979C29.3949 17.9681 28.8111 18.0768 28.2667 18.2985C27.7223 18.5203 27.2287 18.8505 26.8159 19.269Z" fill="#324D5B"/>
<mask id="mask0_453_1159" style="mask-type:alpha" maskUnits="userSpaceOnUse" x="17" y="2" width="26" height="45">
<path d="M29.9664 2.00005C33.0131 2.00159 42.0109 10.5158 42.0409 25.9299C42.0128 35.941 40.3104 40.864 40.3104 40.864C38.9904 46.4846 35.1505 46.5556 29.9945 46.5556C24.8384 46.5556 20.9686 46.5062 19.6805 40.8625C19.6805 40.8625 17.98 35.8916 17.95 25.882C17.95 10.4926 26.8896 1.9769 29.9664 2.00005Z" fill="url(#paint5_linear_453_1159)"/>
</mask>
<g mask="url(#mask0_453_1159)">
<path d="M21.0635 9.98521C23.4639 11.3865 26.8363 12.2337 30.5683 12.2291C33.8274 12.2091 36.7916 11.5779 39.0971 10.4929C36.0097 4.94955 31.8634 2.0266 29.9378 2.00037C28.0749 1.97876 24.1368 4.75818 21.0635 9.98521Z" fill="url(#paint6_linear_453_1159)"/>
</g>
<defs>
<linearGradient id="paint0_linear_453_1159" x1="25.9054" y1="46.0416" x2="34.085" y2="54.2212" gradientUnits="userSpaceOnUse">
<stop stop-color="#FED001"/>
<stop offset="1" stop-color="#F49A08"/>
</linearGradient>
<linearGradient id="paint1_linear_453_1159" x1="20.9663" y1="33.9975" x2="43.6439" y2="46.4933" gradientUnits="userSpaceOnUse">
<stop stop-color="#D05926"/>
<stop offset="1" stop-color="#C53809"/>
</linearGradient>
<linearGradient id="paint2_linear_453_1159" x1="22.756" y1="12.1861" x2="31.7706" y2="45.0419" gradientUnits="userSpaceOnUse">
<stop stop-color="#DBE3EB"/>
<stop offset="1" stop-color="#9CA4AB"/>
</linearGradient>
<linearGradient id="paint3_linear_453_1159" x1="29.0013" y1="20.8487" x2="31.6133" y2="26.7255" gradientUnits="userSpaceOnUse">
<stop stop-color="#057FD7"/>
<stop offset="1" stop-color="#4EE3FE"/>
</linearGradient>
<linearGradient id="paint4_linear_453_1159" x1="25.4207" y1="36.8798" x2="34.5906" y2="46.0498" gradientUnits="userSpaceOnUse">
<stop stop-color="#E04F12"/>
<stop offset="1" stop-color="#C63809"/>
</linearGradient>
<linearGradient id="paint5_linear_453_1159" x1="22.756" y1="12.1764" x2="31.7706" y2="45.0321" gradientUnits="userSpaceOnUse">
<stop stop-color="#DBE3EB"/>
<stop offset="1" stop-color="#9CA4AB"/>
</linearGradient>
<linearGradient id="paint6_linear_453_1159" x1="30.3294" y1="3.44832" x2="37.153" y2="14.6159" gradientUnits="userSpaceOnUse">
<stop stop-color="#DE4D12"/>
<stop offset="1" stop-color="#C53809"/>
</linearGradient>
</defs>
</svg>
