<svg width="60" height="60" viewBox="0 0 60 60" fill="none" xmlns="http://www.w3.org/2000/svg">
<path d="M19.1783 16H10.3583C9.73287 16 9.13304 16.2469 8.69077 16.6865C8.24851 17.126 8.00005 17.7222 8.00005 18.3438V47.6415C7.99809 47.9518 8.05813 48.2593 8.1767 48.5463C8.29526 48.8334 8.46998 49.0941 8.69073 49.3135C8.91147 49.5329 9.17385 49.7066 9.46264 49.8244C9.75143 49.9422 10.0609 50.0019 10.3731 50H53.6417C53.9526 50 54.2605 49.9389 54.5476 49.8202C54.8347 49.7015 55.0953 49.5275 55.3145 49.3083C55.5336 49.0891 55.707 48.829 55.8247 48.5429C55.9423 48.2569 56.0019 47.9505 56 47.6415V18.3438C56 17.7222 55.7515 17.126 55.3092 16.6865C54.867 16.2469 54.2671 16 53.6417 16H19.1783Z" fill="#7E8C98"/>
<path fill-rule="evenodd" clip-rule="evenodd" d="M6.77686 10.7908H16.0703H51.2252C51.36 10.7905 51.4914 10.8331 51.6005 10.9124C51.7096 10.9917 51.7906 11.1035 51.832 11.2319C51.8708 11.3523 51.8727 11.4813 51.8379 11.6025L52 11.5V12L29 28.5L27.5 27L27.5122 26.9923L16.0703 18.8326L6.40525 11.9443C6.29561 11.8658 6.21375 11.7545 6.17148 11.6264C6.12921 11.4984 6.12871 11.3602 6.17005 11.2319C6.2114 11.1035 6.29246 10.9917 6.40152 10.9124C6.51059 10.8331 6.64203 10.7905 6.77686 10.7908Z" fill="#E7E2D3"/>
<path d="M16.4153 37.0061L27.5341 45.2916L40.3771 36.1409L29.0027 28.0457L16.4153 37.0061Z" fill="#55DF72"/>
<path d="M16.0698 18.8325V36.7682L16.4147 37.018L29.0021 28.0456L16.0698 18.8325Z" fill="#FF78C2"/>
<path d="M27.5334 45.3035H51.3704C51.4945 45.3007 51.6145 45.2591 51.7137 45.1846C51.813 45.1101 51.8864 45.0065 51.9238 44.8881C51.9611 44.7698 51.9606 44.6428 51.9221 44.5248C51.8836 44.4068 51.8092 44.3039 51.7093 44.2303L40.3735 36.1528L27.5334 45.3035Z" fill="#FF42B7"/>
<path d="M29.0024 28.0458L40.3769 36.153L51.8167 44.3048C51.95 44.3989 52.1066 44.4546 52.2694 44.4659C52.4322 44.4772 52.5949 44.4436 52.7399 44.3688C52.8849 44.294 53.0067 44.1808 53.0918 44.0416C53.177 43.9024 53.2223 43.7426 53.2229 43.5794V12.8928C53.2245 12.6927 53.1708 12.4961 53.0676 12.3247C52.9644 12.1533 52.8159 12.0137 52.6384 11.9214C52.4609 11.8291 52.2613 11.7877 52.0618 11.8017C51.8622 11.8158 51.6704 11.8847 51.5075 12.0009L29.0024 28.0458Z" fill="#FFD600"/>
<path d="M16.07 18.8326L5.92632 11.5965C5.81839 11.5186 5.6909 11.4723 5.55814 11.4628C5.42538 11.4533 5.29259 11.4809 5.17468 11.5427C5.05676 11.6044 4.95837 11.6978 4.89054 11.8123C4.82271 11.9268 4.78813 12.058 4.79066 12.191V28.3549L16.0878 36.7683L16.07 18.8326Z" fill="#F0424F"/>
<path d="M16.4149 37.0061L16.076 36.7505L4.77881 28.343V42.2593C4.77881 43.063 5.09788 43.8339 5.66592 44.4025C6.23396 44.9711 7.0045 45.2909 7.80823 45.2917H27.5336L16.4149 37.0061Z" fill="#057ED7"/>
<path d="M50.8244 46H7.17557C6.33309 45.9992 5.52538 45.6649 4.92994 45.0706C4.33449 44.4762 4.00002 43.6704 4.00002 42.8302V13.1787C3.99846 12.7618 4.07944 12.3487 4.23832 11.9631C4.39721 11.5775 4.63087 11.227 4.9259 10.9317C5.22093 10.6364 5.57153 10.4021 5.95759 10.2422C6.34364 10.0823 6.75755 10 7.17557 10H50.8244C51.6667 10 52.4744 10.3336 53.0699 10.9275C53.6654 11.5214 54 12.3269 54 13.1668V42.8184C54.0012 43.2353 53.9199 43.6483 53.7609 44.0339C53.602 44.4195 53.3683 44.77 53.0734 45.0655C52.7785 45.361 52.4281 45.5956 52.0422 45.7559C51.6563 45.9163 51.2425 45.9992 50.8244 46ZM7.17557 11.5686C6.74894 11.5686 6.33979 11.7376 6.03813 12.0384C5.73646 12.3393 5.56698 12.7473 5.56698 13.1727V42.8243C5.56698 43.2498 5.73646 43.6578 6.03813 43.9586C6.33979 44.2595 6.74894 44.4285 7.17557 44.4285H50.8244C51.2511 44.4285 51.6602 44.2595 51.9619 43.9586C52.2636 43.6578 52.433 43.2498 52.433 42.8243V13.1727C52.4338 12.9616 52.3928 12.7523 52.3123 12.557C52.2318 12.3617 52.1134 12.1842 51.964 12.0346C51.8145 11.885 51.637 11.7663 51.4414 11.6853C51.2458 11.6043 51.0362 11.5626 50.8244 11.5626H7.17557V11.5686Z" fill="#3E3A39"/>
</svg>
