<svg width="60" height="60" viewBox="0 0 60 60" fill="none" xmlns="http://www.w3.org/2000/svg">
<path d="M42.728 39.9797C43.7399 39.9797 44.5602 39.1594 44.5602 38.1475V10.2113C44.5602 9.35958 44.3033 8.54279 43.846 7.94056C43.3888 7.33833 42.7686 7 42.1219 7H9.43824C8.79158 7 8.1714 7.33833 7.71414 7.94056C7.25689 8.54279 7 9.35958 7 10.2113V38.1475C7 39.1594 7.82031 39.9797 8.8322 39.9797H42.728Z" fill="#CFD4E1"/>
<path d="M42.1219 7H9.43824C8.79158 7 8.1714 7.27828 7.71414 7.77362C7.25689 8.26896 7 8.94078 7 9.6413L7 15.2449H44.5602V9.6413C44.5602 8.94078 44.3033 8.26896 43.846 7.77362C43.3888 7.27828 42.7686 7 42.1219 7Z" fill="#8C9199"/>
<rect x="10" y="9" width="3.5" height="3.5" rx="0.875" fill="#F35E5E"/>
<rect x="20.5" y="9" width="3.5" height="3.5" rx="0.875" fill="#90EF7A"/>
<rect x="15.25" y="9" width="3.5" height="3.5" rx="0.875" fill="#F8DF5C"/>
<path d="M53.5299 36.1658C53.5053 35.5874 53.3063 35.0299 52.959 34.5667C52.6117 34.1035 52.1324 33.7562 51.584 33.5705L47.8227 32.4672C47.3025 32.3089 46.8616 31.9594 46.5889 31.4889C46.3163 31.0185 46.2321 30.4622 46.3533 29.9321L47.2585 26.221C47.3709 25.6529 47.3092 25.0642 47.0815 24.5318C46.8537 23.9994 46.4706 23.5481 45.9822 23.237L43.9988 22.0911C43.4851 21.824 42.9029 21.7179 42.3281 21.7868C41.7532 21.8557 41.2126 22.0963 40.7766 22.4772L37.9406 25.1853C37.5427 25.5564 37.0189 25.7627 36.4749 25.7627C35.9309 25.7627 35.4071 25.5564 35.0093 25.1853L32.251 22.5474C31.8156 22.1647 31.2745 21.9227 30.6989 21.8533C30.1233 21.7839 29.5402 21.8904 29.0263 22.1588L27.0454 23.3047C26.5572 23.616 26.1743 24.0673 25.9466 24.5997C25.7189 25.132 25.657 25.7206 25.7691 26.2887L26.6642 29.9672C26.7864 30.497 26.7033 31.0534 26.4315 31.5242C26.1598 31.9951 25.7197 32.3455 25.1998 32.5048L21.5639 33.5705C21.0162 33.7569 20.5376 34.1045 20.1909 34.5676C19.8441 35.0307 19.6453 35.5878 19.6206 36.1658V38.4577C19.646 39.0355 19.845 39.5923 20.1917 40.0552C20.5384 40.5182 21.0166 40.8659 21.5639 41.053L25.2324 42.1262C25.7523 42.2855 26.1924 42.6358 26.4641 43.1067C26.7359 43.5776 26.819 44.134 26.6968 44.6638L25.7665 48.4878C25.6575 49.0542 25.7211 49.6403 25.9491 50.1701C26.1771 50.6999 26.5591 51.149 27.0454 51.4592L29.0288 52.6051C29.542 52.8724 30.1239 52.9785 30.6983 52.9096C31.2728 52.8407 31.8131 52.6 32.2485 52.219L35.0068 49.5785C35.4046 49.2075 35.9284 49.0012 36.4724 49.0012C37.0164 49.0012 37.5402 49.2075 37.9381 49.5785L40.7741 52.2892C41.21 52.6701 41.7507 52.9107 42.3256 52.9796C42.9004 53.0485 43.4826 52.9424 43.9962 52.6753L45.9797 51.5294C46.4676 51.2185 46.8505 50.7676 47.0782 50.2357C47.3059 49.7038 47.3679 49.1156 47.256 48.5479L46.3207 44.7014C46.1985 44.1716 46.2817 43.6152 46.5534 43.1444C46.8252 42.6735 47.2653 42.3231 47.7851 42.1638L51.5815 41.053C52.13 40.8671 52.6094 40.5198 52.9571 40.0567C53.3048 39.5936 53.5044 39.0362 53.5299 38.4577V36.1658Z" fill="url(#paint0_linear_447_3194)"/>
<path d="M32.5361 37.3816C32.5361 38.1801 32.7729 38.9606 33.2165 39.6245C33.6601 40.2884 34.2906 40.8058 35.0283 41.1114C35.766 41.417 36.5777 41.4969 37.3608 41.3411C38.144 41.1854 38.8633 40.8009 39.4279 40.2363C39.9925 39.6717 40.377 38.9523 40.5328 38.1692C40.6886 37.3861 40.6086 36.5743 40.3031 35.8367C39.9975 35.099 39.48 34.4685 38.8161 34.0249C38.1522 33.5813 37.3717 33.3445 36.5732 33.3445C35.5025 33.3445 34.4757 33.7698 33.7186 34.5269C32.9615 35.284 32.5361 36.3109 32.5361 37.3816Z" fill="white"/>
<path d="M36.5741 42.4321C35.5753 42.4321 34.5989 42.1359 33.7684 41.581C32.9379 41.0261 32.2906 40.2373 31.9083 39.3146C31.5261 38.3918 31.4261 37.3763 31.621 36.3967C31.8158 35.4171 32.2968 34.5172 33.0031 33.8109C33.7094 33.1047 34.6092 32.6237 35.5888 32.4288C36.5685 32.234 37.5839 32.334 38.5067 32.7162C39.4295 33.0984 40.2182 33.7457 40.7731 34.5762C41.328 35.4067 41.6242 36.3831 41.6242 37.3819C41.6229 38.7209 41.0904 40.0047 40.1436 40.9515C39.1968 41.8983 37.9131 42.4308 36.5741 42.4321ZM36.5741 34.3579C35.976 34.3579 35.3913 34.5352 34.894 34.8675C34.3967 35.1998 34.0091 35.6721 33.7802 36.2247C33.5513 36.7773 33.4914 37.3853 33.6081 37.9719C33.7248 38.5585 34.0128 39.0974 34.4357 39.5203C34.8587 39.9432 35.3975 40.2312 35.9841 40.3479C36.5707 40.4646 37.1788 40.4047 37.7313 40.1758C38.2839 39.9469 38.7562 39.5593 39.0885 39.062C39.4208 38.5647 39.5982 37.98 39.5982 37.3819C39.5975 36.5801 39.2787 35.8113 38.7117 35.2443C38.1447 34.6774 37.3759 34.3585 36.5741 34.3579Z" fill="#195ABD"/>
<defs>
<linearGradient id="paint0_linear_447_3194" x1="36.5752" y1="21.7664" x2="36.5752" y2="53" gradientUnits="userSpaceOnUse">
<stop stop-color="#55BDF4"/>
<stop offset="1" stop-color="#2C8AE7"/>
</linearGradient>
</defs>
</svg>
