<svg width="60" height="60" viewBox="0 0 60 60" fill="none" xmlns="http://www.w3.org/2000/svg">
<path d="M53.8399 10H6.17221C5.59742 9.99918 5.04582 10.2324 4.63854 10.6483C4.23126 11.0643 4.0016 11.6291 4 12.2186V47.7752C4.0016 48.3653 4.23106 48.9307 4.63817 49.3477C5.04528 49.7646 5.59687 49.9992 6.17221 50H53.8399C54.4136 49.9975 54.963 49.7621 55.3679 49.3451C55.7727 48.9281 56 48.3636 56 47.7752V12.2186C55.9953 11.6322 55.7663 11.0712 55.3623 10.6563C54.9583 10.2413 54.4116 10.0057 53.8399 10V10Z" fill="#333333"/>
<path d="M4 18H22V10H6.2524C5.65842 10 5.08877 10.2396 4.66876 10.6662C4.24876 11.0928 4.0128 11.6713 4.0128 12.2746V12.2746L4 18Z" fill="#E0DDD8"/>
<path d="M38 10H22V18H38V10Z" fill="#3E92CC"/>
<path d="M56 18H38V10H53.7476C54.3416 10 54.9112 10.2396 55.3312 10.6662C55.7512 11.0928 55.9872 11.6713 55.9872 12.2746V12.2746L56 18Z" fill="#0A2463"/>
<path opacity="0.1" d="M20.8188 30.4603L11.4015 39.8775C11.1749 40.0662 11.0324 40.3371 11.0052 40.6307C10.9781 40.9242 11.0684 41.2166 11.2565 41.4437L11.4015 41.5887L13.3418 43.5116C13.531 43.7384 13.8023 43.8809 14.0964 43.9081C14.3904 43.9353 14.6833 43.8449 14.9108 43.6566L15.0559 43.5116L24.4615 34.0856C24.5741 33.9922 24.6672 33.8774 24.7355 33.748C24.8037 33.6185 24.8457 33.4769 24.8592 33.3312C24.8727 33.1854 24.8573 33.0385 24.8139 32.8987C24.7706 32.759 24.7001 32.6291 24.6065 32.5166C24.5634 32.4633 24.5148 32.4147 24.4615 32.3716L22.5328 30.4603C22.295 30.254 21.9907 30.1404 21.6758 30.1404C21.3609 30.1404 21.0566 30.254 20.8188 30.4603V30.4603Z" fill="black"/>
<path d="M20.6823 30.7675L11.7117 39.741C11.6042 39.8279 11.5149 39.9352 11.4491 40.0568C11.3833 40.1783 11.3422 40.3117 11.3282 40.4492C11.3141 40.5867 11.3275 40.7256 11.3674 40.858C11.4074 40.9903 11.4731 41.1134 11.5609 41.2202V41.2376L11.6972 41.3739L13.5099 43.1866C13.5982 43.2941 13.7069 43.3831 13.8296 43.4485C13.9523 43.514 14.0868 43.5546 14.2252 43.5681C14.3637 43.5815 14.5034 43.5676 14.6365 43.527C14.7695 43.4864 14.8933 43.42 15.0006 43.3316V43.3316L15.137 43.1489L24.1105 34.1754C24.2175 34.088 24.3062 33.9805 24.3715 33.8588C24.4369 33.7372 24.4776 33.6039 24.4913 33.4665C24.505 33.3291 24.4915 33.1903 24.4516 33.0581C24.4116 32.926 24.346 32.803 24.2584 32.6962V32.6962C24.2182 32.6459 24.1724 32.6001 24.1221 32.5599L22.3094 30.7472C22.0799 30.5527 21.7871 30.4489 21.4864 30.4554C21.1856 30.4618 20.8976 30.5779 20.6765 30.782L20.6823 30.7675Z" fill="#C0C0C0"/>
<path opacity="0.1" d="M15.0353 23.3196L24.4613 32.734C24.5739 32.8274 24.667 32.9422 24.7352 33.0716C24.8034 33.2011 24.8455 33.3427 24.859 33.4884C24.8724 33.6342 24.8571 33.7811 24.8137 33.9209C24.7703 34.0606 24.6999 34.1905 24.6063 34.303L24.4613 34.448L22.5326 36.3796C22.343 36.6057 22.0717 36.7478 21.7779 36.7749C21.4841 36.8021 21.1914 36.7121 20.9635 36.5247C20.9109 36.4808 20.8624 36.4322 20.8185 36.3796L11.4012 26.9537C11.1745 26.7645 11.0319 26.4931 11.0047 26.1991C10.9776 25.905 11.068 25.6121 11.2562 25.3846L11.4012 25.2396L13.3415 23.3196C13.5756 23.1136 13.8767 23 14.1884 23C14.5002 23 14.8013 23.1136 15.0353 23.3196V23.3196Z" fill="black"/>
<path d="M15.1544 23.6271L24.1279 32.6007C24.2342 32.6886 24.3222 32.7966 24.3867 32.9186C24.4513 33.0405 24.4912 33.174 24.5041 33.3114C24.517 33.4488 24.5028 33.5873 24.4621 33.7192C24.4214 33.8511 24.3552 33.9736 24.2671 34.0798V34.0798C24.2261 34.1295 24.1805 34.1752 24.1308 34.2161L22.3181 36.0288C22.2308 36.1358 22.1232 36.2245 22.0016 36.2898C21.8799 36.3552 21.7466 36.3959 21.6092 36.4096C21.4718 36.4234 21.3331 36.4099 21.2009 36.3699C21.0687 36.3299 20.9457 36.2643 20.839 36.1767H20.8216C20.7719 36.1358 20.7262 36.0901 20.6852 36.0404L11.7117 27.0611C11.6042 26.9742 11.5149 26.8669 11.4491 26.7454C11.3833 26.6238 11.3422 26.4904 11.3282 26.3529C11.3141 26.2154 11.3275 26.0765 11.3674 25.9442C11.4074 25.8118 11.4731 25.6887 11.5609 25.5819V25.5674C11.6003 25.5164 11.6461 25.4706 11.6972 25.4311L13.5099 23.6184C13.7353 23.4206 14.025 23.3115 14.3249 23.3115C14.6248 23.3115 14.9145 23.4206 15.1399 23.6184L15.1544 23.6271Z" fill="#EBEBEB"/>
<g filter="url(#filter0_d_447_2650)">
<rect x="31" y="36" width="17" height="5" rx="1" fill="url(#paint0_linear_447_2650)"/>
</g>
<defs>
<filter id="filter0_d_447_2650" x="29" y="35" width="21" height="9" filterUnits="userSpaceOnUse" color-interpolation-filters="sRGB">
<feFlood flood-opacity="0" result="BackgroundImageFix"/>
<feColorMatrix in="SourceAlpha" type="matrix" values="0 0 0 0 0 0 0 0 0 0 0 0 0 0 0 0 0 0 127 0" result="hardAlpha"/>
<feOffset dy="1"/>
<feGaussianBlur stdDeviation="1"/>
<feComposite in2="hardAlpha" operator="out"/>
<feColorMatrix type="matrix" values="0 0 0 0 0 0 0 0 0 0 0 0 0 0 0 0 0 0 0.25 0"/>
<feBlend mode="normal" in2="BackgroundImageFix" result="effect1_dropShadow_447_2650"/>
<feBlend mode="normal" in="SourceGraphic" in2="effect1_dropShadow_447_2650" result="shape"/>
</filter>
<linearGradient id="paint0_linear_447_2650" x1="39.5" y1="36" x2="39.5" y2="41" gradientUnits="userSpaceOnUse">
<stop stop-color="#E4E4E4"/>
<stop offset="1" stop-color="#CECECE"/>
</linearGradient>
</defs>
</svg>
