<svg width="60" height="60" viewBox="0 0 60 60" fill="none" xmlns="http://www.w3.org/2000/svg">
<path d="M4 30C4 35.1423 5.52487 40.1691 8.38179 44.4448C11.2387 48.7205 15.2993 52.053 20.0502 54.0209C24.8011 55.9887 30.0288 56.5036 35.0723 55.5004C40.1158 54.4972 44.7486 52.0209 48.3848 48.3848C52.0209 44.7486 54.4972 40.1158 55.5004 35.0723C56.5036 30.0288 55.9887 24.8011 54.0209 20.0502C52.053 15.2993 48.7205 11.2387 44.4448 8.38179C40.1691 5.52487 35.1423 4 30 4C23.1044 4 16.4912 6.73928 11.6152 11.6152C6.73928 16.4912 4 23.1044 4 30H4Z" fill="url(#paint0_linear_61_72)"/>
<g filter="url(#filter0_d_61_72)">
<path d="M31.9079 41.0969V34.0431L35.5791 36.9967L35.8599 36.7133C36.6854 35.8867 37.569 35.1203 38.5041 34.4201L33.0441 30.0235L40.5451 23.9811C40.7417 23.8222 40.9051 23.6261 41.0258 23.4039C41.1465 23.1818 41.2222 22.938 41.2485 22.6866C41.2749 22.4352 41.2513 22.181 41.1792 21.9387C41.1072 21.6964 40.988 21.4706 40.8285 21.2745C40.7447 21.1691 40.6497 21.0732 40.5451 20.9885L31.1851 13.4485C30.7883 13.1293 30.2811 12.9804 29.7748 13.0345C29.2684 13.0886 28.8041 13.3413 28.4837 13.7371C28.2114 14.0796 28.0613 14.5033 28.0573 14.9409V26.0091L21.8173 20.9859C21.6231 20.8101 21.3949 20.6759 21.1469 20.5915C20.8989 20.5072 20.6363 20.4744 20.3751 20.4953C20.114 20.5161 19.8599 20.5901 19.6284 20.7128C19.397 20.8355 19.193 21.0042 19.0291 21.2085C18.8652 21.4129 18.7449 21.6486 18.6754 21.9012C18.606 22.1538 18.5889 22.4179 18.6253 22.6773C18.6617 22.9368 18.7507 23.186 18.8869 23.4098C19.0232 23.6335 19.2037 23.8271 19.4175 23.9785L26.9159 30.0209L19.4175 36.0633C19.0409 36.3891 18.8056 36.8485 18.761 37.3445C18.7165 37.8405 18.8663 38.3344 19.1788 38.7221C19.4914 39.1098 19.9422 39.361 20.4364 39.4228C20.9305 39.4846 21.4293 39.3521 21.8277 39.0533L28.0677 34.0327V45.0983C28.0673 45.3504 28.1167 45.6 28.2131 45.833C28.3094 46.0659 28.4507 46.2776 28.6289 46.4558C28.8072 46.6341 29.0188 46.7754 29.2518 46.8717C29.4847 46.968 29.7344 47.0174 29.9865 47.0171C30.1201 47.016 30.2533 47.0021 30.3843 46.9755C30.4597 45.0099 31.3489 42.6283 32.9219 40.2675L31.9157 41.0969H31.9079ZM31.9079 18.9605L36.2863 22.4835L31.9079 26.0091V18.9605Z" fill="white"/>
</g>
<path opacity="0.4" d="M40.5477 39.0635C40.7444 38.9046 40.9078 38.7085 41.0285 38.4864C41.1492 38.2643 41.2249 38.0205 41.2512 37.769C41.2775 37.5176 41.254 37.2634 41.1819 37.0211C41.1098 36.7788 40.9906 36.5531 40.8311 36.3569C40.7474 36.2523 40.6524 36.1573 40.5477 36.0735L38.5015 34.4199C37.5664 35.1202 36.682 35.8856 35.8547 36.7105C35.7585 36.8067 35.6675 36.8977 35.5765 36.9939L36.2812 37.5633L32.9194 40.2699C31.3594 42.6359 30.452 45.0123 30.3792 46.9779C30.675 46.9174 30.9522 46.7873 31.1878 46.5983L40.5477 39.0583V39.0635Z" fill="white"/>
<defs>
<filter id="filter0_d_61_72" x="14.6067" y="10.0236" width="30.6523" height="41.9935" filterUnits="userSpaceOnUse" color-interpolation-filters="sRGB">
<feFlood flood-opacity="0" result="BackgroundImageFix"/>
<feColorMatrix in="SourceAlpha" type="matrix" values="0 0 0 0 0 0 0 0 0 0 0 0 0 0 0 0 0 0 127 0" result="hardAlpha"/>
<feOffset dy="1"/>
<feGaussianBlur stdDeviation="2"/>
<feComposite in2="hardAlpha" operator="out"/>
<feColorMatrix type="matrix" values="0 0 0 0 0 0 0 0 0 0 0 0 0 0 0 0 0 0 0.25 0"/>
<feBlend mode="normal" in2="BackgroundImageFix" result="effect1_dropShadow_61_72"/>
<feBlend mode="normal" in="SourceGraphic" in2="effect1_dropShadow_61_72" result="shape"/>
</filter>
<linearGradient id="paint0_linear_61_72" x1="30" y1="4" x2="30" y2="56" gradientUnits="userSpaceOnUse">
<stop stop-color="#9DC5CD"/>
<stop offset="1" stop-color="#52737C"/>
</linearGradient>
</defs>
</svg>
