<svg width="60" height="60" viewBox="0 0 60 60" fill="none" xmlns="http://www.w3.org/2000/svg">
<path d="M30.0075 4.00004C26.5905 3.99411 23.2059 4.66296 20.0479 5.96824C16.8898 7.27351 14.0204 9.18953 11.6042 11.6064C9.18804 14.0233 7.27257 16.8935 5.96767 20.0525C4.66277 23.2115 3.99411 26.597 4.00004 30.015C4.00004 44.4178 15.7589 56 30.0075 56C36.9011 56 43.5124 53.2607 48.387 48.3848C53.2615 43.5088 56 36.8956 56 30C56 23.1044 53.2615 16.4912 48.387 11.6153C43.5124 6.73932 36.9011 4.00004 30.0075 4.00004Z" fill="url(#paint0_linear_447_4218)"/>
<path d="M46.9564 37.8768C46.7995 38.2382 46.5392 38.545 46.2082 38.7586C45.8772 38.9722 45.4905 39.083 45.0966 39.077C44.8211 39.0962 44.5448 39.0553 44.2867 38.957L28.9582 31.9957C28.6063 31.8262 28.3081 31.5627 28.0964 31.2345C27.8847 30.9062 27.7677 30.5259 27.7583 30.1353V15.7326C27.7583 15.1994 27.97 14.688 28.347 14.311C28.7239 13.934 29.2351 13.7222 29.7681 13.7222C30.3011 13.7222 30.8123 13.934 31.1893 14.311C31.5662 14.688 31.7779 15.1994 31.7779 15.7326V28.9351L45.9065 35.3263C46.9564 35.7164 47.3464 36.7966 46.9564 37.8768Z" fill="url(#paint1_linear_447_4218)"/>
<defs>
<linearGradient id="paint0_linear_447_4218" x1="13.3627" y1="10.24" x2="39.8793" y2="52.8868" gradientUnits="userSpaceOnUse">
<stop stop-color="#3BC0F6"/>
<stop offset="1" stop-color="#0196FD"/>
</linearGradient>
<linearGradient id="paint1_linear_447_4218" x1="31.2416" y1="16.7653" x2="45.3645" y2="34.0934" gradientUnits="userSpaceOnUse">
<stop stop-color="white"/>
<stop offset="1" stop-color="#C8E0F0"/>
</linearGradient>
</defs>
</svg>
