<svg width="60" height="60" viewBox="0 0 60 60" fill="none" xmlns="http://www.w3.org/2000/svg">
<path d="M46.2494 22.5835C46.3026 22.6774 46.3302 22.7836 46.3295 22.8915V39.0824C46.3298 39.2989 46.273 39.5117 46.1649 39.6993C46.0568 39.8869 45.9011 40.0426 45.7136 40.1509L31.595 48.2494C31.5249 48.2897 31.4475 48.3157 31.3673 48.326C31.287 48.3364 31.2056 48.3308 31.1275 48.3096C31.0495 48.2885 30.9763 48.2521 30.9123 48.2027C30.8483 48.1533 30.7946 48.0917 30.7544 48.0216C30.7012 47.9277 30.6736 47.8215 30.6743 47.7136V31.5381C30.6746 31.3221 30.7316 31.11 30.8397 30.923C30.9478 30.736 31.1031 30.5807 31.2902 30.4727L45.4211 22.3711C45.5625 22.2908 45.7299 22.2697 45.8868 22.3124C46.0437 22.3551 46.1774 22.4581 46.2586 22.5989L46.2494 22.5835Z" fill="url(#paint0_linear_447_2240)"/>
<path d="M14.1445 22.2755C14.2529 22.2744 14.3594 22.3031 14.4524 22.3587L28.5772 30.4572C28.7642 30.5652 28.9196 30.7205 29.0277 30.9075C29.1358 31.0945 29.1928 31.3067 29.193 31.5227V47.7166C29.193 47.88 29.1281 48.0366 29.0126 48.1521C28.8971 48.2676 28.7405 48.3325 28.5772 48.3325C28.4693 48.3332 28.3631 48.3056 28.2692 48.2524L14.1476 40.1601C13.9601 40.0518 13.8044 39.896 13.6963 39.7084C13.5882 39.5208 13.5314 39.3081 13.5317 39.0916V22.8883C13.5317 22.725 13.5966 22.5683 13.7121 22.4528C13.8276 22.3373 13.9843 22.2725 14.1476 22.2725L14.1445 22.2755Z" fill="url(#paint1_linear_447_2240)"/>
<path d="M30.8465 12.1018L44.6633 20.0278C44.8042 20.1091 44.9072 20.2427 44.9499 20.3997C44.9926 20.5566 44.9715 20.724 44.8912 20.8654C44.8368 20.9602 44.7581 21.0389 44.6633 21.0933L30.8465 29.0163C30.5675 29.1756 30.2517 29.2594 29.9304 29.2594C29.6091 29.2594 29.2934 29.1756 29.0143 29.0163L15.1976 21.0933C15.1271 21.0533 15.0653 20.9998 15.0156 20.9359C14.9658 20.872 14.9292 20.7989 14.9077 20.7209C14.8863 20.6428 14.8805 20.5612 14.8906 20.4809C14.9007 20.4005 14.9265 20.323 14.9666 20.2526C15.0221 20.1587 15.1005 20.0803 15.1945 20.0248L29.0143 12.1018C29.2934 11.9424 29.6091 11.8586 29.9304 11.8586C30.2517 11.8586 30.5675 11.9424 30.8465 12.1018Z" fill="url(#paint2_linear_447_2240)"/>
<path d="M29.9907 2.99316C30.6754 2.99291 31.3349 3.25189 31.8364 3.71804C32.338 4.18419 32.6445 4.82294 32.6943 5.50587L49.8336 15.3873C50.1481 15.2213 50.4921 15.1189 50.8461 15.0858C51.2001 15.0528 51.5571 15.0898 51.8968 15.1947C52.2365 15.2997 52.5522 15.4705 52.8259 15.6974C53.0996 15.9244 53.3259 16.203 53.4918 16.5174C53.6578 16.8318 53.7603 17.1758 53.7933 17.5298C53.8264 17.8838 53.7894 18.2409 53.6844 18.5806C53.5795 18.9203 53.4087 19.236 53.1817 19.5096C52.9548 19.7833 52.6762 20.0096 52.3617 20.1756V39.6952C52.7202 39.8495 53.041 40.0794 53.3024 40.3692C53.5637 40.6589 53.7594 41.0017 53.8761 41.3741C53.9927 41.7464 54.0276 42.1396 53.9783 42.5267C53.9289 42.9138 53.7966 43.2856 53.5903 43.6168C53.384 43.948 53.1086 44.2308 52.7829 44.4457C52.4572 44.6607 52.089 44.8028 51.7033 44.8623C51.3177 44.9217 50.9237 44.8972 50.5484 44.7904C50.1731 44.6836 49.8253 44.497 49.5288 44.2434L32.6789 53.9585C32.6939 54.0708 32.7011 54.184 32.7005 54.2972C32.7005 55.0159 32.415 55.7052 31.9068 56.2133C31.3986 56.7215 30.7094 57.007 29.9907 57.007C29.272 57.007 28.5828 56.7215 28.0746 56.2133C27.5664 55.7052 27.2809 55.0159 27.2809 54.2972C27.2813 54.1716 27.2895 54.0462 27.3056 53.9216L10.7297 44.3758C10.4447 44.6406 10.1061 44.841 9.73671 44.9633C9.36737 45.0855 8.97603 45.1268 8.5893 45.0844C8.20257 45.0419 7.82952 44.9167 7.49551 44.7172C7.16151 44.5177 6.87437 44.2486 6.65364 43.9282C6.43291 43.6078 6.28375 43.2437 6.21631 42.8605C6.14887 42.4773 6.16473 42.0842 6.26281 41.7077C6.36089 41.3312 6.53889 40.9802 6.78471 40.6787C7.03052 40.3771 7.33839 40.132 7.68738 39.9601V20.0802C7.3488 19.9249 7.04587 19.7015 6.7975 19.4239C6.54913 19.1463 6.36066 18.8205 6.24386 18.4668C6.12705 18.1131 6.08442 17.7391 6.11863 17.3682C6.15284 16.9973 6.26315 16.6374 6.44267 16.311C6.62219 15.9847 6.86708 15.6988 7.16203 15.4713C7.45698 15.2438 7.79566 15.0796 8.15693 14.9889C8.5182 14.8981 8.89429 14.8829 9.26172 14.944C9.62916 15.0051 9.98004 15.1414 10.2925 15.3442L27.284 5.5459C27.3248 4.85557 27.6277 4.2069 28.1308 3.73243C28.6339 3.25796 29.2992 2.99353 29.9907 2.99316V2.99316ZM32.3771 6.99624C32.1458 7.42348 31.8041 7.78077 31.3875 8.03078C30.9709 8.28078 30.4949 8.41434 30.009 8.41748C29.5232 8.42063 29.0455 8.29325 28.6257 8.04866C28.2059 7.80407 27.8595 7.45124 27.6227 7.02704L11.2717 16.4497C11.4607 16.8393 11.5534 17.2687 11.5419 17.7016C11.5304 18.1345 11.4151 18.5583 11.2056 18.9374C10.9962 19.3164 10.6988 19.6396 10.3383 19.8798C9.97795 20.1199 9.56513 20.2699 9.13465 20.3173V39.6798C9.53433 39.7141 9.92139 39.8368 10.2678 40.0391C10.6141 40.2415 10.9111 40.5184 11.1372 40.8497C11.3634 41.181 11.5129 41.5586 11.575 41.9549C11.6372 42.3512 11.6103 42.7563 11.4965 43.141L27.8999 52.5913C28.1556 52.2756 28.479 52.0215 28.8462 51.8477C29.2134 51.6739 29.615 51.5849 30.0212 51.5872C30.4275 51.5896 30.828 51.6833 31.1932 51.8614C31.5583 52.0394 31.8788 52.2973 32.1308 52.6159L48.7282 43.0455C48.6326 42.767 48.5837 42.4747 48.5835 42.1802C48.5836 41.5249 48.8215 40.8918 49.253 40.3986C49.6845 39.9053 50.2803 39.5854 50.9299 39.4982V20.4527C50.2566 20.392 49.6304 20.0815 49.1745 19.5823C48.7186 19.0831 48.466 18.4313 48.4664 17.7553C48.4578 17.3004 48.5659 16.8509 48.7805 16.4497L32.3771 6.98701V6.99624Z" fill="url(#paint3_linear_447_2240)"/>
<defs>
<linearGradient id="paint0_linear_447_2240" x1="38.0063" y1="26.9174" x2="38.0063" y2="43.9303" gradientUnits="userSpaceOnUse">
<stop stop-color="#FFB900"/>
<stop offset="1" stop-color="#F39709"/>
</linearGradient>
<linearGradient id="paint1_linear_447_2240" x1="20.9936" y1="26.9174" x2="20.9936" y2="42.867" gradientUnits="userSpaceOnUse">
<stop stop-color="#F25022"/>
<stop offset="1" stop-color="#C43609"/>
</linearGradient>
<linearGradient id="paint2_linear_447_2240" x1="29.9286" y1="11.8586" x2="29.9286" y2="29.2594" gradientUnits="userSpaceOnUse">
<stop offset="0.258333" stop-color="#0379D1"/>
<stop offset="1" stop-color="#4EE3FE"/>
</linearGradient>
<linearGradient id="paint3_linear_447_2240" x1="30.0536" y1="2.99316" x2="30.0536" y2="57.007" gradientUnits="userSpaceOnUse">
<stop stop-color="#0364B8"/>
<stop offset="1" stop-color="#25A1E5"/>
</linearGradient>
</defs>
</svg>
