<svg width="60" height="60" viewBox="0 0 60 60" fill="none" xmlns="http://www.w3.org/2000/svg">
<path d="M15.8462 29.657L18.014 22.0386L36.1923 43.5788L30.2728 44.154L15.8462 29.657Z" fill="#BF8400"/>
<path d="M7 7.29834V53H52.7017C52.9686 53 53.1001 52.6789 52.9106 52.4894L7.51063 7.08945C7.32108 6.89989 7 7.03142 7 7.29834Z" fill="#EAA700"/>
<path d="M16.7307 28.2307L32.6538 44.1538H16.7307V28.2307Z" fill="#EAA700"/>
<path d="M13.1923 41.5L7 53H52.7017C52.9686 53 53.1001 52.6559 52.9105 52.4527L50.8603 50.2553L15.8471 43.8L13.1923 41.5Z" fill="#BF8400"/>
<path d="M7.88452 8.15225V50.9616C7.88452 51.1115 8.00612 51.2307 8.15909 51.2307H51.8391C52.0823 51.2307 52.2079 50.9385 52.0353 50.7694L8.35521 7.96389C8.18263 7.79474 7.88452 7.91391 7.88452 8.15225ZM16.4236 28.3344L31.2504 42.8656H16.4236V28.3344Z" fill="url(#paint0_linear_447_3009)"/>
<path d="M8.93321 12.6761C8.71465 12.8946 8.71465 13.2531 8.93321 13.4716L9.37469 13.9131C9.59325 14.1317 9.95169 14.1317 10.1702 13.9131L12.3077 11.7756L11.0707 10.5386L8.93321 12.6761Z" fill="#795548"/>
<path d="M16.0101 19.753C15.7916 19.9715 15.7916 20.33 16.0101 20.5485L16.4516 20.99C16.6702 21.2086 17.0286 21.2086 17.2472 20.99L19.3847 18.8525L18.1476 17.6155L16.0101 19.753Z" fill="#795548"/>
<path d="M23.873 27.0334C23.6797 27.2248 23.6797 27.5387 23.873 27.7301L24.2634 28.1167C24.4567 28.3082 24.7737 28.3082 24.9669 28.1167L26.8572 26.2448L25.7632 25.1614L23.873 27.0334Z" fill="#795548"/>
<path d="M31.0484 34.7913C30.8299 35.0099 30.8299 35.3683 31.0484 35.5869L31.4899 36.0284C31.7085 36.2469 32.0669 36.2469 32.2855 36.0284L34.423 33.8909L33.1859 32.6538L31.0484 34.7913Z" fill="#795548"/>
<path d="M38.1064 40.7182C37.9131 40.9096 37.9131 41.2235 38.1064 41.4149L38.4968 41.8016C38.6901 41.993 39.0071 41.993 39.2003 41.8016L41.0906 39.9296L39.9966 38.8462L38.1064 40.7182Z" fill="#795548"/>
<path d="M45.6745 48.6244C45.4812 48.8158 45.4812 49.1298 45.6745 49.3212L46.0649 49.7078C46.2582 49.8992 46.5752 49.8992 46.7684 49.7078L48.6587 47.8358L47.5648 46.7524L45.6745 48.6244Z" fill="#795548"/>
<path d="M47.5607 46.7524L46.6523 47.6521L47.7463 48.7354L48.6547 47.8358L47.5607 46.7524Z" fill="url(#paint1_linear_447_3009)"/>
<path d="M18.6362 24.1437C18.4546 24.3253 18.4546 24.6232 18.6362 24.8049L19.272 25.4407C19.4536 25.6223 19.7515 25.6223 19.9332 25.4407L22.9231 22.4508L21.6261 21.1538L18.6362 24.1437V24.1437Z" fill="#795548"/>
<path d="M25.8793 31.9602C25.6861 32.1516 25.6861 32.4655 25.8793 32.6569L26.5558 33.3268C26.7491 33.5183 27.0661 33.5183 27.2593 33.3268L30.4407 30.1762L29.0607 28.8096L25.8793 31.9602V31.9602Z" fill="#795548"/>
<path d="M29.25 28.6184L28.3416 29.518L29.7216 30.8847L30.63 29.9851L29.25 28.6184Z" fill="url(#paint2_linear_447_3009)"/>
<path d="M11.5593 17.0668C11.3777 17.2484 11.3777 17.5463 11.5593 17.728L12.1951 18.3637C12.3767 18.5454 12.6746 18.5454 12.8563 18.3637L15.8462 15.3739L14.5492 14.0769L11.5593 17.0668V17.0668Z" fill="#795548"/>
<path d="M33.1467 39.1574C32.9534 39.3489 32.9534 39.6628 33.1467 39.8542L33.8231 40.5241C34.0164 40.7155 34.3334 40.7155 34.5267 40.5241L37.708 37.3735L36.328 36.0068L33.1467 39.1574Z" fill="#795548"/>
<path d="M36.5173 35.8154L35.6089 36.7151L36.9889 38.0817L37.8973 37.1821L36.5173 35.8154Z" fill="url(#paint3_linear_447_3009)"/>
<path d="M40.4135 46.3545C40.2202 46.5459 40.2202 46.8598 40.4135 47.0512L41.09 47.7211C41.2833 47.9125 41.6002 47.9125 41.7935 47.7211L44.9749 44.5705L43.5949 43.2039L40.4135 46.3545Z" fill="#795548"/>
<path d="M43.7844 43.0122L42.876 43.9118L44.256 45.2785L45.1644 44.3789L43.7844 43.0122Z" fill="url(#paint4_linear_447_3009)"/>
<g filter="url(#filter0_b_447_3009)">
<path d="M42.5186 33.0648C44.3598 31.6318 45.848 29.803 46.8707 27.7167C47.8934 25.6304 48.4238 23.3412 48.4219 21.0221H52.8438C52.846 24.1103 52.1143 27.1558 50.7077 29.912C49.3012 32.6683 47.2593 35.058 44.7473 36.8879L50.3365 46.4739C50.9229 47.4797 51.0818 48.675 50.7783 49.7968C50.4748 50.9186 49.7337 51.8751 48.7181 52.4559L40.9201 39.0818C38.4055 40.1713 35.6899 40.732 32.9452 40.7284C30.2005 40.732 27.4849 40.1713 24.9703 39.0818L17.1723 52.4559C16.1567 51.8751 15.4156 50.9186 15.1121 49.7968C14.8086 48.675 14.9675 47.4797 15.5538 46.4739L26.7479 27.2712C25.6313 26.1839 24.826 24.8226 24.4144 23.3264C24.0027 21.8301 23.9994 20.2525 24.4047 18.7545C24.8101 17.2566 25.6096 15.892 26.7216 14.8001C27.8336 13.7083 29.2183 12.9282 30.7342 12.5396V7.88452H35.1561V12.5396C36.6721 12.9282 38.0568 13.7083 39.1688 14.8001C40.2808 15.892 41.0803 17.2566 41.4857 18.7545C41.891 20.2525 41.8877 21.8301 41.476 23.3264C41.0643 24.8226 40.2591 26.1839 39.1425 27.2712L42.5186 33.0648ZM38.6937 35.2588L35.3153 29.463C33.766 29.8889 32.1288 29.8889 30.5795 29.463L27.2011 35.2588C29.029 35.9813 30.9793 36.3514 32.9474 36.3492C34.9771 36.3492 36.9161 35.9617 38.6937 35.2588Z" fill="url(#paint5_linear_447_3009)" fill-opacity="0.9"/>
</g>
<g filter="url(#filter1_d_447_3009)">
<ellipse cx="33.1295" cy="21.0028" rx="6.18487" ry="6.12512" fill="url(#paint6_linear_447_3009)"/>
</g>
<g style="mix-blend-mode:multiply" filter="url(#filter2_i_447_3009)">
<path d="M33.0213 23.0852C33.6076 23.0852 34.17 22.8546 34.5846 22.4439C34.9993 22.0333 35.2322 21.4764 35.2322 20.8956C35.2322 20.3149 34.9993 19.758 34.5846 19.3474C34.17 18.9367 33.6076 18.7061 33.0213 18.7061C32.4349 18.7061 31.8725 18.9367 31.4579 19.3474C31.0432 19.758 30.8103 20.3149 30.8103 20.8956C30.8103 21.4764 31.0432 22.0333 31.4579 22.4439C31.8725 22.8546 32.4349 23.0852 33.0213 23.0852Z" fill="url(#paint7_linear_447_3009)"/>
</g>
<path fill-rule="evenodd" clip-rule="evenodd" d="M46.4628 29.0633C47.9326 26.6271 48.736 23.8985 48.736 21.1538H52.8411C52.8411 24.7024 51.8035 28.1579 49.9778 31.1839C48.1403 34.2295 45.5038 36.7539 42.34 38.5173C39.0344 40.3598 34.9604 40.8603 31.5209 40.898C29.4732 40.9205 27.5407 40.3486 25.8234 39.6348C24.3986 39.0424 23.0072 38.2999 21.776 37.6429C21.5376 37.5156 21.3053 37.3916 21.0798 37.2726L22.9973 33.6427C23.2528 33.7777 23.5057 33.9125 23.7567 34.0463C24.9879 34.7026 26.1739 35.3347 27.3993 35.8441C28.858 36.4505 30.2062 36.8071 31.4759 36.7931C34.6714 36.7581 37.9264 36.2776 40.3414 34.9316C42.8982 33.5064 45.0048 31.48 46.4628 29.0633Z" fill="url(#paint8_linear_447_3009)" fill-opacity="0.8"/>
<defs>
<filter id="filter0_b_447_3009" x="13.593" y="6.51614" width="40.6191" height="47.3081" filterUnits="userSpaceOnUse" color-interpolation-filters="sRGB">
<feFlood flood-opacity="0" result="BackgroundImageFix"/>
<feGaussianBlur in="BackgroundImage" stdDeviation="0.684192"/>
<feComposite in2="SourceAlpha" operator="in" result="effect1_backgroundBlur_447_3009"/>
<feBlend mode="normal" in="SourceGraphic" in2="effect1_backgroundBlur_447_3009" result="shape"/>
</filter>
<filter id="filter1_d_447_3009" x="25.9446" y="13.8777" width="14.3696" height="14.2502" filterUnits="userSpaceOnUse" color-interpolation-filters="sRGB">
<feFlood flood-opacity="0" result="BackgroundImageFix"/>
<feColorMatrix in="SourceAlpha" type="matrix" values="0 0 0 0 0 0 0 0 0 0 0 0 0 0 0 0 0 0 127 0" result="hardAlpha"/>
<feOffset/>
<feGaussianBlur stdDeviation="0.5"/>
<feComposite in2="hardAlpha" operator="out"/>
<feColorMatrix type="matrix" values="0 0 0 0 0 0 0 0 0 0 0 0 0 0 0 0 0 0 0.25 0"/>
<feBlend mode="normal" in2="BackgroundImageFix" result="effect1_dropShadow_447_3009"/>
<feBlend mode="normal" in="SourceGraphic" in2="effect1_dropShadow_447_3009" result="shape"/>
</filter>
<filter id="filter2_i_447_3009" x="30.8103" y="18.7061" width="4.42188" height="4.37915" filterUnits="userSpaceOnUse" color-interpolation-filters="sRGB">
<feFlood flood-opacity="0" result="BackgroundImageFix"/>
<feBlend mode="normal" in="SourceGraphic" in2="BackgroundImageFix" result="shape"/>
<feColorMatrix in="SourceAlpha" type="matrix" values="0 0 0 0 0 0 0 0 0 0 0 0 0 0 0 0 0 0 127 0" result="hardAlpha"/>
<feOffset/>
<feGaussianBlur stdDeviation="0.5"/>
<feComposite in2="hardAlpha" operator="arithmetic" k2="-1" k3="1"/>
<feColorMatrix type="matrix" values="0 0 0 0 0 0 0 0 0 0 0 0 0 0 0 0 0 0 0.25 0"/>
<feBlend mode="normal" in2="shape" result="effect1_innerShadow_447_3009"/>
</filter>
<linearGradient id="paint0_linear_447_3009" x1="17.125" y1="42.1783" x2="36.5767" y2="22.3309" gradientUnits="userSpaceOnUse">
<stop offset="0.546" stop-color="#FDD835"/>
<stop offset="0.776" stop-color="#F9A825"/>
</linearGradient>
<linearGradient id="paint1_linear_447_3009" x1="47.192" y1="48.2026" x2="47.788" y2="47.6003" gradientUnits="userSpaceOnUse">
<stop stop-color="#5D4037" stop-opacity="0"/>
<stop offset="1" stop-color="#5D4037"/>
</linearGradient>
<linearGradient id="paint2_linear_447_3009" x1="29.1007" y1="30.1348" x2="29.5892" y2="29.6419" gradientUnits="userSpaceOnUse">
<stop stop-color="#5D4037" stop-opacity="0"/>
<stop offset="1" stop-color="#5D4037"/>
</linearGradient>
<linearGradient id="paint3_linear_447_3009" x1="36.3681" y1="37.3318" x2="36.8561" y2="36.8386" gradientUnits="userSpaceOnUse">
<stop stop-color="#5D4037" stop-opacity="0"/>
<stop offset="1" stop-color="#5D4037"/>
</linearGradient>
<linearGradient id="paint4_linear_447_3009" x1="43.6348" y1="44.5282" x2="44.1229" y2="44.0353" gradientUnits="userSpaceOnUse">
<stop stop-color="#5D4037" stop-opacity="0"/>
<stop offset="1" stop-color="#5D4037"/>
</linearGradient>
<linearGradient id="paint5_linear_447_3009" x1="33.9026" y1="7.88452" x2="33.9026" y2="52.4559" gradientUnits="userSpaceOnUse">
<stop stop-color="#969696"/>
<stop offset="1" stop-color="#898989"/>
</linearGradient>
<linearGradient id="paint6_linear_447_3009" x1="33.1295" y1="14.8777" x2="33.1295" y2="27.1279" gradientUnits="userSpaceOnUse">
<stop stop-color="#E6E6E6"/>
<stop offset="1" stop-color="#CACACA"/>
</linearGradient>
<linearGradient id="paint7_linear_447_3009" x1="33.0213" y1="18.7061" x2="33.0213" y2="23.0852" gradientUnits="userSpaceOnUse">
<stop stop-color="#858585"/>
<stop offset="1" stop-color="#A4A4A4"/>
</linearGradient>
<linearGradient id="paint8_linear_447_3009" x1="50.7349" y1="21.1538" x2="31.1429" y2="48.5052" gradientUnits="userSpaceOnUse">
<stop stop-color="#21E4FF"/>
<stop offset="1" stop-color="#0088ED"/>
</linearGradient>
</defs>
</svg>
