<svg width="60" height="60" viewBox="0 0 60 60" fill="none" xmlns="http://www.w3.org/2000/svg">
<path d="M7 10.68C7 8.64759 8.64759 7 10.68 7H15.857H49.32C51.3524 7 53 8.64759 53 10.68V49.32C53 51.3524 51.3524 53 49.32 53H10.68C8.64759 53 7 51.3524 7 49.32V12.9046V10.68Z" fill="url(#paint0_linear_447_2886)"/>
<rect x="14.3601" y="11.6001" width="30.36" height="34.04" rx="1.84" fill="#FFF7DD" fill-opacity="0.5"/>
<rect x="11.6001" y="15.28" width="35.88" height="36.8" rx="1.84" fill="#FFFFFD"/>
<g filter="url(#filter0_b_447_2886)">
<path d="M7 24.4799C7 23.4637 7.8238 22.6399 8.84 22.6399H15.857H51.16C52.1762 22.6399 53 23.4637 53 24.4799V51.1599C53 52.1761 52.1762 52.9999 51.16 52.9999H8.84C7.8238 52.9999 7 52.1761 7 51.1599V28.4855V24.4799Z" fill="url(#paint1_linear_447_2886)" fill-opacity="0.85"/>
</g>
<path d="M24.48 45.7207V31.7376C24.48 30.2406 26.1725 29.3702 27.3902 30.2409L37.1176 37.1966C38.1408 37.9283 38.1445 39.4481 37.1248 40.1848L27.3975 47.2122C26.1807 48.0913 24.48 47.2218 24.48 45.7207Z" fill="url(#paint2_linear_447_2886)"/>
<path d="M45.6401 29.6985C45.6401 29.357 45.917 29.0801 46.2585 29.0801H48.7016C49.0432 29.0801 49.3201 29.357 49.3201 29.6985V32.1416C49.3201 32.4832 49.0432 32.7601 48.7016 32.7601H46.2585C45.917 32.7601 45.6401 32.4832 45.6401 32.1416V29.6985Z" fill="#412D68"/>
<path d="M45.6401 37.0585C45.6401 36.717 45.917 36.4401 46.2586 36.4401H48.7016C49.0432 36.4401 49.3201 36.717 49.3201 37.0585V39.5016C49.3201 39.8432 49.0432 40.1201 48.7016 40.1201H46.2586C45.917 40.1201 45.6401 39.8432 45.6401 39.5016V37.0585Z" fill="#412D68"/>
<path d="M45.6401 44.4185C45.6401 44.077 45.917 43.8001 46.2586 43.8001H48.7016C49.0432 43.8001 49.3201 44.077 49.3201 44.4185V46.8616C49.3201 47.2032 49.0432 47.4801 48.7016 47.4801H46.2586C45.917 47.4801 45.6401 47.2032 45.6401 46.8616V44.4185Z" fill="#412D68"/>
<path d="M11.5999 29.6986C11.5999 29.357 11.8768 29.0801 12.2184 29.0801H14.6614C15.003 29.0801 15.2799 29.357 15.2799 29.6986V32.1417C15.2799 32.4832 15.003 32.7601 14.6614 32.7601H12.2184C11.8768 32.7601 11.5999 32.4832 11.5999 32.1417V29.6986Z" fill="#412D68"/>
<path d="M11.5999 37.0586C11.5999 36.717 11.8768 36.4401 12.2183 36.4401H14.6614C15.003 36.4401 15.2799 36.717 15.2799 37.0586V39.5017C15.2799 39.8432 15.003 40.1201 14.6614 40.1201H12.2183C11.8768 40.1201 11.5999 39.8432 11.5999 39.5017V37.0586Z" fill="#412D68"/>
<path d="M11.5999 44.4186C11.5999 44.077 11.8768 43.8001 12.2183 43.8001H14.6614C15.003 43.8001 15.2799 44.077 15.2799 44.4186V46.8617C15.2799 47.2032 15.003 47.4801 14.6614 47.4801H12.2183C11.8768 47.4801 11.5999 47.2032 11.5999 46.8617V44.4186Z" fill="#412D68"/>
<defs>
<filter id="filter0_b_447_2886" x="3.32" y="18.9599" width="53.36" height="37.7201" filterUnits="userSpaceOnUse" color-interpolation-filters="sRGB">
<feFlood flood-opacity="0" result="BackgroundImageFix"/>
<feGaussianBlur in="BackgroundImage" stdDeviation="1.84"/>
<feComposite in2="SourceAlpha" operator="in" result="effect1_backgroundBlur_447_2886"/>
<feBlend mode="normal" in="SourceGraphic" in2="effect1_backgroundBlur_447_2886" result="shape"/>
</filter>
<linearGradient id="paint0_linear_447_2886" x1="41.8833" y1="7.8493" x2="41.1945" y2="51.4809" gradientUnits="userSpaceOnUse">
<stop stop-color="#805CBD"/>
<stop offset="0.51875" stop-color="#805CBD"/>
<stop offset="1" stop-color="#805CBD"/>
</linearGradient>
<linearGradient id="paint1_linear_447_2886" x1="24.6435" y1="23.1249" x2="23.5415" y2="51.8085" gradientUnits="userSpaceOnUse">
<stop stop-color="#A96BF3"/>
<stop offset="0.51875" stop-color="#A364F1"/>
<stop offset="1" stop-color="#9654ED"/>
</linearGradient>
<linearGradient id="paint2_linear_447_2886" x1="31.84" y1="28.1599" x2="31.84" y2="49.3199" gradientUnits="userSpaceOnUse">
<stop stop-color="white"/>
<stop offset="1" stop-color="white" stop-opacity="0.7"/>
</linearGradient>
</defs>
</svg>
