<svg width="60" height="60" viewBox="0 0 60 60" fill="none" xmlns="http://www.w3.org/2000/svg">
<g filter="url(#filter0_b_447_4968)">
<path d="M46.9324 34.5033C47.3329 34.5 47.7301 34.5768 48.1008 34.7293C48.4715 34.8818 48.8082 35.107 49.0915 35.3916C49.3747 35.6762 49.5987 36.0146 49.7505 36.3871C49.9023 36.7596 49.9787 37.1588 49.9754 37.5613V49.9417C49.9787 50.3442 49.9023 50.7434 49.7505 51.1159C49.5987 51.4884 49.3747 51.8268 49.0915 52.1114C48.8082 52.396 48.4715 52.6211 48.1008 52.7737C47.7301 52.9262 47.3329 53.003 46.9324 52.9997H34.6463C34.2416 53.0065 33.8397 52.9314 33.4646 52.7787C33.0894 52.6261 32.7486 52.3992 32.4626 52.1114C32.1667 51.835 31.9316 51.4995 31.7725 51.1264C31.6133 50.7532 31.5337 50.3508 31.5386 49.9448V37.5643C31.5331 37.1583 31.6125 36.7557 31.7717 36.3825C31.9308 36.0092 32.1662 35.6738 32.4626 35.3978C32.7489 35.1104 33.0898 34.8838 33.4649 34.7312C33.8399 34.5786 34.2417 34.5032 34.6463 34.5095L46.9324 34.5033Z" fill="url(#paint0_linear_447_4968)"/>
</g>
<g filter="url(#filter1_b_447_4968)">
<path d="M52.0202 17.1149C52.3327 17.414 52.5808 17.7743 52.7493 18.1736C52.9178 18.5728 53.003 19.0026 52.9997 19.4362C53.0062 19.864 52.9223 20.2882 52.7535 20.681C52.5846 21.0737 52.3347 21.4259 52.0202 21.7142L42.8881 30.8913C42.5932 31.2021 42.2386 31.4496 41.8458 31.6187C41.453 31.7878 41.0301 31.875 40.6027 31.875C40.1753 31.875 39.7524 31.7878 39.3596 31.6187C38.9668 31.4496 38.6122 31.2021 38.3173 30.8913L29.1852 21.7142C28.8848 21.4185 28.6478 21.0641 28.4889 20.6729C28.33 20.2816 28.2525 19.8618 28.2612 19.4393C28.2519 18.5732 28.584 17.7387 29.1852 17.118L38.3235 7.93785C38.9338 7.33671 39.7543 7 40.6089 7C41.4634 7 42.2839 7.33671 42.8942 7.93785L52.0202 17.1149Z" fill="url(#paint1_linear_447_4968)"/>
</g>
<g filter="url(#filter2_b_447_4968)">
<path d="M22.3201 9.81983C22.7249 9.8125 23.1269 9.88741 23.5022 10.0401C23.8774 10.1927 24.2181 10.4199 24.5038 10.7081C24.8 10.9843 25.0353 11.3197 25.1945 11.6929C25.3536 12.0661 25.4331 12.4687 25.4278 12.8747V25.218C25.4222 26.0372 25.0959 26.8211 24.5195 27.4004C23.9431 27.9796 23.1629 28.3075 22.3478 28.3132H10.0432C9.63921 28.3187 9.23853 28.2389 8.86714 28.0789C8.49574 27.919 8.16191 27.6824 7.88725 27.3846C7.60132 27.0969 7.37575 26.7544 7.22392 26.3775C7.07208 26.0005 6.99706 25.5968 7.00329 25.1902V12.8778C7.00001 12.4753 7.07647 12.0762 7.22824 11.7037C7.38 11.3312 7.60403 10.9928 7.88725 10.7081C8.17048 10.4235 8.50725 10.1984 8.87793 10.0459C9.24861 9.89337 9.64579 9.81653 10.0463 9.81983H22.3201Z" fill="url(#paint2_linear_447_4968)"/>
</g>
<g filter="url(#filter3_b_447_4968)">
<path d="M22.32 34.5034C22.7248 34.4953 23.1271 34.5699 23.5025 34.7226C23.8778 34.8753 24.2184 35.1029 24.5037 35.3917C24.8001 35.6677 25.0355 36.0031 25.1946 36.3764C25.3538 36.7496 25.4332 37.1522 25.4277 37.5582V49.9387C25.4338 50.3448 25.3546 50.7476 25.1954 51.121C25.0362 51.4943 24.8005 51.8297 24.5037 52.1053C24.2174 52.3926 23.8766 52.6193 23.5015 52.7719C23.1264 52.9245 22.7246 52.9999 22.32 52.9936H10.0431C9.6426 52.9969 9.24542 52.9201 8.87474 52.7675C8.50406 52.615 8.1673 52.3899 7.88407 52.1053C7.60084 51.8207 7.37681 51.4823 7.22505 51.1098C7.07329 50.7373 6.99682 50.3381 7.0001 49.9356V37.5551C6.99682 37.1527 7.07329 36.7535 7.22505 36.381C7.37681 36.0085 7.60084 35.6701 7.88407 35.3855C8.1673 35.1009 8.50406 34.8757 8.87474 34.7232C9.24542 34.5707 9.6426 34.4939 10.0431 34.4972L22.32 34.5034Z" fill="url(#paint3_linear_447_4968)"/>
</g>
<defs>
<filter id="filter0_b_447_4968" x="22.205" y="25.1698" width="37.1039" height="37.1637" filterUnits="userSpaceOnUse" color-interpolation-filters="sRGB">
<feFlood flood-opacity="0" result="BackgroundImageFix"/>
<feGaussianBlur in="BackgroundImage" stdDeviation="4.66667"/>
<feComposite in2="SourceAlpha" operator="in" result="effect1_backgroundBlur_447_4968"/>
<feBlend mode="normal" in="SourceGraphic" in2="effect1_backgroundBlur_447_4968" result="shape"/>
</filter>
<filter id="filter1_b_447_4968" x="18.9272" y="-2.33333" width="43.4062" height="43.5417" filterUnits="userSpaceOnUse" color-interpolation-filters="sRGB">
<feFlood flood-opacity="0" result="BackgroundImageFix"/>
<feGaussianBlur in="BackgroundImage" stdDeviation="4.66667"/>
<feComposite in2="SourceAlpha" operator="in" result="effect1_backgroundBlur_447_4968"/>
<feBlend mode="normal" in="SourceGraphic" in2="effect1_backgroundBlur_447_4968" result="shape"/>
</filter>
<filter id="filter2_b_447_4968" x="-2.3304" y="0.486002" width="37.0917" height="37.1608" filterUnits="userSpaceOnUse" color-interpolation-filters="sRGB">
<feFlood flood-opacity="0" result="BackgroundImageFix"/>
<feGaussianBlur in="BackgroundImage" stdDeviation="4.66667"/>
<feComposite in2="SourceAlpha" operator="in" result="effect1_backgroundBlur_447_4968"/>
<feBlend mode="normal" in="SourceGraphic" in2="effect1_backgroundBlur_447_4968" result="shape"/>
</filter>
<filter id="filter3_b_447_4968" x="-2.33333" y="25.1637" width="37.0946" height="37.1635" filterUnits="userSpaceOnUse" color-interpolation-filters="sRGB">
<feFlood flood-opacity="0" result="BackgroundImageFix"/>
<feGaussianBlur in="BackgroundImage" stdDeviation="4.66667"/>
<feComposite in2="SourceAlpha" operator="in" result="effect1_backgroundBlur_447_4968"/>
<feBlend mode="normal" in="SourceGraphic" in2="effect1_backgroundBlur_447_4968" result="shape"/>
</filter>
<linearGradient id="paint0_linear_447_4968" x1="33.5003" y1="34.1327" x2="50.0925" y2="53.1456" gradientUnits="userSpaceOnUse">
<stop stop-color="#FFBD0F"/>
<stop offset="1" stop-color="#F3B100"/>
</linearGradient>
<linearGradient id="paint1_linear_447_4968" x1="46.5001" y1="11.5221" x2="34.4322" y2="25.5325" gradientUnits="userSpaceOnUse">
<stop stop-color="#8CCD00"/>
<stop offset="1" stop-color="#7FBA00"/>
</linearGradient>
<linearGradient id="paint2_linear_447_4968" x1="10" y1="10.0149" x2="25.0869" y2="28.0306" gradientUnits="userSpaceOnUse">
<stop stop-color="#FF6033"/>
<stop offset="1" stop-color="#F25022"/>
</linearGradient>
<linearGradient id="paint3_linear_447_4968" x1="7" y1="34.1327" x2="25.0832" y2="51.1279" gradientUnits="userSpaceOnUse">
<stop stop-color="#00AFFF"/>
<stop offset="1" stop-color="#009BE2"/>
</linearGradient>
</defs>
</svg>
