<svg width="60" height="60" viewBox="0 0 60 60" fill="none" xmlns="http://www.w3.org/2000/svg">
<path d="M7 10.68C7 8.64759 8.64759 7 10.68 7H15.857H49.32C51.3524 7 53 8.64759 53 10.68V49.32C53 51.3524 51.3524 53 49.32 53H10.68C8.64759 53 7 51.3524 7 49.32V12.9046V10.68Z" fill="url(#paint0_linear_447_2794)"/>
<rect x="15.28" y="11.6001" width="30.36" height="34.04" rx="1.84" fill="#FFF7DD" fill-opacity="0.5"/>
<rect x="11.6001" y="15.28" width="35.88" height="36.8" rx="1.84" fill="#FFFFFD"/>
<g filter="url(#filter0_b_447_2794)">
<path d="M7 24.4799C7 23.4637 7.8238 22.6399 8.84 22.6399H15.857H51.16C52.1762 22.6399 53 23.4637 53 24.4799V51.1599C53 52.1761 52.1762 52.9999 51.16 52.9999H8.84C7.8238 52.9999 7 52.1761 7 51.1599V28.4855V24.4799Z" fill="url(#paint1_linear_447_2794)" fill-opacity="0.85"/>
</g>
<path d="M7 48.3999H53V51.1599C53 52.1761 52.1762 52.9999 51.16 52.9999H8.84C7.8238 52.9999 7 52.1761 7 51.1599V48.3999Z" fill="white" fill-opacity="0.8"/>
<path d="M43.8001 51.1581C43.7997 51.3401 43.8533 51.5182 43.9543 51.6697C44.0552 51.8213 44.1989 51.9395 44.3671 52.0094C44.5353 52.0793 44.7204 52.0978 44.8992 52.0625C45.0779 52.0273 45.2421 51.9398 45.3711 51.8112C45.5 51.6826 45.5879 51.5187 45.6236 51.3402C45.6592 51.1617 45.6411 50.9766 45.5715 50.8084C45.5019 50.6401 45.3839 50.4964 45.2324 50.3952C45.081 50.294 44.9029 50.24 44.7207 50.24C44.5999 50.2397 44.4802 50.2633 44.3685 50.3093C44.2569 50.3553 44.1553 50.4229 44.0698 50.5082C43.9843 50.5935 43.9165 50.6948 43.8702 50.8063C43.8239 50.9178 43.8001 51.0373 43.8001 51.1581Z" fill="#FF4343"/>
<path d="M46.5603 51.1581C46.5599 51.3402 46.6137 51.5183 46.7147 51.6699C46.8157 51.8215 46.9595 51.9397 47.1278 52.0096C47.2961 52.0795 47.4814 52.0978 47.6601 52.0624C47.8389 52.027 48.0031 51.9393 48.132 51.8105C48.2609 51.6817 48.3486 51.5176 48.3841 51.339C48.4195 51.1604 48.4011 50.9752 48.3312 50.807C48.2613 50.6388 48.143 50.4952 47.9913 50.3942C47.8396 50.2933 47.6613 50.2396 47.4791 50.24C47.2354 50.24 47.0017 50.3367 46.8294 50.5089C46.6571 50.6811 46.5603 50.9146 46.5603 51.1581Z" fill="#FFD600"/>
<path d="M49.3186 51.1581C49.3182 51.3401 49.3719 51.5182 49.4729 51.6697C49.5738 51.8213 49.7174 51.9395 49.8856 52.0094C50.0538 52.0793 50.239 52.0978 50.4177 52.0625C50.5964 52.0273 50.7607 51.9398 50.8896 51.8112C51.0186 51.6826 51.1065 51.5187 51.1421 51.3402C51.1778 51.1617 51.1597 50.9766 51.0901 50.8084C51.0204 50.6401 50.9024 50.4964 50.751 50.3952C50.5995 50.294 50.4215 50.24 50.2393 50.24C50.1185 50.2397 49.9988 50.2633 49.8871 50.3093C49.7754 50.3553 49.6739 50.4229 49.5884 50.5082C49.5029 50.5935 49.435 50.6948 49.3887 50.8063C49.3425 50.9178 49.3186 51.0373 49.3186 51.1581Z" fill="#65FF40"/>
<path d="M26.2088 26.9587C26.3464 26.9562 26.4831 26.9817 26.6107 27.0336C26.7383 27.0855 26.8541 27.1627 26.9512 27.2607C27.0519 27.3546 27.1319 27.4687 27.1861 27.5955C27.2402 27.7224 27.2672 27.8593 27.2654 27.9973V32.1941C27.2635 32.4726 27.1525 32.7391 26.9566 32.9361C26.7606 33.133 26.4953 33.2445 26.2182 33.2464H22.0347C21.8973 33.2483 21.7611 33.2212 21.6348 33.1668C21.5085 33.1124 21.395 33.032 21.3016 32.9307C21.2044 32.8329 21.1277 32.7164 21.0761 32.5883C21.0245 32.4601 20.999 32.3228 21.0011 32.1846V27.9984C21 27.8615 21.026 27.7258 21.0776 27.5992C21.1292 27.4725 21.2053 27.3575 21.3016 27.2607C21.3979 27.1639 21.5124 27.0874 21.6385 27.0355C21.7645 26.9837 21.8995 26.9576 22.0357 26.9587H26.2088ZM26.2088 38.2711C26.3464 38.2683 26.4832 38.2937 26.6108 38.3456C26.7384 38.3975 26.8542 38.4749 26.9512 38.5731C27.052 38.6669 27.132 38.781 27.1862 38.9079C27.2403 39.0348 27.2673 39.1717 27.2654 39.3097V43.5191C27.2675 43.6572 27.2406 43.7941 27.1864 43.921C27.1323 44.048 27.0522 44.162 26.9512 44.2557C26.8539 44.3534 26.738 44.4305 26.6105 44.4824C26.4829 44.5342 26.3463 44.5599 26.2088 44.5577H22.0347C21.8985 44.5589 21.7634 44.5327 21.6374 44.4809C21.5114 44.429 21.3969 44.3525 21.3006 44.2557C21.2043 44.159 21.1281 44.0439 21.0765 43.9172C21.0249 43.7906 20.9989 43.6549 21 43.518V39.3087C20.9989 39.1718 21.0249 39.0361 21.0765 38.9095C21.1281 38.7828 21.2043 38.6678 21.3006 38.571C21.3969 38.4742 21.5114 38.3977 21.6374 38.3458C21.7634 38.294 21.8985 38.2679 22.0347 38.269L26.2088 38.2711ZM36.4969 38.2711C36.6331 38.27 36.7681 38.2961 36.8942 38.3479C37.0202 38.3998 37.1347 38.4763 37.231 38.5731C37.3273 38.6699 37.4034 38.7849 37.455 38.9116C37.5066 39.0382 37.5326 39.1739 37.5315 39.3108V43.5201C37.5326 43.657 37.5066 43.7927 37.455 43.9193C37.4034 44.046 37.3273 44.1611 37.231 44.2578C37.1347 44.3546 37.0202 44.4311 36.8942 44.483C36.7681 44.5348 36.6331 44.561 36.4969 44.5599H32.3196C32.1821 44.5622 32.0454 44.5366 31.9179 44.4847C31.7903 44.4328 31.6744 44.3557 31.5772 44.2578C31.4766 44.1639 31.3967 44.0498 31.3425 43.9229C31.2884 43.7961 31.2614 43.6592 31.263 43.5212V39.3118C31.2612 39.1738 31.2882 39.0369 31.3423 38.91C31.3964 38.7831 31.4764 38.6691 31.5772 38.5752C31.6745 38.4775 31.7904 38.4004 31.918 38.3486C32.0455 38.2967 32.1821 38.2711 32.3196 38.2732L36.4969 38.2711ZM38.2269 29.439C38.3331 29.5407 38.4175 29.6633 38.4747 29.799C38.532 29.9348 38.561 30.0809 38.5599 30.2283C38.5621 30.3737 38.5336 30.518 38.4762 30.6515C38.4188 30.785 38.3338 30.9048 38.2269 31.0028L35.1219 34.123C35.0217 34.2287 34.9011 34.3129 34.7676 34.3703C34.634 34.4278 34.4902 34.4575 34.3449 34.4575C34.1996 34.4575 34.0558 34.4278 33.9223 34.3703C33.7887 34.3129 33.6681 34.2287 33.5679 34.123L30.463 31.0028C30.3608 30.9023 30.2803 30.7818 30.2262 30.6488C30.1722 30.5157 30.1459 30.373 30.1488 30.2294C30.1457 29.9349 30.2586 29.6511 30.463 29.4401L33.57 26.3189C33.7775 26.1145 34.0565 26 34.347 26C34.6376 26 34.9165 26.1145 35.124 26.3189L38.2269 29.439Z" fill="url(#paint2_linear_447_2794)"/>
<defs>
<filter id="filter0_b_447_2794" x="3.62041" y="19.2603" width="52.7592" height="37.1193" filterUnits="userSpaceOnUse" color-interpolation-filters="sRGB">
<feFlood flood-opacity="0" result="BackgroundImageFix"/>
<feGaussianBlur in="BackgroundImage" stdDeviation="1.6898"/>
<feComposite in2="SourceAlpha" operator="in" result="effect1_backgroundBlur_447_2794"/>
<feBlend mode="normal" in="SourceGraphic" in2="effect1_backgroundBlur_447_2794" result="shape"/>
</filter>
<linearGradient id="paint0_linear_447_2794" x1="41.8833" y1="7.8493" x2="41.1945" y2="51.4809" gradientUnits="userSpaceOnUse">
<stop stop-color="#185ABD"/>
<stop offset="1" stop-color="#103F91"/>
</linearGradient>
<linearGradient id="paint1_linear_447_2794" x1="24.6435" y1="23.1249" x2="23.5415" y2="51.8085" gradientUnits="userSpaceOnUse">
<stop stop-color="#5CAAFF"/>
<stop offset="0.51875" stop-color="#3797FF"/>
<stop offset="1" stop-color="#2B7CD3"/>
</linearGradient>
<linearGradient id="paint2_linear_447_2794" x1="30.74" y1="26" x2="30.74" y2="41.64" gradientUnits="userSpaceOnUse">
<stop stop-color="white"/>
<stop offset="1" stop-color="white" stop-opacity="0.7"/>
</linearGradient>
</defs>
</svg>
