<svg width="60" height="60" viewBox="0 0 60 60" fill="none" xmlns="http://www.w3.org/2000/svg">
<path d="M28.8981 3H32.5005V5.97091H28.8981V3ZM51.2899 19.4211C53.8519 15.955 52.6371 11.1025 49.4602 8.03255C46.2834 4.9626 41.2619 4.56648 37.6751 7.04224L51.2899 19.4211ZM9.23702 19.4211C6.67505 15.955 7.88995 11.1025 11.0668 8.03255C14.2436 4.9626 19.2651 4.56648 22.8519 7.04224L9.23702 19.4211Z" fill="url(#paint0_linear_97_120)"/>
<path d="M30.2632 5.73663C17.4151 5.73663 7 16.1517 7 28.9998H7.03968V50.4735C7.03968 54.9998 10.0607 54.9998 11.566 54.9998H49C50.5053 54.9998 53.5263 54.9998 53.5263 50.4735V28.9998C53.5263 16.1517 43.1113 5.73663 30.2632 5.73663Z" fill="url(#paint1_linear_97_120)"/>
<g filter="url(#filter0_i_97_120)">
<path d="M30.2629 48.1578C40.8435 48.1578 49.4208 39.5805 49.4208 28.9999C49.4208 18.4193 40.8435 9.84201 30.2629 9.84201C19.6823 9.84201 11.105 18.4193 11.105 28.9999C11.105 39.5805 19.6823 48.1578 30.2629 48.1578Z" fill="url(#paint2_linear_97_120)"/>
</g>
<path d="M30.2634 11.2105C40.0886 11.2105 48.0529 19.1747 48.0529 29C48.0529 38.8253 40.0886 46.7895 30.2634 46.7895C20.4381 46.7895 12.4739 38.8253 12.4739 29C12.4739 19.1747 20.4381 11.2105 30.2634 11.2105ZM30.2634 8.47369C18.9452 8.47369 9.73706 17.6818 9.73706 29C9.73706 40.3182 18.9452 49.5263 30.2634 49.5263C41.5816 49.5263 50.7897 40.3182 50.7897 29C50.7897 17.6818 41.5816 8.47369 30.2634 8.47369Z" fill="url(#paint3_linear_97_120)"/>
<rect x="30.2627" y="27.7184" width="15.7368" height="2.05263" rx="1.02632" transform="rotate(-37.894 30.2627 27.7184)" fill="#45494D"/>
<g filter="url(#filter1_d_97_120)">
<path d="M30.2635 38.579C35.5538 38.579 39.8425 34.2904 39.8425 29.0001C39.8425 23.7098 35.5538 19.4211 30.2635 19.4211C24.9732 19.4211 20.6846 23.7098 20.6846 29.0001C20.6846 34.2904 24.9732 38.579 30.2635 38.579Z" fill="url(#paint4_linear_97_120)" fill-opacity="0.7" shape-rendering="crispEdges"/>
</g>
<path d="M17.8311 24.6743C17.731 24.4228 17.7078 24.1473 17.7643 23.8826C17.8209 23.6178 17.9546 23.3759 18.1487 23.1872C18.3428 22.9985 18.5885 22.8716 18.8547 22.8226C19.1209 22.7736 19.3957 22.8046 19.6442 22.9118L30.8023 27.7149C31.1357 27.8585 31.3984 28.1285 31.5326 28.4658C31.6668 28.803 31.6616 29.1797 31.518 29.513C31.3745 29.8464 31.1044 30.1091 30.7672 30.2433C30.43 30.3775 30.0533 30.3722 29.7199 30.2287L18.5618 25.4256C18.3966 25.3545 18.2471 25.2516 18.1217 25.1226C17.9963 24.9937 17.8975 24.8414 17.8311 24.6743Z" fill="#45494D"/>
<circle cx="30.2634" cy="42.6844" r="1.36842" fill="#D83B01"/>
<defs>
<filter id="filter0_i_97_120" x="11.105" y="9.84201" width="38.3157" height="38.3158" filterUnits="userSpaceOnUse" color-interpolation-filters="sRGB">
<feFlood flood-opacity="0" result="BackgroundImageFix"/>
<feBlend mode="normal" in="SourceGraphic" in2="BackgroundImageFix" result="shape"/>
<feColorMatrix in="SourceAlpha" type="matrix" values="0 0 0 0 0 0 0 0 0 0 0 0 0 0 0 0 0 0 127 0" result="hardAlpha"/>
<feOffset/>
<feGaussianBlur stdDeviation="4"/>
<feComposite in2="hardAlpha" operator="arithmetic" k2="-1" k3="1"/>
<feColorMatrix type="matrix" values="0 0 0 0 0 0 0 0 0 0 0 0 0 0 0 0 0 0 0.25 0"/>
<feBlend mode="normal" in2="shape" result="effect1_innerShadow_97_120"/>
</filter>
<filter id="filter1_d_97_120" x="14.5669" y="14.8329" width="31.3933" height="31.3932" filterUnits="userSpaceOnUse" color-interpolation-filters="sRGB">
<feFlood flood-opacity="0" result="BackgroundImageFix"/>
<feColorMatrix in="SourceAlpha" type="matrix" values="0 0 0 0 0 0 0 0 0 0 0 0 0 0 0 0 0 0 127 0" result="hardAlpha"/>
<feOffset dy="1.52941"/>
<feGaussianBlur stdDeviation="3.05882"/>
<feComposite in2="hardAlpha" operator="out"/>
<feColorMatrix type="matrix" values="0 0 0 0 0 0 0 0 0 0 0 0 0 0 0 0 0 0 0.25 0"/>
<feBlend mode="normal" in2="BackgroundImageFix" result="effect1_dropShadow_97_120"/>
<feBlend mode="normal" in="SourceGraphic" in2="effect1_dropShadow_97_120" result="shape"/>
</filter>
<linearGradient id="paint0_linear_97_120" x1="19.5265" y1="5" x2="19.5265" y2="16.6316" gradientUnits="userSpaceOnUse">
<stop offset="0.0302648" stop-color="#B1B8C0"/>
<stop offset="0.817416" stop-color="#858C93"/>
</linearGradient>
<linearGradient id="paint1_linear_97_120" x1="49.4211" y1="52.9472" x2="21.3684" y2="8.47348" gradientUnits="userSpaceOnUse">
<stop stop-color="#D83B01"/>
<stop offset="1" stop-color="#F39400"/>
</linearGradient>
<linearGradient id="paint2_linear_97_120" x1="21.3681" y1="15.9999" x2="41.2102" y2="46.1052" gradientUnits="userSpaceOnUse">
<stop stop-color="#FDFDFE"/>
<stop offset="1" stop-color="#C6CCD0"/>
</linearGradient>
<linearGradient id="paint3_linear_97_120" x1="11.7897" y1="8.47369" x2="44.6318" y2="44.0526" gradientUnits="userSpaceOnUse">
<stop stop-color="#B95697"/>
<stop offset="0.466667" stop-color="#B61B1E"/>
<stop offset="1" stop-color="#6C0602"/>
</linearGradient>
<linearGradient id="paint4_linear_97_120" x1="25.8161" y1="22.5001" x2="35.7372" y2="37.5527" gradientUnits="userSpaceOnUse">
<stop stop-color="#FDFDFE"/>
<stop offset="1" stop-color="#C6CCD0"/>
</linearGradient>
</defs>
</svg>
