<svg width="60" height="60" viewBox="0 0 60 60" fill="none" xmlns="http://www.w3.org/2000/svg">
<path d="M5 8C5 5.79086 6.79086 4 9 4H14.6271H51C53.2091 4 55 5.79086 55 8V49.9998C55 52.2089 53.2091 53.9998 51 53.9998H9C6.79086 53.9998 5 52.2089 5 49.9998V10.4181V8Z" fill="url(#paint0_linear_12_1005)"/>
<rect x="13.4519" y="9.14319" width="32.5046" height="36.6665" rx="2.42658" fill="#FFF7DD" fill-opacity="0.5"/>
<rect x="10.2007" y="13.3331" width="39.0056" height="39.9998" rx="2.42658" fill="#FFFFFD"/>
<g filter="url(#filter0_b_12_1005)">
<path d="M5 22.6634C5 21.5606 5.89396 20.6666 6.99672 20.6666H14.6271H53.0033C54.106 20.6666 55 21.5606 55 22.6633V52.0031C55 53.1058 54.106 53.9998 53.0033 53.9998H6.99672C5.89396 53.9998 5 53.1058 5 52.0031V27.0847V22.6634Z" fill="url(#paint1_linear_12_1005)" fill-opacity="0.8"/>
</g>
<g filter="url(#filter1_d_12_1005)">
<path d="M29.5158 38.4509C30.7716 38.4509 31.9992 38.069 33.0433 37.3535C34.0874 36.6381 34.9012 35.6212 35.3818 34.4314C35.8624 33.2417 35.9881 31.9325 35.7431 30.6695C35.4981 29.4064 34.8934 28.2463 34.0054 27.3357C33.1175 26.4251 31.9861 25.8049 30.7545 25.5537C29.5229 25.3025 28.2462 25.4314 27.086 25.9242C25.9259 26.417 24.9342 27.2516 24.2366 28.3223C23.5389 29.3931 23.1665 30.6519 23.1665 31.9397C23.1665 33.6666 23.8355 35.3227 25.0262 36.5438C26.2169 37.7649 27.8319 38.4509 29.5158 38.4509ZM29.5158 41.4891C23.6699 41.4891 18.9309 43.4035 18.9309 45.7638C18.9309 48.124 23.6699 50.0412 29.5158 50.0412C35.3617 50.0412 40.1007 48.1268 40.1007 45.7666C40.1007 43.4063 35.3617 41.4891 29.5158 41.4891V41.4891Z" fill="white"/>
</g>
<defs>
<filter id="filter0_b_12_1005" x="1.33255" y="16.9992" width="57.3349" height="40.668" filterUnits="userSpaceOnUse" color-interpolation-filters="sRGB">
<feFlood flood-opacity="0" result="BackgroundImageFix"/>
<feGaussianBlur in="BackgroundImage" stdDeviation="1.83372"/>
<feComposite in2="SourceAlpha" operator="in" result="effect1_backgroundBlur_12_1005"/>
<feBlend mode="normal" in="SourceGraphic" in2="effect1_backgroundBlur_12_1005" result="shape"/>
</filter>
<filter id="filter1_d_12_1005" x="16.9342" y="24.4302" width="25.1634" height="28.6061" filterUnits="userSpaceOnUse" color-interpolation-filters="sRGB">
<feFlood flood-opacity="0" result="BackgroundImageFix"/>
<feColorMatrix in="SourceAlpha" type="matrix" values="0 0 0 0 0 0 0 0 0 0 0 0 0 0 0 0 0 0 127 0" result="hardAlpha"/>
<feOffset dy="0.998361"/>
<feGaussianBlur stdDeviation="0.998361"/>
<feComposite in2="hardAlpha" operator="out"/>
<feColorMatrix type="matrix" values="0 0 0 0 0 0 0 0 0 0 0 0 0 0 0 0 0 0 0.25 0"/>
<feBlend mode="normal" in2="BackgroundImageFix" result="effect1_dropShadow_12_1005"/>
<feBlend mode="normal" in="SourceGraphic" in2="effect1_dropShadow_12_1005" result="shape"/>
</filter>
<linearGradient id="paint0_linear_12_1005" x1="42.9167" y1="4.92315" x2="42.1679" y2="52.3486" gradientUnits="userSpaceOnUse">
<stop offset="0.0001" stop-color="#14CCBC"/>
<stop offset="0.51875" stop-color="#34D8C7"/>
<stop offset="1" stop-color="#5AE7D6"/>
</linearGradient>
<linearGradient id="paint1_linear_12_1005" x1="31.1199" y1="21.2619" x2="29.8975" y2="52.762" gradientUnits="userSpaceOnUse">
<stop stop-color="#8FF1E6"/>
<stop offset="0.51875" stop-color="#58D1C5"/>
<stop offset="1" stop-color="#24A69A"/>
</linearGradient>
</defs>
</svg>
