<svg width="60" height="60" viewBox="0 0 60 60" fill="none" xmlns="http://www.w3.org/2000/svg">
<path d="M44.1321 43.8176C44.137 45.6663 44.7848 47.5566 44.784 49.4053C44.7834 51.2817 44.1341 53.1164 44.1398 54.993C34.8198 54.9916 25.4991 54.993 16.1791 54.9922C16.1836 53.1475 15.3106 51.2499 15.3098 49.4053C15.3092 47.525 16.1807 45.6979 16.1846 43.8176C25.5007 43.8206 34.816 43.8184 44.1321 43.8176V43.8176Z" fill="url(#paint0_linear_61_46)"/>
<path d="M33.3483 12.9942C34.643 11.7021 36.7098 11.0215 37.9896 9.7148C43.2924 15.0503 48.6177 20.3649 53.9331 25.6894C54.412 26.1824 54.9958 26.6361 55.1828 27.3318C55.3654 27.7846 55.3096 28.2778 55.3178 28.7537C55.3186 36.5496 55.3171 44.3448 55.319 52.1399C55.4368 53.6782 53.9703 55.115 52.4387 54.9927C49.6724 54.9927 46.9066 54.9935 44.1401 54.9927C44.1289 51.2677 44.1421 47.5426 44.1326 43.8175C44.1393 39.7221 44.1356 35.6275 44.1342 31.533C40.6816 28.0857 37.2365 24.631 33.786 21.1821C32.5826 19.968 31.3602 18.7716 30.1677 17.5473C30.8216 16.9214 32.6718 13.6691 33.3484 12.994L33.3483 12.9942Z" fill="url(#paint1_linear_61_46)"/>
<path d="M16.1758 31.5478C16.1913 35.6374 16.1742 39.7277 16.1846 43.8176C16.1771 47.5426 16.1883 51.2671 16.1795 54.9922C13.2685 54.9908 10.3575 54.993 7.44646 54.9908C6.23078 54.8381 5.16019 53.8147 5.00548 52.5891C4.99565 49.3023 5.00253 46.015 5.00332 42.7285C6.94301 40.8069 8.15318 38.3113 10.0862 36.3828C11.8769 34.5844 14.3933 33.3542 16.1758 31.5478Z" fill="url(#paint2_linear_61_46)"/>
<path d="M30.0146 3.00502C30.2552 3.0349 30.5414 2.94015 30.7551 3.07501C31.336 3.18824 31.8453 3.5242 32.2538 3.94351C33.9893 5.68288 35.7263 7.42068 37.4635 9.15848C37.6377 9.34465 37.8409 9.50486 37.9892 9.71481C36.0406 11.7042 34.0555 13.6575 32.0928 15.633C31.4492 16.2691 30.8211 16.9216 30.1673 17.5473C29.3047 18.36 28.4885 19.2202 27.6436 20.0516C23.8224 23.8853 19.9878 27.7052 16.1755 31.5478C14.393 33.3544 12.589 35.1405 10.7981 36.9387C8.8653 38.8672 6.94271 40.8069 5.00302 42.7285C4.99634 38.5149 5.00302 34.3009 5.00165 30.088C5.00617 29.2926 4.98887 28.497 5.01639 27.7022C5.00853 27.541 5.12962 27.4138 5.12215 27.253C5.2348 27.0639 5.33525 26.8671 5.44475 26.6764C5.72036 26.31 6.063 26.0031 6.38265 25.6762C13.6132 18.4307 20.8459 11.1868 28.0786 3.94273C28.3745 3.63212 28.7132 3.34983 29.1252 3.20908C29.4142 3.11236 29.7002 2.9716 30.0146 3.00502V3.00502Z" fill="url(#paint3_linear_61_46)"/>
<defs>
<linearGradient id="paint0_linear_61_46" x1="16.7254" y1="45.3137" x2="44.7646" y2="51.4313" gradientUnits="userSpaceOnUse">
<stop stop-color="#78DD3A"/>
<stop offset="1" stop-color="#00C6E1"/>
</linearGradient>
<linearGradient id="paint1_linear_61_46" x1="33.5492" y1="14.7256" x2="52.9218" y2="52.9609" gradientUnits="userSpaceOnUse">
<stop stop-color="#4586F7"/>
<stop offset="1" stop-color="#0047C2"/>
</linearGradient>
<linearGradient id="paint2_linear_61_46" x1="10.5924" y1="31.5478" x2="10.5924" y2="54.9922" gradientUnits="userSpaceOnUse">
<stop stop-color="#FDC00D"/>
<stop offset="1" stop-color="#E27A00"/>
</linearGradient>
<linearGradient id="paint3_linear_61_46" x1="31.5098" y1="6.05882" x2="5" y2="33.0784" gradientUnits="userSpaceOnUse">
<stop stop-color="#EC3C2E"/>
<stop offset="1" stop-color="#D81100"/>
</linearGradient>
</defs>
</svg>
