<svg width="60" height="60" viewBox="0 0 60 60" fill="none" xmlns="http://www.w3.org/2000/svg">
<path d="M18.8652 14.6288H9.97019C9.33941 14.6288 8.73447 14.8794 8.28844 15.3254C7.84242 15.7715 7.59184 16.3764 7.59184 17.0072V46.7365C7.58987 47.0513 7.65042 47.3634 7.77 47.6547C7.88957 47.9459 8.06577 48.2105 8.2884 48.4332C8.51102 48.6558 8.77563 48.832 9.06688 48.9516C9.35813 49.0711 9.67022 49.1317 9.98505 49.1297H53.6218C53.9353 49.1297 54.2458 49.0677 54.5354 48.9473C54.8249 48.8268 55.0877 48.6503 55.3088 48.4279C55.5298 48.2054 55.7047 47.9415 55.8233 47.6512C55.942 47.361 56.0021 47.0501 56.0001 46.7365V17.0072C56.0001 16.3764 55.7495 15.7715 55.3035 15.3254C54.8575 14.8794 54.2525 14.6288 53.6218 14.6288H18.8652Z" fill="#7E8C98"/>
<path d="M16.4153 37.0061L27.5341 45.2917L40.3771 36.141L29.0027 28.0457L16.4153 37.0061Z" fill="#55DF72"/>
<path d="M16.0698 18.8325V36.7682L16.4147 37.018L29.0021 28.0456L16.0698 18.8325Z" fill="#FF78C2"/>
<path d="M16.0703 10.7908H6.77686C6.64203 10.7906 6.51059 10.8331 6.40152 10.9124C6.29246 10.9917 6.2114 11.1036 6.17005 11.2319C6.12871 11.3603 6.12921 11.4984 6.17148 11.6265C6.21375 11.7545 6.29561 11.8658 6.40525 11.9443L16.0703 18.8326L28.6309 27.79C28.7384 27.867 28.8673 27.9084 28.9995 27.9084C29.1318 27.9084 29.2607 27.867 29.3682 27.79L51.5968 11.9443C51.7064 11.8658 51.7883 11.7545 51.8306 11.6265C51.8728 11.4984 51.8733 11.3603 51.832 11.2319C51.7906 11.1036 51.7096 10.9917 51.6005 10.9124C51.4914 10.8331 51.36 10.7906 51.2252 10.7908H16.0703Z" fill="#E7E2D3"/>
<path d="M27.5334 45.3036H51.3704C51.4945 45.3007 51.6145 45.2592 51.7137 45.1847C51.813 45.1102 51.8864 45.0065 51.9238 44.8882C51.9611 44.7699 51.9606 44.6428 51.9221 44.5249C51.8836 44.4069 51.8092 44.3039 51.7093 44.2304L40.3735 36.1529L27.5334 45.3036Z" fill="#FF42B7"/>
<path d="M29.0024 28.0458L40.3769 36.1529L51.8167 44.3047C51.95 44.3988 52.1066 44.4545 52.2694 44.4658C52.4322 44.4771 52.5949 44.4435 52.7399 44.3687C52.8849 44.2939 53.0067 44.1807 53.0918 44.0416C53.177 43.9024 53.2223 43.7425 53.2229 43.5793V12.8927C53.2245 12.6927 53.1708 12.4961 53.0676 12.3246C52.9644 12.1532 52.8159 12.0137 52.6384 11.9214C52.4609 11.8291 52.2613 11.7877 52.0618 11.8017C51.8622 11.8157 51.6704 11.8846 51.5075 12.0008L29.0024 28.0458Z" fill="#FFD600"/>
<path d="M16.07 18.8325L5.92632 11.5964C5.81839 11.5185 5.6909 11.4722 5.55814 11.4627C5.42538 11.4532 5.29259 11.4809 5.17468 11.5426C5.05676 11.6044 4.95837 11.6977 4.89054 11.8123C4.82271 11.9268 4.78813 12.0579 4.79066 12.191V28.3548L16.0878 36.7682L16.07 18.8325Z" fill="#F0424F"/>
<path d="M16.4149 37.0061L16.076 36.7504L4.77881 28.3429V42.2592C4.77881 43.063 5.09788 43.8338 5.66592 44.4024C6.23396 44.971 7.0045 45.2908 7.80823 45.2916H27.5336L16.4149 37.0061Z" fill="#057ED7"/>
<path d="M50.8178 46.0944H7.17511C6.33275 46.0936 5.52516 45.7584 4.9298 45.1625C4.33444 44.5666 4.00002 43.7587 4.00002 42.9163V13.187C3.99846 12.769 4.07943 12.3549 4.23829 11.9683C4.39715 11.5817 4.63078 11.2303 4.92577 10.9342C5.22076 10.6381 5.57131 10.4031 5.95731 10.2428C6.3433 10.0825 6.75715 10 7.17511 10H50.8178C51.6598 10 52.4674 10.3345 53.0629 10.93C53.6583 11.5254 53.9929 12.333 53.9929 13.1751V42.9044C53.994 43.3224 53.9128 43.7365 53.7538 44.1231C53.5949 44.5097 53.3613 44.8612 53.0664 45.1574C52.7715 45.4537 52.4212 45.6889 52.0353 45.8497C51.6495 46.0104 51.2358 46.0936 50.8178 46.0944V46.0944ZM7.17511 11.5727C6.74855 11.5727 6.33946 11.7421 6.03783 12.0438C5.73621 12.3454 5.56676 12.7545 5.56676 13.181V42.9104C5.56676 43.3369 5.73621 43.746 6.03783 44.0476C6.33946 44.3493 6.74855 44.5187 7.17511 44.5187H50.8178C51.2443 44.5187 51.6534 44.3493 51.955 44.0476C52.2567 43.746 52.4261 43.3369 52.4261 42.9104V13.181C52.4269 12.9693 52.3859 12.7595 52.3054 12.5637C52.2249 12.3679 52.1066 12.1899 51.9571 12.0399C51.8077 11.8899 51.6302 11.7709 51.4346 11.6897C51.2391 11.6085 51.0295 11.5667 50.8178 11.5667H7.17511V11.5727Z" fill="#3E3A39"/>
</svg>
