<svg width="60" height="60" viewBox="0 0 60 60" fill="none" xmlns="http://www.w3.org/2000/svg">
<circle cx="29.9962" cy="29.9965" r="25.9967" fill="url(#paint0_linear_92_189)"/>
<g filter="url(#filter0_i_92_189)">
<circle cx="29.9965" cy="29.9965" r="10.9985" stroke="url(#paint1_linear_92_189)" stroke-width="2"/>
</g>
<g filter="url(#filter1_i_92_189)">
<circle cx="29.9966" cy="29.9965" r="5.24925" stroke="url(#paint2_linear_92_189)" stroke-width="1.5"/>
</g>
<g filter="url(#filter2_bd_92_189)">
<mask id="path-4-inside-1_92_189" fill="white">
<path d="M40.2486 12.2487C39.4949 11.8135 38.5299 12.0721 38.0948 12.8258L37.9593 13.0605C37.5824 13.7132 36.7866 14.0302 36.0822 13.7619C35.7403 13.6319 35.397 13.5117 35.0509 13.4047C34.3338 13.1837 33.9001 12.455 33.9977 11.7121L34.0302 11.4464C34.1442 10.5836 33.5374 9.7909 32.6725 9.67753C31.8098 9.56358 31.017 10.1703 30.9037 11.0352L30.8681 11.3062C30.7725 12.0521 30.1609 12.6474 29.4078 12.6714C29.044 12.6835 28.6821 12.7073 28.322 12.7414C27.5738 12.8138 26.8906 12.3046 26.6961 11.5787L26.6262 11.3179C26.4006 10.4758 25.5361 9.97668 24.6953 10.2031C23.8545 10.4296 23.3555 11.294 23.5805 12.134L23.6504 12.3948C23.8449 13.1207 23.5087 13.9019 22.8238 14.2147C22.4947 14.3652 22.1694 14.5255 21.8483 14.697C21.1842 15.0527 20.3548 14.8435 19.8969 14.246L19.7333 14.0306C19.2032 13.3404 18.2114 13.2084 17.5199 13.7377C16.8297 14.2677 16.6993 15.2568 17.2285 15.9484L17.3911 16.1596C17.847 16.7542 17.8385 17.6036 17.3279 18.1536C17.0817 18.4192 16.8418 18.6934 16.6108 18.977C16.137 19.561 15.2898 19.6865 14.6371 19.3097L14.4024 19.1742C13.6487 18.739 12.6838 18.9975 12.2486 19.7513C11.8134 20.505 12.072 21.47 12.8257 21.9051L13.0604 22.0406C13.7131 22.4175 14.0301 23.2133 13.7618 23.9177C13.6318 24.2596 13.5116 24.6029 13.4046 24.949C13.1836 25.6661 12.4549 26.0998 11.712 26.0022L11.4463 25.9697C10.5835 25.8557 9.79079 26.4625 9.67742 27.3274C9.56347 28.1901 10.1702 28.9829 11.0351 29.0962L11.3061 29.1318C12.0526 29.2296 12.6478 29.8411 12.674 30.5936C12.686 30.9574 12.7077 31.3198 12.7425 31.6821C12.8148 32.4303 12.3056 33.1135 11.5798 33.308L11.3163 33.3763C10.4741 33.602 9.97503 34.4664 10.2015 35.3072C10.4279 36.148 11.2916 36.6485 12.1324 36.422L12.3958 36.3537C13.1217 36.1592 13.9031 36.492 14.2146 37.1761C14.3656 37.5073 14.5265 37.8347 14.698 38.1558C15.0523 38.8192 14.8445 39.6493 14.247 40.1072L14.0316 40.2708C13.3414 40.8009 13.2094 41.7927 13.7387 42.4842C14.2687 43.1744 15.2578 43.3048 15.9494 42.7756L16.1606 42.613C16.7552 42.1571 17.6046 42.1656 18.1546 42.6762C18.4203 42.9224 18.6945 43.1623 18.978 43.3933C19.5609 43.8628 19.6864 44.7101 19.3096 45.3628L19.1741 45.5974C18.7389 46.3512 18.9974 47.3161 19.7512 47.7513C20.5049 48.1865 21.4699 47.9279 21.905 47.1742L22.0405 46.9395C22.4174 46.2868 23.2132 45.9698 23.9176 46.2381C24.2595 46.3681 24.6028 46.4883 24.9489 46.5953C25.666 46.8163 26.0997 47.545 26.0021 48.2879L25.9696 48.5536C25.8556 49.4164 26.4624 50.2091 27.3273 50.3225C28.19 50.4364 28.9827 49.8297 29.0961 48.9648L29.1317 48.6938C29.2295 47.9473 29.841 47.3521 30.5935 47.3259C30.9573 47.3139 31.3197 47.2922 31.682 47.2574C32.4302 47.1851 33.1134 47.6943 33.3079 48.4201L33.3762 48.6836C33.6019 49.5258 34.4663 50.0249 35.3071 49.7984C36.1479 49.572 36.6484 48.7083 36.4219 47.8675L36.3536 47.6041C36.1591 46.8782 36.4919 46.0967 37.176 45.7853C37.5072 45.6342 37.8345 45.4734 38.1557 45.3019C38.819 44.9475 39.6492 45.1554 40.1071 45.7529L40.2707 45.9683C40.8008 46.6585 41.7926 46.7905 42.4841 46.2612C43.1743 45.7312 43.3047 44.742 42.7755 44.0505L42.6129 43.8393C42.157 43.2447 42.1655 42.3953 42.676 41.8453C42.9223 41.5796 43.1622 41.3054 43.3932 41.0219C43.8627 40.439 44.7099 40.3135 45.3626 40.6903L45.5973 40.8258C46.3511 41.261 47.316 41.0025 47.7512 40.2487C48.1864 39.495 47.9278 38.53 47.1741 38.0949L46.9394 37.9594C46.2867 37.5825 45.9697 36.7867 46.238 36.0823C46.368 35.7404 46.4882 35.3971 46.5952 35.051C46.8162 34.3339 47.5449 33.9002 48.2878 33.9978L48.5535 34.0303C49.4163 34.1443 50.209 33.5375 50.3224 32.6726C50.4363 31.8099 49.8296 31.0171 48.9647 30.9038L48.6936 30.8682C47.9472 30.7704 47.352 30.1589 47.3258 29.4064C47.3137 29.0426 47.2921 28.6802 47.2573 28.3179C47.185 27.5697 47.6942 26.8865 48.42 26.692L48.6835 26.6237C49.5257 26.398 50.0248 25.5336 49.7983 24.6928C49.5727 23.8506 48.7082 23.3515 47.8674 23.578L47.6051 23.6505C46.8792 23.845 46.0951 23.5107 45.7837 22.8265C45.6326 22.4953 45.4717 22.168 45.3003 21.8469C44.9459 21.1835 45.1564 20.3549 45.7539 19.897L45.9693 19.7334C46.6595 19.2033 46.7915 18.2115 46.2622 17.52C45.7322 16.8298 44.7431 16.6994 44.0515 17.2286L43.8377 17.3896C43.243 17.8456 42.3937 17.8371 41.8437 17.3265C41.578 17.0803 41.3038 16.8404 41.0203 16.6093C40.4376 16.1364 40.3134 15.29 40.6902 14.6373L40.8257 14.4026C41.2609 13.6488 41.0024 12.6839 40.2486 12.2487ZM36.3068 19.0761C41.8761 22.2916 44.0557 29.1118 41.6188 34.8875L33.1485 29.9972C33.1485 29.4446 33.0033 28.9017 32.7274 28.4229C32.4516 27.9441 32.0547 27.5462 31.5766 27.269C31.5757 27.2685 31.5748 27.268 31.5739 27.2675L31.5763 17.4829C33.1968 17.6861 34.8037 18.2083 36.3068 19.0761ZM28.4242 17.4979L28.4253 27.2703C27.9453 27.5464 27.5465 27.9441 27.2689 28.4233C26.9947 28.902 26.8508 29.4442 26.8517 29.9959L18.3837 34.8822C16.9119 31.3721 17.0262 27.2435 19.076 23.6931C21.1266 20.1414 24.6467 17.9772 28.4242 17.4979ZM31.5745 32.7297L40.0421 37.6185C36.2586 42.6168 29.2623 44.1393 23.693 40.9239C22.1899 40.0561 20.9342 38.9255 19.9479 37.6237L28.4205 32.7294C28.4214 32.7299 28.4223 32.7305 28.4232 32.731C28.9024 33.0072 29.4459 33.1524 29.999 33.1522C30.5521 33.152 31.0954 33.0063 31.5745 32.7297V32.7297Z"/>
</mask>
<path d="M40.2486 12.2487C39.4949 11.8135 38.5299 12.0721 38.0948 12.8258L37.9593 13.0605C37.5824 13.7132 36.7866 14.0302 36.0822 13.7619C35.7403 13.6319 35.397 13.5117 35.0509 13.4047C34.3338 13.1837 33.9001 12.455 33.9977 11.7121L34.0302 11.4464C34.1442 10.5836 33.5374 9.7909 32.6725 9.67753C31.8098 9.56358 31.017 10.1703 30.9037 11.0352L30.8681 11.3062C30.7725 12.0521 30.1609 12.6474 29.4078 12.6714C29.044 12.6835 28.6821 12.7073 28.322 12.7414C27.5738 12.8138 26.8906 12.3046 26.6961 11.5787L26.6262 11.3179C26.4006 10.4758 25.5361 9.97668 24.6953 10.2031C23.8545 10.4296 23.3555 11.294 23.5805 12.134L23.6504 12.3948C23.8449 13.1207 23.5087 13.9019 22.8238 14.2147C22.4947 14.3652 22.1694 14.5255 21.8483 14.697C21.1842 15.0527 20.3548 14.8435 19.8969 14.246L19.7333 14.0306C19.2032 13.3404 18.2114 13.2084 17.5199 13.7377C16.8297 14.2677 16.6993 15.2568 17.2285 15.9484L17.3911 16.1596C17.847 16.7542 17.8385 17.6036 17.3279 18.1536C17.0817 18.4192 16.8418 18.6934 16.6108 18.977C16.137 19.561 15.2898 19.6865 14.6371 19.3097L14.4024 19.1742C13.6487 18.739 12.6838 18.9975 12.2486 19.7513C11.8134 20.505 12.072 21.47 12.8257 21.9051L13.0604 22.0406C13.7131 22.4175 14.0301 23.2133 13.7618 23.9177C13.6318 24.2596 13.5116 24.6029 13.4046 24.949C13.1836 25.6661 12.4549 26.0998 11.712 26.0022L11.4463 25.9697C10.5835 25.8557 9.79079 26.4625 9.67742 27.3274C9.56347 28.1901 10.1702 28.9829 11.0351 29.0962L11.3061 29.1318C12.0526 29.2296 12.6478 29.8411 12.674 30.5936C12.686 30.9574 12.7077 31.3198 12.7425 31.6821C12.8148 32.4303 12.3056 33.1135 11.5798 33.308L11.3163 33.3763C10.4741 33.602 9.97503 34.4664 10.2015 35.3072C10.4279 36.148 11.2916 36.6485 12.1324 36.422L12.3958 36.3537C13.1217 36.1592 13.9031 36.492 14.2146 37.1761C14.3656 37.5073 14.5265 37.8347 14.698 38.1558C15.0523 38.8192 14.8445 39.6493 14.247 40.1072L14.0316 40.2708C13.3414 40.8009 13.2094 41.7927 13.7387 42.4842C14.2687 43.1744 15.2578 43.3048 15.9494 42.7756L16.1606 42.613C16.7552 42.1571 17.6046 42.1656 18.1546 42.6762C18.4203 42.9224 18.6945 43.1623 18.978 43.3933C19.5609 43.8628 19.6864 44.7101 19.3096 45.3628L19.1741 45.5974C18.7389 46.3512 18.9974 47.3161 19.7512 47.7513C20.5049 48.1865 21.4699 47.9279 21.905 47.1742L22.0405 46.9395C22.4174 46.2868 23.2132 45.9698 23.9176 46.2381C24.2595 46.3681 24.6028 46.4883 24.9489 46.5953C25.666 46.8163 26.0997 47.545 26.0021 48.2879L25.9696 48.5536C25.8556 49.4164 26.4624 50.2091 27.3273 50.3225C28.19 50.4364 28.9827 49.8297 29.0961 48.9648L29.1317 48.6938C29.2295 47.9473 29.841 47.3521 30.5935 47.3259C30.9573 47.3139 31.3197 47.2922 31.682 47.2574C32.4302 47.1851 33.1134 47.6943 33.3079 48.4201L33.3762 48.6836C33.6019 49.5258 34.4663 50.0249 35.3071 49.7984C36.1479 49.572 36.6484 48.7083 36.4219 47.8675L36.3536 47.6041C36.1591 46.8782 36.4919 46.0967 37.176 45.7853C37.5072 45.6342 37.8345 45.4734 38.1557 45.3019C38.819 44.9475 39.6492 45.1554 40.1071 45.7529L40.2707 45.9683C40.8008 46.6585 41.7926 46.7905 42.4841 46.2612C43.1743 45.7312 43.3047 44.742 42.7755 44.0505L42.6129 43.8393C42.157 43.2447 42.1655 42.3953 42.676 41.8453C42.9223 41.5796 43.1622 41.3054 43.3932 41.0219C43.8627 40.439 44.7099 40.3135 45.3626 40.6903L45.5973 40.8258C46.3511 41.261 47.316 41.0025 47.7512 40.2487C48.1864 39.495 47.9278 38.53 47.1741 38.0949L46.9394 37.9594C46.2867 37.5825 45.9697 36.7867 46.238 36.0823C46.368 35.7404 46.4882 35.3971 46.5952 35.051C46.8162 34.3339 47.5449 33.9002 48.2878 33.9978L48.5535 34.0303C49.4163 34.1443 50.209 33.5375 50.3224 32.6726C50.4363 31.8099 49.8296 31.0171 48.9647 30.9038L48.6936 30.8682C47.9472 30.7704 47.352 30.1589 47.3258 29.4064C47.3137 29.0426 47.2921 28.6802 47.2573 28.3179C47.185 27.5697 47.6942 26.8865 48.42 26.692L48.6835 26.6237C49.5257 26.398 50.0248 25.5336 49.7983 24.6928C49.5727 23.8506 48.7082 23.3515 47.8674 23.578L47.6051 23.6505C46.8792 23.845 46.0951 23.5107 45.7837 22.8265C45.6326 22.4953 45.4717 22.168 45.3003 21.8469C44.9459 21.1835 45.1564 20.3549 45.7539 19.897L45.9693 19.7334C46.6595 19.2033 46.7915 18.2115 46.2622 17.52C45.7322 16.8298 44.7431 16.6994 44.0515 17.2286L43.8377 17.3896C43.243 17.8456 42.3937 17.8371 41.8437 17.3265C41.578 17.0803 41.3038 16.8404 41.0203 16.6093C40.4376 16.1364 40.3134 15.29 40.6902 14.6373L40.8257 14.4026C41.2609 13.6488 41.0024 12.6839 40.2486 12.2487ZM36.3068 19.0761C41.8761 22.2916 44.0557 29.1118 41.6188 34.8875L33.1485 29.9972C33.1485 29.4446 33.0033 28.9017 32.7274 28.4229C32.4516 27.9441 32.0547 27.5462 31.5766 27.269C31.5757 27.2685 31.5748 27.268 31.5739 27.2675L31.5763 17.4829C33.1968 17.6861 34.8037 18.2083 36.3068 19.0761ZM28.4242 17.4979L28.4253 27.2703C27.9453 27.5464 27.5465 27.9441 27.2689 28.4233C26.9947 28.902 26.8508 29.4442 26.8517 29.9959L18.3837 34.8822C16.9119 31.3721 17.0262 27.2435 19.076 23.6931C21.1266 20.1414 24.6467 17.9772 28.4242 17.4979ZM31.5745 32.7297L40.0421 37.6185C36.2586 42.6168 29.2623 44.1393 23.693 40.9239C22.1899 40.0561 20.9342 38.9255 19.9479 37.6237L28.4205 32.7294C28.4214 32.7299 28.4223 32.7305 28.4232 32.731C28.9024 33.0072 29.4459 33.1524 29.999 33.1522C30.5521 33.152 31.0954 33.0063 31.5745 32.7297V32.7297Z" fill="url(#paint3_linear_92_189)" fill-opacity="0.9" shape-rendering="crispEdges"/>
<path d="M40.2486 12.2487C39.4949 11.8135 38.5299 12.0721 38.0948 12.8258L37.9593 13.0605C37.5824 13.7132 36.7866 14.0302 36.0822 13.7619C35.7403 13.6319 35.397 13.5117 35.0509 13.4047C34.3338 13.1837 33.9001 12.455 33.9977 11.7121L34.0302 11.4464C34.1442 10.5836 33.5374 9.7909 32.6725 9.67753C31.8098 9.56358 31.017 10.1703 30.9037 11.0352L30.8681 11.3062C30.7725 12.0521 30.1609 12.6474 29.4078 12.6714C29.044 12.6835 28.6821 12.7073 28.322 12.7414C27.5738 12.8138 26.8906 12.3046 26.6961 11.5787L26.6262 11.3179C26.4006 10.4758 25.5361 9.97668 24.6953 10.2031C23.8545 10.4296 23.3555 11.294 23.5805 12.134L23.6504 12.3948C23.8449 13.1207 23.5087 13.9019 22.8238 14.2147C22.4947 14.3652 22.1694 14.5255 21.8483 14.697C21.1842 15.0527 20.3548 14.8435 19.8969 14.246L19.7333 14.0306C19.2032 13.3404 18.2114 13.2084 17.5199 13.7377C16.8297 14.2677 16.6993 15.2568 17.2285 15.9484L17.3911 16.1596C17.847 16.7542 17.8385 17.6036 17.3279 18.1536C17.0817 18.4192 16.8418 18.6934 16.6108 18.977C16.137 19.561 15.2898 19.6865 14.6371 19.3097L14.4024 19.1742C13.6487 18.739 12.6838 18.9975 12.2486 19.7513C11.8134 20.505 12.072 21.47 12.8257 21.9051L13.0604 22.0406C13.7131 22.4175 14.0301 23.2133 13.7618 23.9177C13.6318 24.2596 13.5116 24.6029 13.4046 24.949C13.1836 25.6661 12.4549 26.0998 11.712 26.0022L11.4463 25.9697C10.5835 25.8557 9.79079 26.4625 9.67742 27.3274C9.56347 28.1901 10.1702 28.9829 11.0351 29.0962L11.3061 29.1318C12.0526 29.2296 12.6478 29.8411 12.674 30.5936C12.686 30.9574 12.7077 31.3198 12.7425 31.6821C12.8148 32.4303 12.3056 33.1135 11.5798 33.308L11.3163 33.3763C10.4741 33.602 9.97503 34.4664 10.2015 35.3072C10.4279 36.148 11.2916 36.6485 12.1324 36.422L12.3958 36.3537C13.1217 36.1592 13.9031 36.492 14.2146 37.1761C14.3656 37.5073 14.5265 37.8347 14.698 38.1558C15.0523 38.8192 14.8445 39.6493 14.247 40.1072L14.0316 40.2708C13.3414 40.8009 13.2094 41.7927 13.7387 42.4842C14.2687 43.1744 15.2578 43.3048 15.9494 42.7756L16.1606 42.613C16.7552 42.1571 17.6046 42.1656 18.1546 42.6762C18.4203 42.9224 18.6945 43.1623 18.978 43.3933C19.5609 43.8628 19.6864 44.7101 19.3096 45.3628L19.1741 45.5974C18.7389 46.3512 18.9974 47.3161 19.7512 47.7513C20.5049 48.1865 21.4699 47.9279 21.905 47.1742L22.0405 46.9395C22.4174 46.2868 23.2132 45.9698 23.9176 46.2381C24.2595 46.3681 24.6028 46.4883 24.9489 46.5953C25.666 46.8163 26.0997 47.545 26.0021 48.2879L25.9696 48.5536C25.8556 49.4164 26.4624 50.2091 27.3273 50.3225C28.19 50.4364 28.9827 49.8297 29.0961 48.9648L29.1317 48.6938C29.2295 47.9473 29.841 47.3521 30.5935 47.3259C30.9573 47.3139 31.3197 47.2922 31.682 47.2574C32.4302 47.1851 33.1134 47.6943 33.3079 48.4201L33.3762 48.6836C33.6019 49.5258 34.4663 50.0249 35.3071 49.7984C36.1479 49.572 36.6484 48.7083 36.4219 47.8675L36.3536 47.6041C36.1591 46.8782 36.4919 46.0967 37.176 45.7853C37.5072 45.6342 37.8345 45.4734 38.1557 45.3019C38.819 44.9475 39.6492 45.1554 40.1071 45.7529L40.2707 45.9683C40.8008 46.6585 41.7926 46.7905 42.4841 46.2612C43.1743 45.7312 43.3047 44.742 42.7755 44.0505L42.6129 43.8393C42.157 43.2447 42.1655 42.3953 42.676 41.8453C42.9223 41.5796 43.1622 41.3054 43.3932 41.0219C43.8627 40.439 44.7099 40.3135 45.3626 40.6903L45.5973 40.8258C46.3511 41.261 47.316 41.0025 47.7512 40.2487C48.1864 39.495 47.9278 38.53 47.1741 38.0949L46.9394 37.9594C46.2867 37.5825 45.9697 36.7867 46.238 36.0823C46.368 35.7404 46.4882 35.3971 46.5952 35.051C46.8162 34.3339 47.5449 33.9002 48.2878 33.9978L48.5535 34.0303C49.4163 34.1443 50.209 33.5375 50.3224 32.6726C50.4363 31.8099 49.8296 31.0171 48.9647 30.9038L48.6936 30.8682C47.9472 30.7704 47.352 30.1589 47.3258 29.4064C47.3137 29.0426 47.2921 28.6802 47.2573 28.3179C47.185 27.5697 47.6942 26.8865 48.42 26.692L48.6835 26.6237C49.5257 26.398 50.0248 25.5336 49.7983 24.6928C49.5727 23.8506 48.7082 23.3515 47.8674 23.578L47.6051 23.6505C46.8792 23.845 46.0951 23.5107 45.7837 22.8265C45.6326 22.4953 45.4717 22.168 45.3003 21.8469C44.9459 21.1835 45.1564 20.3549 45.7539 19.897L45.9693 19.7334C46.6595 19.2033 46.7915 18.2115 46.2622 17.52C45.7322 16.8298 44.7431 16.6994 44.0515 17.2286L43.8377 17.3896C43.243 17.8456 42.3937 17.8371 41.8437 17.3265C41.578 17.0803 41.3038 16.8404 41.0203 16.6093C40.4376 16.1364 40.3134 15.29 40.6902 14.6373L40.8257 14.4026C41.2609 13.6488 41.0024 12.6839 40.2486 12.2487ZM36.3068 19.0761C41.8761 22.2916 44.0557 29.1118 41.6188 34.8875L33.1485 29.9972C33.1485 29.4446 33.0033 28.9017 32.7274 28.4229C32.4516 27.9441 32.0547 27.5462 31.5766 27.269C31.5757 27.2685 31.5748 27.268 31.5739 27.2675L31.5763 17.4829C33.1968 17.6861 34.8037 18.2083 36.3068 19.0761ZM28.4242 17.4979L28.4253 27.2703C27.9453 27.5464 27.5465 27.9441 27.2689 28.4233C26.9947 28.902 26.8508 29.4442 26.8517 29.9959L18.3837 34.8822C16.9119 31.3721 17.0262 27.2435 19.076 23.6931C21.1266 20.1414 24.6467 17.9772 28.4242 17.4979ZM31.5745 32.7297L40.0421 37.6185C36.2586 42.6168 29.2623 44.1393 23.693 40.9239C22.1899 40.0561 20.9342 38.9255 19.9479 37.6237L28.4205 32.7294C28.4214 32.7299 28.4223 32.7305 28.4232 32.731C28.9024 33.0072 29.4459 33.1524 29.999 33.1522C30.5521 33.152 31.0954 33.0063 31.5745 32.7297V32.7297Z" stroke="url(#paint4_linear_92_189)" stroke-width="0.60357" shape-rendering="crispEdges" mask="url(#path-4-inside-1_92_189)"/>
</g>
<circle cx="29.9965" cy="29.9965" r="0.999874" fill="#41465A"/>
<defs>
<filter id="filter0_i_92_189" x="17.998" y="17.998" width="23.9971" height="23.997" filterUnits="userSpaceOnUse" color-interpolation-filters="sRGB">
<feFlood flood-opacity="0" result="BackgroundImageFix"/>
<feBlend mode="normal" in="SourceGraphic" in2="BackgroundImageFix" result="shape"/>
<feColorMatrix in="SourceAlpha" type="matrix" values="0 0 0 0 0 0 0 0 0 0 0 0 0 0 0 0 0 0 127 0" result="hardAlpha"/>
<feOffset/>
<feGaussianBlur stdDeviation="1"/>
<feComposite in2="hardAlpha" operator="arithmetic" k2="-1" k3="1"/>
<feColorMatrix type="matrix" values="0 0 0 0 0 0 0 0 0 0 0 0 0 0 0 0 0 0 0.25 0"/>
<feBlend mode="normal" in2="shape" result="effect1_innerShadow_92_189"/>
</filter>
<filter id="filter1_i_92_189" x="23.9973" y="23.9973" width="11.9985" height="11.9985" filterUnits="userSpaceOnUse" color-interpolation-filters="sRGB">
<feFlood flood-opacity="0" result="BackgroundImageFix"/>
<feBlend mode="normal" in="SourceGraphic" in2="BackgroundImageFix" result="shape"/>
<feColorMatrix in="SourceAlpha" type="matrix" values="0 0 0 0 0 0 0 0 0 0 0 0 0 0 0 0 0 0 127 0" result="hardAlpha"/>
<feOffset/>
<feGaussianBlur stdDeviation="0.5"/>
<feComposite in2="hardAlpha" operator="arithmetic" k2="-1" k3="1"/>
<feColorMatrix type="matrix" values="0 0 0 0 0 0 0 0 0 0 0 0 0 0 0 0 0 0 0.25 0"/>
<feBlend mode="normal" in2="shape" result="effect1_innerShadow_92_189"/>
</filter>
<filter id="filter2_bd_92_189" x="7.24929" y="7.24948" width="45.5012" height="46.7082" filterUnits="userSpaceOnUse" color-interpolation-filters="sRGB">
<feFlood flood-opacity="0" result="BackgroundImageFix"/>
<feGaussianBlur in="BackgroundImage" stdDeviation="1.20714"/>
<feComposite in2="SourceAlpha" operator="in" result="effect1_backgroundBlur_92_189"/>
<feColorMatrix in="SourceAlpha" type="matrix" values="0 0 0 0 0 0 0 0 0 0 0 0 0 0 0 0 0 0 127 0" result="hardAlpha"/>
<feOffset dy="1.20714"/>
<feGaussianBlur stdDeviation="1.20714"/>
<feComposite in2="hardAlpha" operator="out"/>
<feColorMatrix type="matrix" values="0 0 0 0 0 0 0 0 0 0 0 0 0 0 0 0 0 0 0.25 0"/>
<feBlend mode="normal" in2="effect1_backgroundBlur_92_189" result="effect2_dropShadow_92_189"/>
<feBlend mode="normal" in="SourceGraphic" in2="effect2_dropShadow_92_189" result="shape"/>
</filter>
<linearGradient id="paint0_linear_92_189" x1="29.9962" y1="3.99976" x2="29.9962" y2="55.9932" gradientUnits="userSpaceOnUse">
<stop stop-color="#6F7795"/>
<stop offset="1" stop-color="#525870"/>
</linearGradient>
<linearGradient id="paint1_linear_92_189" x1="29.9965" y1="17.998" x2="29.9965" y2="41.995" gradientUnits="userSpaceOnUse">
<stop stop-color="#9DA0AF"/>
<stop offset="1" stop-color="#8C89A4"/>
</linearGradient>
<linearGradient id="paint2_linear_92_189" x1="29.9966" y1="23.9973" x2="29.9966" y2="35.9957" gradientUnits="userSpaceOnUse">
<stop stop-color="#717689"/>
<stop offset="1" stop-color="#7C8499"/>
</linearGradient>
<linearGradient id="paint3_linear_92_189" x1="24.8853" y1="10.45" x2="24.8853" y2="48.827" gradientUnits="userSpaceOnUse">
<stop stop-color="#E7ECF2"/>
<stop offset="1" stop-color="#C6C7CC"/>
</linearGradient>
<linearGradient id="paint4_linear_92_189" x1="19.7512" y1="10.45" x2="19.7512" y2="49.8833" gradientUnits="userSpaceOnUse">
<stop stop-color="#E4E4E4"/>
<stop offset="1" stop-color="#C6C8CD"/>
</linearGradient>
</defs>
</svg>
