<svg width="60" height="60" viewBox="0 0 60 60" fill="none" xmlns="http://www.w3.org/2000/svg">
<path d="M5 8C5 5.79086 6.79086 4 9 4H14.6271H51C53.2091 4 55 5.79086 55 8V49.9998C55 52.2089 53.2091 53.9998 51 53.9998H9C6.79086 53.9998 5 52.2089 5 49.9998V10.4181V8Z" fill="url(#paint0_linear_12_995)"/>
<rect x="13.4517" y="9.1438" width="32.5046" height="36.6665" rx="2.43056" fill="#FFF7DD" fill-opacity="0.5"/>
<rect x="10.2007" y="13.3332" width="39.0056" height="39.9998" rx="2.43056" fill="#FFFFFD"/>
<g filter="url(#filter0_b_12_995)">
<path d="M5 22.6667C5 21.5621 5.89543 20.6667 7 20.6667H14.6271H53C54.1046 20.6667 55 21.5621 55 22.6667V51.9998C55 53.1044 54.1046 53.9998 53 53.9998H7C5.89543 53.9998 5 53.1044 5 51.9998V27.0848V22.6667Z" fill="url(#paint1_linear_12_995)" fill-opacity="0.85"/>
</g>
<g filter="url(#filter1_d_12_995)">
<path d="M38.3816 26.6191H22.7818C21.8642 26.6191 21.2524 27.2464 21.2524 28.1875V48.89C21.2524 49.6742 22.0171 50.4584 22.7818 50.4584H32.5699C33.4876 50.4584 34.0993 49.8311 34.0993 48.89V45.5964C34.0993 44.8122 34.864 44.0281 35.6287 44.0281H38.2287C39.1463 44.0281 39.7581 43.4007 39.7581 42.4597V28.0306C40.064 27.2464 39.2993 26.6191 38.3816 26.6191ZM33.3346 39.4798C33.3409 39.5844 33.3254 39.6892 33.2892 39.7873C33.253 39.8853 33.1969 39.9744 33.1246 40.0485C33.0523 40.1227 32.9654 40.1802 32.8698 40.2173C32.7742 40.2545 32.672 40.2704 32.5699 40.264H25.6877C25.5856 40.2704 25.4834 40.2545 25.3878 40.2173C25.2922 40.1802 25.2054 40.1227 25.1331 40.0485C25.0608 39.9744 25.0047 39.8853 24.9684 39.7873C24.9322 39.6892 24.9167 39.5844 24.923 39.4798V39.3229C24.9167 39.2183 24.9322 39.1135 24.9684 39.0154C25.0047 38.9174 25.0608 38.8283 25.1331 38.7542C25.2054 38.68 25.2922 38.6225 25.3878 38.5854C25.4834 38.5482 25.5856 38.5323 25.6877 38.5387H32.5699C33.0288 38.5387 33.3346 38.8524 33.3346 39.4798ZM36.6993 35.2452C36.7056 35.3498 36.6901 35.4546 36.6539 35.5527C36.6176 35.6507 36.5615 35.7398 36.4892 35.8139C36.4169 35.888 36.3301 35.9456 36.2345 35.9827C36.1389 36.0199 36.0367 36.0358 35.9346 36.0293H25.6877C25.2289 35.8725 24.77 35.5588 24.77 35.2452V35.0883C24.7638 34.9837 24.7793 34.8788 24.8155 34.7808C24.8517 34.6827 24.9078 34.5937 24.9801 34.5196C25.0524 34.4454 25.1392 34.3879 25.2349 34.3507C25.3305 34.3136 25.4327 34.2977 25.5347 34.3041H35.7817C36.3934 34.3041 36.6993 34.6178 36.6993 35.2452ZM36.6993 31.0105C36.7056 31.1152 36.6901 31.22 36.6539 31.3181C36.6176 31.4161 36.5615 31.5051 36.4892 31.5793C36.4169 31.6534 36.3301 31.711 36.2345 31.7481C36.1389 31.7853 36.0367 31.8011 35.9346 31.7947H25.6877C25.5856 31.8011 25.4834 31.7853 25.3878 31.7481C25.2922 31.711 25.2054 31.6534 25.1331 31.5793C25.0608 31.5051 25.0047 31.4161 24.9684 31.3181C24.9322 31.22 24.9167 31.1152 24.923 31.0105V30.8537C24.9167 30.749 24.9322 30.6442 24.9684 30.5462C25.0047 30.4481 25.0608 30.3591 25.1331 30.2849C25.2054 30.2108 25.2922 30.1533 25.3878 30.1161C25.4834 30.079 25.5856 30.0631 25.6877 30.0695H35.9346C36.3934 30.0695 36.6993 30.3832 36.6993 31.0105Z" fill="white"/>
<path d="M35.1702 46.6944V48.8901C35.1702 49.6743 36.0878 49.988 36.5466 49.5175L39.6054 46.3807C40.0642 45.9102 39.7583 44.9692 38.9936 44.9692H36.8525C36.4075 44.9731 35.9818 45.1561 35.6671 45.4788C35.3525 45.8015 35.174 46.2381 35.1702 46.6944V46.6944Z" fill="white"/>
</g>
<defs>
<filter id="filter0_b_12_995" x="1.32653" y="16.9932" width="57.3469" height="40.6801" filterUnits="userSpaceOnUse" color-interpolation-filters="sRGB">
<feFlood flood-opacity="0" result="BackgroundImageFix"/>
<feGaussianBlur in="BackgroundImage" stdDeviation="1.83673"/>
<feComposite in2="SourceAlpha" operator="in" result="effect1_backgroundBlur_12_995"/>
<feBlend mode="normal" in="SourceGraphic" in2="effect1_backgroundBlur_12_995" result="shape"/>
</filter>
<filter id="filter1_d_12_995" x="19.2524" y="25.6191" width="22.5742" height="27.8393" filterUnits="userSpaceOnUse" color-interpolation-filters="sRGB">
<feFlood flood-opacity="0" result="BackgroundImageFix"/>
<feColorMatrix in="SourceAlpha" type="matrix" values="0 0 0 0 0 0 0 0 0 0 0 0 0 0 0 0 0 0 127 0" result="hardAlpha"/>
<feOffset dy="1"/>
<feGaussianBlur stdDeviation="1"/>
<feComposite in2="hardAlpha" operator="out"/>
<feColorMatrix type="matrix" values="0 0 0 0 0 0 0 0 0 0 0 0 0 0 0 0 0 0 0.25 0"/>
<feBlend mode="normal" in2="BackgroundImageFix" result="effect1_dropShadow_12_995"/>
<feBlend mode="normal" in="SourceGraphic" in2="effect1_dropShadow_12_995" result="shape"/>
</filter>
<linearGradient id="paint0_linear_12_995" x1="42.9167" y1="4.92315" x2="42.1679" y2="52.3486" gradientUnits="userSpaceOnUse">
<stop offset="0.0001" stop-color="#698493"/>
<stop offset="0.51875" stop-color="#5D7684"/>
<stop offset="1" stop-color="#6986A4"/>
</linearGradient>
<linearGradient id="paint1_linear_12_995" x1="31.1199" y1="21.2619" x2="29.8975" y2="52.7621" gradientUnits="userSpaceOnUse">
<stop stop-color="#B3C4D5"/>
<stop offset="0.51875" stop-color="#95AFC9"/>
<stop offset="1" stop-color="#6986A4"/>
</linearGradient>
</defs>
</svg>
