<svg width="60" height="60" viewBox="0 0 60 60" fill="none" xmlns="http://www.w3.org/2000/svg">
<path d="M5 8C5 5.79086 6.79086 4 9 4H14.6271H51C53.2091 4 55 5.79086 55 8V50C55 52.2091 53.2091 53.9999 51 53.9999H9C6.79086 53.9999 5 52.2091 5 49.9999V10.4181V8Z" fill="url(#paint0_linear_12_976)"/>
<rect x="13.4517" y="9.1438" width="32.5046" height="36.6666" rx="2.43056" fill="#FFF7DD" fill-opacity="0.5"/>
<rect x="10.2007" y="13.3332" width="39.0056" height="40" rx="2.43056" fill="#FFFFFD"/>
<g filter="url(#filter0_b_12_976)">
<path d="M5 22.6667C5 21.5622 5.89543 20.6667 7 20.6667H14.6271H53C54.1046 20.6667 55 21.5622 55 22.6667V52C55 53.1046 54.1046 54 53 54H7C5.89543 54 5 53.1046 5 52V27.0848V22.6667Z" fill="url(#paint1_linear_12_976)" fill-opacity="0.85"/>
</g>
<g filter="url(#filter1_d_12_976)">
<g filter="url(#filter2_d_12_976)">
<path d="M23.5745 46.7575V30.2375C23.5745 28.8223 25.1693 27.9946 26.3265 28.8093L37.9999 37.0269C38.9853 37.7206 38.9888 39.1801 38.0068 39.8785L26.3334 48.1808C25.177 49.0033 23.5745 48.1765 23.5745 46.7575Z" fill="white"/>
</g>
<rect x="9.64355" y="27.8096" width="3.64713" height="3.74011" rx="0.672252" fill="#412D68"/>
<rect x="9.64355" y="36.1429" width="3.64713" height="3.74011" rx="0.672252" fill="#412D68"/>
<rect x="9.64355" y="44.4764" width="3.64713" height="3.74011" rx="0.672252" fill="#412D68"/>
<rect x="46.6277" y="27.8096" width="3.64713" height="3.74011" rx="0.672252" fill="#412D68"/>
<rect x="46.6277" y="36.1429" width="3.64713" height="3.74011" rx="0.672252" fill="#412D68"/>
<rect x="46.6277" y="44.4764" width="3.64713" height="3.74011" rx="0.672252" fill="#412D68"/>
</g>
<defs>
<filter id="filter0_b_12_976" x="1" y="16.6667" width="58" height="41.3333" filterUnits="userSpaceOnUse" color-interpolation-filters="sRGB">
<feFlood flood-opacity="0" result="BackgroundImageFix"/>
<feGaussianBlur in="BackgroundImage" stdDeviation="2"/>
<feComposite in2="SourceAlpha" operator="in" result="effect1_backgroundBlur_12_976"/>
<feBlend mode="normal" in="SourceGraphic" in2="effect1_backgroundBlur_12_976" result="shape"/>
</filter>
<filter id="filter1_d_12_976" x="7.63049" y="26.0964" width="44.6575" height="24.7236" filterUnits="userSpaceOnUse" color-interpolation-filters="sRGB">
<feFlood flood-opacity="0" result="BackgroundImageFix"/>
<feColorMatrix in="SourceAlpha" type="matrix" values="0 0 0 0 0 0 0 0 0 0 0 0 0 0 0 0 0 0 127 0" result="hardAlpha"/>
<feOffset dy="0.299818"/>
<feGaussianBlur stdDeviation="1.00653"/>
<feColorMatrix type="matrix" values="0 0 0 0 0 0 0 0 0 0 0 0 0 0 0 0 0 0 0.25 0"/>
<feBlend mode="normal" in2="BackgroundImageFix" result="effect1_dropShadow_12_976"/>
<feBlend mode="normal" in="SourceGraphic" in2="effect1_dropShadow_12_976" result="shape"/>
</filter>
<filter id="filter2_d_12_976" x="21.2456" y="26.159" width="19.8244" height="24.677" filterUnits="userSpaceOnUse" color-interpolation-filters="sRGB">
<feFlood flood-opacity="0" result="BackgroundImageFix"/>
<feColorMatrix in="SourceAlpha" type="matrix" values="0 0 0 0 0 0 0 0 0 0 0 0 0 0 0 0 0 0 127 0" result="hardAlpha"/>
<feOffset/>
<feGaussianBlur stdDeviation="1.16441"/>
<feComposite in2="hardAlpha" operator="out"/>
<feColorMatrix type="matrix" values="0 0 0 0 0 0 0 0 0 0 0 0 0 0 0 0 0 0 0.25 0"/>
<feBlend mode="normal" in2="BackgroundImageFix" result="effect1_dropShadow_12_976"/>
<feBlend mode="normal" in="SourceGraphic" in2="effect1_dropShadow_12_976" result="shape"/>
</filter>
<linearGradient id="paint0_linear_12_976" x1="42.9167" y1="4.92316" x2="42.1679" y2="52.3488" gradientUnits="userSpaceOnUse">
<stop stop-color="#805CBD"/>
<stop offset="0.51875" stop-color="#805CBD"/>
<stop offset="1" stop-color="#805CBD"/>
</linearGradient>
<linearGradient id="paint1_linear_12_976" x1="24.1777" y1="21.1992" x2="22.9557" y2="52.691" gradientUnits="userSpaceOnUse">
<stop stop-color="#A96BF3"/>
<stop offset="0.51875" stop-color="#A364F1"/>
<stop offset="1" stop-color="#9654ED"/>
</linearGradient>
</defs>
</svg>
