<svg width="60" height="60" viewBox="0 0 60 60" fill="none" xmlns="http://www.w3.org/2000/svg">
<path d="M5 8C5 5.79086 6.79086 4 9 4H14.6271H51C53.2091 4 55 5.79086 55 8V49.9999C55 52.2091 53.2091 53.9999 51 53.9999H9C6.79086 53.9999 5 52.2091 5 49.9999V10.4181V8Z" fill="url(#paint0_linear_12_967)"/>
<rect x="13.4514" y="9.14362" width="32.5046" height="36.6666" rx="2.43056" fill="#FFF7DD" fill-opacity="0.5"/>
<rect x="10.2007" y="13.3333" width="39.0056" height="40" rx="2.43056" fill="#FFFFFD"/>
<g filter="url(#filter0_b_12_967)">
<path d="M5 22.6667C5 21.5622 5.89543 20.6667 7 20.6667H14.6271H53C54.1046 20.6667 55 21.5622 55 22.6667V52C55 53.1046 54.1046 54 53 54H7C5.89543 54 5 53.1046 5 52V27.0848V22.6667Z" fill="url(#paint1_linear_12_967)" fill-opacity="0.85"/>
</g>
<g filter="url(#filter1_d_12_967)">
<path fill-rule="evenodd" clip-rule="evenodd" d="M33.6594 25.4287H21.325C20.9979 25.4287 20.6841 25.562 20.4528 25.7992C20.2215 26.0364 20.0916 26.3581 20.0916 26.6936V49.4615C20.0916 49.797 20.2215 50.1187 20.4528 50.3559C20.6841 50.5932 20.9979 50.7264 21.325 50.7264H38.5932C38.9203 50.7264 39.234 50.5932 39.4653 50.3559C39.6967 50.1187 39.8266 49.797 39.8266 49.4615V31.7531L33.6594 25.4287ZM26.2314 35.2828C26.0886 34.5997 25.433 34.1646 24.7669 34.311C24.1008 34.4574 23.6765 35.1298 23.8193 35.8128L25.6694 44.667C25.7792 45.1923 26.2005 45.5892 26.7201 45.6568C27.2398 45.7245 27.7444 45.4481 27.9787 44.9677L29.9591 40.9059L31.9395 44.9677C32.1737 45.4481 32.6784 45.7245 33.198 45.6568C33.7177 45.5892 34.139 45.1923 34.2487 44.667L36.0989 35.8128C36.2416 35.1298 35.8174 34.4574 35.1513 34.311C34.4852 34.1646 33.8295 34.5997 33.6868 35.2828L32.5734 40.6111L31.0623 37.5119C30.8534 37.0834 30.4263 36.8127 29.9591 36.8127C29.4919 36.8127 29.0648 37.0834 28.8559 37.5119L27.3448 40.6111L26.2314 35.2828Z" fill="white"/>
</g>
<defs>
<filter id="filter0_b_12_967" x="1.32653" y="16.9933" width="57.3469" height="40.6802" filterUnits="userSpaceOnUse" color-interpolation-filters="sRGB">
<feFlood flood-opacity="0" result="BackgroundImageFix"/>
<feGaussianBlur in="BackgroundImage" stdDeviation="1.83673"/>
<feComposite in2="SourceAlpha" operator="in" result="effect1_backgroundBlur_12_967"/>
<feBlend mode="normal" in="SourceGraphic" in2="effect1_backgroundBlur_12_967" result="shape"/>
</filter>
<filter id="filter1_d_12_967" x="17.9666" y="24.3662" width="23.9851" height="29.5477" filterUnits="userSpaceOnUse" color-interpolation-filters="sRGB">
<feFlood flood-opacity="0" result="BackgroundImageFix"/>
<feColorMatrix in="SourceAlpha" type="matrix" values="0 0 0 0 0 0 0 0 0 0 0 0 0 0 0 0 0 0 127 0" result="hardAlpha"/>
<feOffset dy="1.0625"/>
<feGaussianBlur stdDeviation="1.0625"/>
<feComposite in2="hardAlpha" operator="out"/>
<feColorMatrix type="matrix" values="0 0 0 0 0 0 0 0 0 0 0 0 0 0 0 0 0 0 0.25 0"/>
<feBlend mode="normal" in2="BackgroundImageFix" result="effect1_dropShadow_12_967"/>
<feBlend mode="normal" in="SourceGraphic" in2="effect1_dropShadow_12_967" result="shape"/>
</filter>
<linearGradient id="paint0_linear_12_967" x1="42.9167" y1="4.92316" x2="42.1679" y2="52.3488" gradientUnits="userSpaceOnUse">
<stop offset="0.0001" stop-color="#9A2200"/>
<stop offset="0.51875" stop-color="#933014"/>
<stop offset="1" stop-color="#F25022"/>
</linearGradient>
<linearGradient id="paint1_linear_12_967" x1="31.1199" y1="21.262" x2="29.8975" y2="52.7623" gradientUnits="userSpaceOnUse">
<stop stop-color="#FF6A3F"/>
<stop offset="0.51875" stop-color="#F25022"/>
<stop offset="1" stop-color="#D94920"/>
</linearGradient>
</defs>
</svg>
