<svg width="60" height="60" viewBox="0 0 60 60" fill="none" xmlns="http://www.w3.org/2000/svg">
<path d="M5 8.89005C5 6.74164 6.74163 5 8.89005 5H14.6271H51.1099C53.2584 5 55 6.74163 55 8.89005V51.1097C55 53.2581 53.2584 54.9998 51.11 54.9998H8.89005C6.74164 54.9998 5 53.2581 5 51.1097V11.4181V8.89005Z" fill="url(#paint0_linear_92_191)"/>
<rect x="13.4514" y="10.1436" width="32.5046" height="36.6665" rx="2.58561" fill="#FFF7DD" fill-opacity="0.5"/>
<rect x="10.2007" y="14.3333" width="39.0056" height="39.9998" rx="2.58561" fill="#FFFFFD"/>
<g filter="url(#filter0_b_92_191)">
<path d="M5 21.638C5 20.6067 5.83598 19.7708 6.86722 19.7708H23.5575C25.3934 19.7708 27.1356 20.5813 28.3183 21.9855L30.7638 24.8893C31.9464 26.2935 33.6886 27.104 35.5245 27.104H55V53.1328C55 54.1641 54.164 55 53.1328 55H6.86722C5.83598 55 5 54.1641 5 53.1328V21.638Z" fill="url(#paint1_linear_92_191)" fill-opacity="0.85"/>
</g>
<mask id="mask0_92_191" style="mask-type:alpha" maskUnits="userSpaceOnUse" x="8" y="23" width="45" height="32">
<path d="M8.06128 27.268C8.06128 25.3723 9.59801 23.8356 11.4937 23.8356H48.7465C50.6422 23.8356 52.1789 25.3723 52.1789 27.268V51.4878C52.1789 53.3835 50.6422 54.9202 48.7465 54.9202H11.4937C9.59801 54.9202 8.06128 53.3835 8.06128 51.4878V27.268Z" fill="#E5E5E5"/>
</mask>
<g mask="url(#mask0_92_191)">
<path d="M19.1054 44.129H40.9057C41.2707 44.129 41.5666 44.4249 41.5666 44.7899V59.5112C41.5666 59.8762 41.2707 60.1721 40.9057 60.1721H19.1054C18.7404 60.1721 18.4446 59.8762 18.4446 59.5112V57.4804V44.7899C18.4446 44.4249 18.7404 44.129 19.1054 44.129Z" stroke="url(#paint2_linear_92_191)" stroke-width="6.60883" stroke-linejoin="round"/>
</g>
<defs>
<filter id="filter0_b_92_191" x="1.09219" y="15.8629" width="57.8156" height="43.0449" filterUnits="userSpaceOnUse" color-interpolation-filters="sRGB">
<feFlood flood-opacity="0" result="BackgroundImageFix"/>
<feGaussianBlur in="BackgroundImage" stdDeviation="1.95391"/>
<feComposite in2="SourceAlpha" operator="in" result="effect1_backgroundBlur_92_191"/>
<feBlend mode="normal" in="SourceGraphic" in2="effect1_backgroundBlur_92_191" result="shape"/>
</filter>
<linearGradient id="paint0_linear_92_191" x1="42.9167" y1="5.92315" x2="42.1679" y2="53.3486" gradientUnits="userSpaceOnUse">
<stop stop-color="#FEB417"/>
<stop offset="0.51875" stop-color="#FDB307"/>
<stop offset="1" stop-color="#DFBC45"/>
<stop offset="1" stop-color="#DB9801"/>
</linearGradient>
<linearGradient id="paint1_linear_92_191" x1="24.1777" y1="20.3335" x2="22.8129" y2="53.6107" gradientUnits="userSpaceOnUse">
<stop stop-color="#FFD459"/>
<stop offset="0.51875" stop-color="#FFCC40"/>
<stop offset="1" stop-color="#FEC529"/>
</linearGradient>
<linearGradient id="paint2_linear_92_191" x1="17.1672" y1="40.8246" x2="23.7654" y2="56.216" gradientUnits="userSpaceOnUse">
<stop stop-color="#66D7F7"/>
<stop offset="1" stop-color="#00BCF1"/>
</linearGradient>
</defs>
</svg>
