{
    "server": {
        "main": {
            "port": 80
        },
        "preview": {
            "port": 8080
        },
        "httpProtocol": 2,
        "tls": {
            "key": "",
            "cert": ""
        }
    }
}
