<svg width="400" height="417" viewBox="0 0 400 417" fill="none" xmlns="http://www.w3.org/2000/svg">
<path d="M351.342 416.198C376.932 416.198 397.676 404.209 397.676 389.421C397.676 374.632 376.932 362.643 351.342 362.643C325.752 362.643 305.008 374.632 305.008 389.421C305.008 404.209 325.752 416.198 351.342 416.198Z" fill="#EBEBEB"/>
<path d="M55.2467 246.896C79.5821 246.896 99.3098 235.495 99.3098 221.431C99.3098 207.367 79.5821 195.966 55.2467 195.966C30.9113 195.966 11.1836 207.367 11.1836 221.431C11.1836 235.495 30.9113 246.896 55.2467 246.896Z" fill="#EBEBEB"/>
<path d="M124.778 287.428C149.113 287.428 168.841 276.027 168.841 261.963C168.841 247.899 149.113 236.498 124.778 236.498C100.443 236.498 80.7148 247.899 80.7148 261.963C80.7148 276.027 100.443 287.428 124.778 287.428Z" fill="#EBEBEB"/>
<path d="M195.192 328.626C219.527 328.626 239.255 317.225 239.255 303.162C239.255 289.098 219.527 277.697 195.192 277.697C170.857 277.697 151.129 289.098 151.129 303.162C151.129 317.225 170.857 328.626 195.192 328.626Z" fill="#EBEBEB"/>
<path d="M266.782 369.397C291.117 369.397 310.845 357.996 310.845 343.932C310.845 329.868 291.117 318.467 266.782 318.467C242.446 318.467 222.719 329.868 222.719 343.932C222.719 357.996 242.446 369.397 266.782 369.397Z" fill="#EBEBEB"/>
<path d="M368.141 376.684C370.44 373.953 376.636 371.49 384.39 370.957C392.144 370.415 399.993 369.492 398.9 364.869C397.712 359.885 390.757 358.648 383.506 360.465C375.591 362.453 368.967 369.245 368.169 374.001L368.141 376.684Z" fill="#37474F"/>
<path d="M368.239 375.028C368.439 375.057 368.648 374.971 368.771 374.79C376.25 363.699 389.867 363.708 393.972 364.964C394.257 365.05 394.571 364.888 394.656 364.603C394.742 364.317 394.58 364.003 394.295 363.918C389.981 362.596 375.689 362.577 367.869 374.172C367.698 374.419 367.764 374.762 368.011 374.933C368.078 374.981 368.154 375.009 368.239 375.028Z" fill="white"/>
<path d="M368.139 376.683C368.139 376.683 373.793 362.947 383.998 356.603C387.03 354.719 390.327 352.284 392.627 350.61C397.568 347.014 396.418 342.153 390.413 341.373C381.48 340.213 373.878 346.776 369.64 356.203C365.412 365.62 368.139 376.683 368.139 376.683Z" fill="#455A64"/>
<path d="M368.219 370.149C368.485 370.187 368.751 370.015 368.817 369.74C372.856 352.912 387.091 346.215 390.759 345.825C391.053 345.797 391.262 345.53 391.234 345.235C391.205 344.941 390.939 344.731 390.645 344.76C386.188 345.235 371.915 352.256 367.772 369.492C367.706 369.778 367.877 370.072 368.171 370.139C368.19 370.149 368.209 370.149 368.219 370.149Z" fill="white"/>
<path d="M371.062 212.469C375.624 211.395 378.569 215.238 381.506 222.391C384.442 229.554 389.668 247 390.885 251.784C391.426 253.925 377.876 273.111 378.455 272.835C378.636 272.75 373.163 263.58 373.163 263.58L379.814 250.833L375.073 239.247L371.062 212.469Z" fill="#FFBE9D"/>
<path d="M377.539 374.143C378.157 374.381 378.309 375.551 378.404 377.891C378.47 379.661 378.85 382.752 376.779 383.37C374.707 383.989 371.666 383.675 370.346 382.001C368.692 379.917 367.571 378.082 365.205 375.542C363.152 373.335 360.929 371.28 360.102 368.189C359.351 365.392 359.978 364.184 361.879 363.366C364.502 362.253 368.616 365.896 370.669 366.476C372.436 366.971 376.921 373.906 377.539 374.143Z" fill="#263238"/>
<path d="M377.534 370.357V374.847C377.534 374.847 374.55 377.14 370.283 375.047C370.16 374.771 369.789 370.357 369.789 370.357H377.534Z" fill="#FFBE9D"/>
<path d="M356.171 389.42C356.171 389.42 356.998 391.922 357.435 394.11C357.787 395.851 358.29 398.752 357.682 400.055C357.074 401.358 354.708 402.205 351.031 402.177C348.645 402.158 344.939 403.775 342.402 405.192C339.78 406.657 336.929 406.666 334.154 406.333C330.885 405.953 327.493 404.05 326.97 402.7C326.438 401.339 327.122 400.693 334.829 397.401C334.895 397.373 342.953 393.73 346.688 389.611L356.171 389.42Z" fill="#263238"/>
<path d="M356.175 386.31C356.175 386.31 356.166 388.441 356.175 389.658C356.185 390.876 354.75 392.693 351.025 392.559C348.412 392.464 346.587 391.76 346.692 389.611V386.5L356.175 386.31Z" fill="#FFBE9D"/>
<path d="M382.374 337.178C382.127 327.704 380.188 323.537 380.188 323.537C380.188 323.537 380.91 311.827 382.488 297.492C384.882 275.671 383.78 271.438 379.475 261.621C379.475 261.621 342.777 257.901 341.655 273.159C340.259 292.175 340.097 325.887 340.601 332.603C341.104 339.318 341.095 338.072 342.729 351.666C344.022 362.415 346.682 386.491 346.682 386.491C351.557 389.125 356.166 386.3 356.166 386.3C356.166 386.3 359.169 355.727 358.855 347.984C358.475 338.519 357.933 336.113 357.933 336.113C357.933 336.113 362.228 308.156 362.884 303.228C362.884 303.228 363.483 312.056 363.986 318.771C364.49 325.487 364.452 328.217 365.858 342.115C366.97 353.007 369.65 371.585 369.65 371.585C373.992 373.42 377.651 370.995 377.651 370.995C377.651 370.995 382.573 344.845 382.374 337.178Z" fill="#FFC71B"/>
<path d="M352.27 207.533L353.989 221.725L366.457 220.603L365.031 204.841L352.27 207.533Z" fill="#FFBE9D"/>
<path d="M378.619 219.338C377.251 215.599 374.106 211.69 369.316 212.584C368.071 212.812 366.969 213.002 365.791 213.231C365.686 216.503 359.529 218.196 353.39 216.208C351.547 216.741 349.855 217.273 348.325 217.825C343.935 219.395 342.177 226.691 342.073 238.895C341.978 251.1 340.676 281.549 340.676 281.549L345.807 283.166L348.202 274.262L349.171 284.926C354.72 286.324 360.555 286.229 366.884 284.84C380.073 281.958 384.178 274.833 384.178 274.833C384.178 274.833 381.461 262.572 373.678 250.548C380.292 232.959 380.653 224.883 378.619 219.338Z" fill="#EBEBEB"/>
<path d="M343.004 189.497C343.004 189.497 340.391 184.531 343.945 178.948C348.126 172.365 356.203 171.252 365.762 173.811C370.504 175.086 377.127 180.127 377.726 189.221C378.182 196.241 358.626 201.416 359.073 206.229L343.004 189.497Z" fill="#263238"/>
<path d="M342.586 192.17C342.586 192.17 339.934 196.432 340.305 196.86C340.676 197.298 342.453 197.716 342.453 197.716L342.586 192.17Z" fill="#F3AB86"/>
<path d="M350.67 178.672C348.018 180.137 343.438 182.829 342.516 192.779C341.566 202.986 343.923 206.467 345.348 207.761C346.308 208.636 351.145 208.836 353.644 207.98C356.77 206.914 363.498 203.357 366.558 198.02C370.159 191.742 370.71 183.485 366.282 180.374C360.039 175.989 352.912 177.435 350.67 178.672Z" fill="#FFBE9D"/>
<path d="M350.662 179.88C349.997 181.764 348.135 186.206 347.85 191.6C347.85 191.6 345.417 191.6 344.267 191.01C344.267 191.01 344.21 186.729 345.36 184.304C345.36 184.304 343.763 186.862 343.269 190.658C343.269 190.658 341.122 190.496 339.877 189.393C338.955 184.817 341.815 175.381 349.902 173.878L350.662 179.88Z" fill="#263238"/>
<path d="M349.891 179.119C349.891 179.119 347.801 188.47 350.766 194.254C350.766 194.254 352.315 190.582 355.45 191.542C358.615 192.503 358.434 196.689 356.03 198.896C353.626 201.103 351.203 200.056 351.203 200.056C351.203 200.056 352.638 203.994 355.869 207.105C355.869 207.105 365.162 211.252 373.211 202.158C380.509 193.911 379.159 179.519 367.975 176.123C356.781 172.746 349.891 179.119 349.891 179.119Z" fill="#263238"/>
<path d="M380.831 200.189C383.036 202.529 382.618 206.506 379.9 209.083C377.182 211.652 373.182 211.842 370.977 209.502C368.773 207.162 369.191 203.186 371.909 200.608C374.626 198.03 378.617 197.849 380.831 200.189Z" fill="#263238"/>
<path d="M377.014 196.099C375.864 196.47 375.227 197.706 375.598 198.857L379.769 197.516C379.399 196.365 378.163 195.728 377.014 196.099Z" fill="#263238"/>
<path d="M316.777 240.313C314.972 238.239 314.668 233.673 312.254 230.524C309.897 227.452 310.287 224.208 308.767 225.625C307.151 227.138 308.387 232.189 308.387 232.189C308.387 232.189 305.583 237.402 305.346 240.075C305.108 242.738 312.159 249.445 312.159 249.445L316.777 240.313Z" fill="#FFBE9D"/>
<path d="M308.77 231.837C308.77 231.837 305.909 235.832 293.043 230.61C289.489 229.164 291.884 236.812 296.245 239.98C300.274 242.91 305.33 243.823 309.368 246.553C309.378 246.172 308.77 231.837 308.77 231.837Z" fill="#FFBE9D"/>
<path d="M349.421 217.454C345.753 218.729 342.551 220.213 339.13 226.643C334.73 234.91 326.739 251.109 326.739 251.109L316.78 240.313C316.78 240.313 315.326 238.268 312.637 242.729C309.938 247.19 311.136 248.417 311.136 248.417C311.136 248.417 322.729 263.961 324.848 265.93C326.976 267.908 330.473 266.367 332.744 263.257C335.025 260.146 346.818 238.762 346.818 238.762C346.818 238.762 354.6 225.274 349.421 217.454Z" fill="#FFBE9D"/>
<path opacity="0.2" d="M362.891 303.228L363.584 295.799C363.584 295.799 368.972 295.276 374.778 291.556C374.778 291.556 372.393 295.38 365.855 297.121L364.383 304.35L363.993 318.762L362.891 303.228Z" fill="black"/>
<path d="M341.914 247.333C341.914 247.333 346.522 239.257 346.817 238.781L341.543 259.261L341.914 247.333Z" fill="#CCCCCC"/>
<path d="M287.222 198.887C288.572 200.304 291.774 201.398 312.508 202.911C315.54 203.129 318.543 202.882 321.412 201.74C324.187 200.637 326.639 198.716 328.311 196.233C328.691 195.672 329.033 195.072 329.185 194.416C329.337 193.76 329.28 193.027 328.91 192.466C328.539 191.914 327.903 191.581 327.256 191.4C325.898 191.02 324.643 191.324 323.37 191.819C321.45 192.561 319.996 192.818 320.139 192.428C320.282 192.038 321.441 191.686 322.629 190.345C323.769 189.06 324.121 187.12 323.351 186.54C322.581 185.959 322.714 186.083 321.346 187.224C319.968 188.366 318.4 188.946 316.595 190.697C314.998 192.247 314.314 192.856 312.394 193.617C310.313 194.444 308.346 194.197 302.569 193.274C297.58 192.475 295.661 192.19 293.266 190.858C290.691 186.939 284.476 170.387 281.777 165.841C278.927 161.037 273.13 160.894 273.13 160.894C273.13 160.894 272.978 169.512 276.057 178.283C278.043 183.971 285.882 197.488 287.222 198.887Z" fill="#A36957"/>
<path d="M271.552 160.399C271.552 160.399 275.362 159.648 278.508 161.626C281.653 163.605 283.696 167.267 285.692 171.852C288.115 177.426 291.051 184.875 291.051 184.875C291.051 184.875 287.402 188.946 280.598 189.612L271.238 174.049L271.552 160.399Z" fill="#FFC71B"/>
<path d="M249.427 339.019H257.504V325.179H249.427V339.019Z" fill="#A36957"/>
<path d="M271.777 328.665L279.854 328.94L280.254 314.301L271.777 314.015V328.665Z" fill="#A36957"/>
<path d="M245.988 221.83C245.988 229.554 247.346 274.463 247.346 274.463C247.156 276.688 245.018 280.636 244.857 288.636C244.619 300.241 249.076 332.108 249.076 332.108C249.076 332.108 253 334.4 258.065 332.289C258.065 332.289 261.733 289.093 263.178 277.611C264.441 267.585 266.58 240.351 266.58 240.351L270.381 273.074C270.381 273.074 268.889 279.057 269.383 285.925C269.763 291.242 271.255 324.137 271.255 324.137C271.255 324.137 275.056 326.714 280.577 324.85C280.577 324.85 286.269 277.954 286.364 273.074C286.468 267.518 284.254 210.786 284.254 210.786L245.988 221.83Z" fill="#555555"/>
<path d="M251.302 165.031C249.525 165.83 248.119 167.276 247.406 169.084C246.77 170.701 246.228 172.984 246.228 176.075V191.914L246 221.83C257.593 227.947 272.331 228.356 284.694 219.319C284.694 219.319 284 180.813 284 174.515C284 174.23 283.991 173.945 283.981 173.65C283.535 164.651 274.688 158.477 265.974 160.722L258.657 162.606L251.302 165.031Z" fill="#F0F0F0"/>
<path d="M279.88 143.427C284.214 139.088 284.214 132.054 279.88 127.715C275.546 123.376 268.518 123.376 264.184 127.715C259.85 132.054 259.85 139.088 264.184 143.427C268.518 147.766 275.546 147.766 279.88 143.427Z" fill="#263238"/>
<path d="M252.852 143.467C252.852 143.467 254.648 151.923 255.37 153.312C256.092 154.701 257.584 155.101 257.584 155.101L257.46 149.146L252.852 143.467Z" fill="#263238"/>
<path d="M255.104 131.348C255.104 131.348 253.165 131.015 251.654 132.566C250.172 134.078 250.999 138.825 252.842 143.467L256.234 143.857L255.104 131.348Z" fill="#263238"/>
<path d="M257.251 143.857C256.576 144.266 255.607 142.953 254.761 142.078C253.925 141.203 251.188 140.004 249.82 142.877C248.433 145.807 251.027 149.688 253.174 150.363C256.89 151.533 257.441 149.146 257.441 149.146L257.717 162.958C262.335 168.874 275.135 168.38 269.794 162.197L269.785 158.116C269.785 158.116 273.149 158.629 274.783 158.373C277.51 157.954 279.23 155.795 280.057 152.836C281.387 148.09 281.891 144.256 280.76 134.915C279.525 124.68 267.628 124.565 261.204 128.618C254.799 132.66 257.251 143.857 257.251 143.857Z" fill="#A36957"/>
<path d="M257.25 145.008C256.907 145.017 255.606 142.858 254.76 142.087C253.591 141.022 255.102 131.357 255.102 131.357C255.102 131.357 253.981 128.951 256.233 126.468C257.839 124.699 259.587 123.586 264.215 123.338C266.923 123.196 271.256 123.624 273.698 123.785C278.269 124.099 279.961 122.967 282.583 122.235C284.588 121.674 284.816 128.932 279.742 131.338C279.742 131.338 278.089 132.404 273.746 132.936C269.403 133.469 262.628 132.832 261.706 132.708C260.442 132.537 260.176 133.754 259.502 137.103C258.894 140.014 258.399 144.979 257.25 145.008Z" fill="#263238"/>
<path d="M255.113 132.099L251.008 129.892C251.587 128.713 252.984 128.256 254.115 128.865C255.246 129.474 255.693 130.92 255.113 132.099Z" fill="#263238"/>
<path d="M269.802 158.116C269.802 158.116 263.711 156.889 261.582 155.757C260.157 154.996 258.979 153.683 258.637 152.836C258.637 152.836 259.036 154.644 260.309 156.28C261.868 158.278 269.802 159.742 269.802 159.742V158.116Z" fill="#8E5544"/>
<path d="M269.499 142.335C269.499 143.039 268.948 143.6 268.283 143.6C267.608 143.6 267.066 143.029 267.066 142.325C267.066 141.621 267.608 141.06 268.283 141.06C268.957 141.06 269.499 141.631 269.499 142.335Z" fill="#263238"/>
<path d="M268.204 137.721L265.591 139.167C265.202 138.416 265.477 137.483 266.199 137.084C266.921 136.684 267.824 136.97 268.204 137.721Z" fill="#263238"/>
<path d="M269.251 150.772L272.035 151.819C271.76 152.618 270.914 153.036 270.145 152.741C269.375 152.456 268.976 151.581 269.251 150.772Z" fill="#8E5544"/>
<path d="M280.034 138.739L277.648 136.903C278.133 136.218 279.064 136.076 279.72 136.589C280.376 137.093 280.518 138.054 280.034 138.739Z" fill="#263238"/>
<path d="M279.304 141.983C279.304 142.687 278.753 143.248 278.087 143.248C277.413 143.248 276.871 142.677 276.871 141.973C276.871 141.269 277.422 140.708 278.087 140.708C278.753 140.718 279.304 141.288 279.304 141.983Z" fill="#263238"/>
<path d="M273.078 140.832L273.477 148.175L277.316 146.872L273.078 140.832Z" fill="#8E5544"/>
<path d="M257.506 335.028V333.868C258.275 334.201 260.071 341.059 263.283 343.989C265.83 346.32 269.308 349.002 270.191 351.599C271.113 354.301 265.355 355.784 262.969 355.366C260.204 354.871 255.415 352.931 254.208 351.123C253.001 349.316 252.441 346.653 251.462 345.33C250.483 344.008 248.231 342.524 247.699 340.993C247.404 340.146 247.756 338.31 248.165 336.75C248.535 335.323 248.944 333.744 249.428 333.887C249.428 334.058 249.428 334.771 249.428 334.771C250.018 335.418 251.633 336.065 253.467 336.141C254.645 336.17 257.515 335.932 257.506 335.028Z" fill="#263238"/>
<path d="M279.937 326.448C280.355 326.467 280.697 327.057 281.619 328.056C282.74 329.264 284.565 330.577 286.37 331.48C289.392 332.993 295.274 335.323 297.935 336.531C299.598 337.283 299.522 339.29 297.802 340.432C296.082 341.573 291.939 342.401 286.95 341.288C284.232 340.679 280.707 338.168 278.464 338.31C276.231 338.443 272.041 338.415 270.397 337.273C268.743 336.132 269.408 333.706 269.874 331.613C270.387 329.33 271.024 325.773 271.775 325.935V326.724C272.744 328.199 277.761 328.798 279.89 327.713L279.937 326.448Z" fill="#263238"/>
<path d="M266.586 240.341C266.586 240.341 273.038 238.525 277.837 233.882C277.837 233.882 275.67 237.954 269.209 241.74L270.073 270.315L266.586 240.341Z" fill="#3F4040"/>
<path d="M232.829 205.222C238.008 174.877 243.31 165.65 251.996 165.336C254.675 168.237 254.428 177.426 250.703 183.172C250.703 183.172 242.721 202.454 241.629 209.217C240.669 215.162 239.624 222.639 239.966 227.69C240.023 228.584 240.441 229.422 241.077 230.049C242.797 231.733 242.873 233.16 244.023 235.062C244.926 236.556 245.857 237.079 245.62 237.441C245.306 237.897 244.289 238.525 242.949 237.773C242.275 237.393 241.828 236.927 240.821 235.928C240.821 235.928 241.201 238.287 242.702 241.265C244.736 245.307 244.394 247.438 238.749 246.24C235.214 245.488 232.877 242.691 231.936 234.311C231.67 231.895 231.252 228.09 231.385 225.017C231.727 217.008 232.012 209.997 232.829 205.222Z" fill="#A36957"/>
<path d="M254.122 164.1C251.48 164.585 244.705 164.823 241.237 171.833C238.947 176.447 236.656 183.676 234.195 192.333C234.195 192.333 239.279 197.603 246.777 196.851L250.967 184.732C254.949 179.577 255.937 167.981 254.122 164.1Z" fill="#FFC71B"/>
<path d="M206.012 162.102C198.629 132.337 190.191 125.422 198.078 121.417C206.184 120.627 210.365 125.422 211.78 133.964C212.474 138.14 213.976 155.31 215.857 162.035C217.51 167.942 219.734 175.295 222.214 179.823C222.651 180.622 223.393 181.222 224.248 181.526C226.557 182.354 227.232 183.628 229.113 184.893C230.586 185.883 231.669 185.968 231.603 186.406C231.517 186.967 230.842 187.975 229.275 187.852C228.486 187.785 227.878 187.557 226.519 187.053C226.519 187.053 227.878 189.069 230.538 191.181C234.149 194.044 234.748 196.156 229.018 197.478C225.426 198.306 222.072 196.708 217.625 189.374C216.342 187.262 214.327 183.923 213.139 181.022C210.023 173.478 207.2 166.896 206.012 162.102Z" fill="#FFBE9D"/>
<path d="M180.535 294.81V293.659C180.991 295.009 183.101 300.85 186.303 303.77C188.85 306.091 192.318 308.774 193.202 311.371C194.124 314.063 188.375 314.967 185.99 314.548C183.224 314.063 179.651 312.493 177.703 310.096C176.335 308.412 175.461 306.424 174.491 305.093C173.513 303.77 171.261 302.296 170.738 300.764C170.443 299.927 170.795 298.082 171.204 296.522C171.574 295.095 171.983 293.526 172.467 293.659C172.467 293.83 172.467 294.543 172.467 294.543C173.057 295.19 174.672 295.837 176.497 295.904C177.684 295.942 180.545 295.713 180.535 294.81Z" fill="#263238"/>
<path d="M188.604 305.806C187.815 305.102 187.017 304.408 186.304 303.751C184.071 301.706 182.361 298.244 181.382 295.885C180.821 294.534 180.536 293.098 180.536 291.633V287.029H172.469V294.524V294.724L172.507 294.743C172.896 296.417 176.593 300.888 178.702 303.799C180.109 305.749 182.788 308.232 185.991 308.66C189.032 309.069 190.58 308.108 188.604 305.806Z" fill="#FFBE9D"/>
<path d="M212.008 286.848V285.697C212.464 287.048 214.573 292.888 217.776 295.809C220.322 298.13 223.791 300.812 224.675 303.409C225.596 306.101 219.847 307.005 217.462 306.586C214.697 306.101 211.124 304.532 209.176 302.135C207.808 300.451 206.933 298.463 205.964 297.131C204.985 295.809 202.733 294.334 202.211 292.803C201.916 291.966 202.268 290.12 202.676 288.56C203.047 287.133 203.455 285.564 203.94 285.697C203.94 285.868 203.94 286.582 203.94 286.582C204.529 287.229 206.145 287.875 207.969 287.942C209.147 287.98 212.017 287.752 212.008 286.848Z" fill="#263238"/>
<path d="M220.077 297.844C219.288 297.14 218.49 296.446 217.777 295.79C215.544 293.744 213.834 290.282 212.855 287.923C212.294 286.572 212.009 285.136 212.009 283.671V279.067H203.941V286.563V286.762L203.979 286.781C204.369 288.456 208.065 292.926 210.175 295.837C211.581 297.787 214.261 300.27 217.463 300.698C220.495 301.107 222.044 300.146 220.077 297.844Z" fill="#FFBE9D"/>
<path d="M174.075 169.303C167.823 182.981 174.304 231.152 174.304 231.152C174.113 233.369 171.576 237.735 170.636 247.504C169.524 259.043 172.384 288.018 172.384 288.018C172.384 288.018 176.118 290.463 180.537 288.341C180.537 288.341 188.225 244.698 189.669 233.226C190.933 223.21 193.356 201.198 193.356 201.198L200.236 233.179C200.236 233.179 198.468 238.791 198.06 243.062C197.404 249.816 203.942 281.235 203.942 281.235C203.942 281.235 206.726 282.253 212.009 281.483C212.009 281.483 214.319 239.78 214.927 231.657C215.953 218.006 212.323 175.4 209.824 167.314L174.075 169.303Z" fill="#9FD6EE"/>
<path opacity="0.1" d="M193.355 201.188L195.389 188.489C195.389 188.489 203.979 186.71 207.875 183.038C207.875 183.038 203.789 188.127 197.717 189.792L195.437 199.571L199.428 229.183L193.355 201.188Z" fill="black"/>
<path d="M185.102 121.788C177.082 122.34 176.521 126.221 174.516 130.454C172.986 133.679 172.967 137.427 174.136 140.803L179.724 156.984C179.724 156.984 176.084 163.101 174.07 169.293C188.095 177.132 205.599 173.013 209.818 167.296C209.999 166.088 208.915 156.604 208.25 150.411C210.721 144.209 211.367 140.28 210.331 136.18C208.393 128.57 200.886 121.16 197.569 121.427L185.102 121.788Z" fill="#F5F5F5"/>
<path d="M194.629 114.416L188.718 114.444C180.48 114.482 173.771 107.824 173.742 99.5763C173.704 89.6929 181.667 81.6549 191.54 81.6073C201.414 81.5693 209.443 89.5407 209.491 99.4241C209.519 107.671 202.867 114.387 194.629 114.416Z" fill="#263238"/>
<path d="M186.904 77.4029C189.46 81.1603 186.752 83.7382 182.989 86.2875C179.236 88.8464 175.843 90.4159 173.297 86.649C170.741 82.8916 172.147 78.6871 175.91 76.1378C179.663 73.5884 184.358 73.6455 186.904 77.4029Z" fill="#263238"/>
<path d="M177.707 89.046L173.925 91.8426C173.099 90.8058 173.279 89.3314 174.325 88.5609C175.37 87.7809 176.89 87.9996 177.707 89.046Z" fill="#263238"/>
<path d="M202.584 89.5789C204.475 90.6918 206.832 95.429 206.642 105.398C206.481 113.845 203.753 115.938 202.385 116.547C201.017 117.155 198.365 116.803 195.79 116.385L195.933 121.512C195.933 121.512 200.275 125.07 200.057 127.391C199.838 129.712 194.042 130.787 190.706 128.532C187.799 126.563 185.299 123.985 184.701 123.348C184.615 123.253 184.568 123.129 184.568 122.996L184.558 110.211C184.558 110.211 183.047 111.695 180.472 109.45C178.344 107.605 177.612 104.475 179.265 102.792C180.909 101.108 183.969 101.546 185.147 103.943C185.147 103.943 189.253 104.076 194.707 101.041C200.161 98.0164 202.233 92.8511 202.584 89.5789Z" fill="#FFBE9D"/>
<path d="M197.214 103.315C197.252 103.923 196.796 104.437 196.216 104.475C195.627 104.504 195.133 104.038 195.095 103.429C195.067 102.82 195.513 102.306 196.093 102.268C196.682 102.24 197.176 102.706 197.214 103.315Z" fill="#263238"/>
<path d="M197.533 110.468L200.003 111.248C199.804 111.952 199.082 112.352 198.407 112.142C197.723 111.923 197.333 111.181 197.533 110.468Z" fill="#F3AB86"/>
<path d="M205.903 100.014L203.746 98.53C204.136 97.9117 204.934 97.75 205.523 98.159C206.122 98.568 206.293 99.4051 205.903 100.014Z" fill="#263238"/>
<path d="M205.418 102.516C205.456 103.125 205 103.638 204.42 103.676C203.831 103.705 203.337 103.239 203.299 102.63C203.261 102.021 203.717 101.507 204.297 101.469C204.886 101.431 205.38 101.907 205.418 102.516Z" fill="#263238"/>
<path d="M200.642 101.393L200.613 108.318L203.968 107.262L200.642 101.393Z" fill="#F3AB86"/>
<path d="M195.797 116.385C193.079 116.043 187.491 114.463 186.617 112.257C186.617 112.257 186.912 113.645 188.584 115.063C190.257 116.49 195.844 118.097 195.844 118.097L195.797 116.385Z" fill="#F3AB86"/>
<path d="M188.68 170.815C184.071 169.721 181.154 165.06 182.37 160.485C182.418 160.314 182.465 160.161 182.513 160.047C183.415 157.878 185.354 158.164 185.354 158.164C183.539 156.956 182.684 154.891 182.256 152.751L180.147 142.792C180.147 142.792 179.767 140.547 180.584 137.874L174.949 131.348C174.949 131.348 174.54 131.634 173.903 132.071C173.029 134.896 173.153 137.978 174.132 140.813L179.719 156.994C179.719 156.994 176.27 162.587 174.065 169.303C184.404 175.077 196.624 174.354 204.026 171.291C198.173 172.195 192.756 171.786 188.68 170.815Z" fill="#E0E0E0"/>
<path d="M185.626 194.692L165.243 183.029C165.243 183.029 155.323 196.68 162.079 200.532C168.835 204.385 175.535 208.313 182.262 212.194C189.883 209.208 185.626 194.692 185.626 194.692Z" fill="#FFC71B"/>
<path d="M182.265 196.632L166.301 187.396V188.28L182.265 197.612V196.632Z" fill="#D3A61B"/>
<path d="M185.626 194.692C184.314 198.972 180.371 211.101 182.262 212.195C184.153 213.288 189.997 209.522 189.873 207.258C189.541 200.846 185.626 194.692 185.626 194.692Z" fill="#D3A61B"/>
<path d="M180.002 121.75C180.002 121.75 182.539 121.293 184.021 124.119C187.281 130.321 185.038 194.358 185.038 194.358L182.833 193.093C182.833 193.093 183.603 172.442 183.527 153.655C183.47 139.852 182.957 126.82 182.368 125.403C181.113 122.406 178.367 122.863 178.367 122.863C178.681 122.273 179.251 121.921 180.002 121.75Z" fill="#EBB512"/>
<path d="M159.72 162.073C165.954 136.561 170.8 125.612 177.613 123.063C179.828 122.235 182.203 123.605 182.564 125.935C183.21 130.13 182.042 136.342 179.01 140.546C179.01 140.546 169.916 159.762 168.463 166.592C167.189 172.565 165.754 180.08 165.83 185.236C165.84 186.159 166.201 187.062 166.838 187.738C168.51 189.545 168.51 191 169.593 192.998C170.439 194.558 171.361 195.138 171.095 195.49C170.753 195.937 169.688 196.527 168.368 195.69C167.702 195.272 167.265 194.777 166.296 193.702C166.296 193.702 166.562 196.118 167.94 199.229C169.802 203.443 169.356 205.593 163.673 204.09C160.11 203.148 157.877 200.18 157.345 191.609C157.193 189.136 156.955 185.245 157.25 182.125C158 174.011 158.542 166.867 159.72 162.073Z" fill="#FFBE9D"/>
<path d="M155.551 125.898C156.121 120.323 156.121 117.964 155.95 117.27C155.171 114.112 152.966 111.572 150.648 107.738C146.666 101.137 140.67 90.9014 137.905 86.9537C135.719 83.8336 133.363 82.0072 129.761 82.207C127.243 82.3497 129.191 92.2902 131.671 99.4531L144.927 117.765C145.364 118.364 145.564 119.106 145.488 119.838L144.195 132.889L148.424 138.549C148.424 138.549 154.819 133.022 155.551 125.898Z" fill="#FFBE9D"/>
<path d="M155.631 125.118C155.441 124.128 154.776 123.31 153.027 123.377C151.298 123.443 149.93 125.688 149.93 125.688L154.833 127.867C155.09 127.22 155.337 126.564 155.546 125.888C155.584 125.631 155.612 125.374 155.631 125.118Z" fill="#F3AB86"/>
<path d="M128.309 82.0643C128.309 82.0643 133.754 81.3699 136.775 84.6612C139.797 87.9525 141.27 90.7016 144.197 95.572C147.722 101.432 149.252 104.438 149.252 104.438C149.252 104.438 143.741 111.81 135.616 110.849L128.309 82.0643Z" fill="#FFC71B"/>
<path d="M137.723 64.4589C142.12 60.0568 142.12 52.9197 137.723 48.5177C133.325 44.1156 126.196 44.1156 121.798 48.5177C117.401 52.9197 117.401 60.0568 121.798 64.4589C126.196 68.8609 133.325 68.8609 137.723 64.4589Z" fill="#263238"/>
<path d="M102.796 260.778H110.73V247.185H102.796V260.778Z" fill="#FFBE9D"/>
<path d="M130.297 251.262L138.222 251.538L138.621 237.155L130.686 236.888L130.297 251.262Z" fill="#FFBE9D"/>
<path d="M103.319 139.452C103.319 147.034 102.34 192.969 102.34 192.969C102.159 195.148 100.116 199.172 100.553 207.552C101.152 218.929 102.14 248.522 102.14 248.522C102.14 248.522 105.856 252.213 111.111 248.522C111.111 248.522 118.295 207.59 119.71 196.318C120.955 186.472 123.055 159.733 123.055 159.733L127.455 196.85C127.455 196.85 126.163 204.251 125.878 209.473C125.592 214.696 130.173 241.198 130.173 241.198C130.173 241.198 134.202 243.985 138.801 241.53C138.801 241.53 142.222 201.122 143.039 196.403C143.856 191.685 140.416 139.462 140.416 139.462H103.319V139.452Z" fill="#EBEBEB"/>
<path d="M110.937 84.613C107.478 85.2314 104.723 87.8473 103.972 91.2813C103.592 92.984 103.316 95.0196 103.316 97.3121V112.865V139.462C108.875 145.521 128.26 148.337 140.405 139.462C140.405 139.462 140.167 102.24 139.255 96.1231C137.677 85.4977 132.594 81.7118 127.491 82.1018L115.252 83.852L110.937 84.613Z" fill="#FFC71B"/>
<path d="M110.293 64.4939C110.293 64.4939 112.117 73.0741 112.849 74.482C113.581 75.8898 115.092 76.2893 115.092 76.2893L114.968 70.2489L110.293 64.4939Z" fill="#263238"/>
<path d="M112.587 52.2039C112.587 52.2039 110.62 51.8709 109.09 53.431C107.588 54.972 108.425 59.7758 110.297 64.4939L113.737 64.8935L112.587 52.2039Z" fill="#263238"/>
<path d="M114.761 64.8936C114.067 65.3027 113.089 63.9804 112.243 63.0863C111.397 62.1921 108.623 60.984 107.235 63.8948C105.829 66.8722 108.461 70.8009 110.637 71.4858C114.4 72.6653 114.97 70.2492 114.97 70.2492L115.255 83.8424C115.255 83.8424 117.716 89.8828 124.397 90.7865C131.067 91.6902 129.699 86.1825 127.504 83.481L127.495 79.343C127.495 79.343 130.906 79.8567 132.569 79.5999C135.334 79.1718 137.083 76.984 137.919 73.9875C139.268 69.1742 139.781 65.2837 138.631 55.8093C137.377 45.4217 125.309 45.317 118.8 49.4264C112.281 53.5453 114.761 64.8936 114.761 64.8936Z" fill="#FFBE9D"/>
<path d="M114.759 66.0541C114.417 66.0636 113.096 63.8758 112.241 63.0862C111.053 62.0018 112.583 52.204 112.583 52.204C112.583 52.204 111.443 49.7688 113.733 47.248C115.358 45.4502 118.085 45.2504 122.732 44.5275C125.174 44.147 128.861 43.4621 131.303 43.0055C134.211 42.4632 136.615 41.8925 138.667 43.6808C140.264 45.0697 140.948 47.5239 140.093 49.4644C139.893 49.921 139.599 50.33 139.266 50.701C138.677 51.3574 138.012 51.8711 137.175 52.1469C137.175 52.1469 135.912 53.2694 131.502 53.8116C127.093 54.3538 120.223 53.707 119.292 53.5833C118.009 53.4121 117.743 54.6487 117.049 58.0351C116.431 60.9935 115.928 66.0351 114.759 66.0541Z" fill="#263238"/>
<path d="M112.592 52.9649L108.43 50.7295C109.019 49.5309 110.435 49.0648 111.585 49.6831C112.734 50.3014 113.181 51.7758 112.592 52.9649Z" fill="#263238"/>
<path d="M127.495 79.3618C127.495 79.3618 121.318 78.1157 119.152 76.9647C117.707 76.1942 116.52 74.8625 116.168 74.0063C116.168 74.0063 116.577 75.8422 117.869 77.4974C119.446 79.5236 127.495 81.0075 127.495 81.0075V79.3618Z" fill="#F3AB86"/>
<path d="M126.01 63.3528C126.01 64.0662 125.459 64.637 124.774 64.637C124.09 64.637 123.539 64.0567 123.539 63.3433C123.539 62.6298 124.09 62.0591 124.774 62.0591C125.449 62.0591 126.01 62.6393 126.01 63.3528Z" fill="#263238"/>
<path d="M124.691 58.6725L122.04 60.1374C121.65 59.3764 121.926 58.4347 122.658 58.0256C123.399 57.6166 124.302 57.9115 124.691 58.6725Z" fill="#263238"/>
<path d="M126.935 71.9136L129.757 72.979C129.481 73.7875 128.617 74.2061 127.837 73.9207C127.058 73.6163 126.65 72.7221 126.935 71.9136Z" fill="#F3AB86"/>
<path d="M137.054 59.6998L134.641 57.8354C135.135 57.141 136.076 56.9983 136.741 57.5119C137.396 58.0351 137.539 59.0054 137.054 59.6998Z" fill="#263238"/>
<path d="M136.303 63.0007C136.303 63.7142 135.752 64.2849 135.067 64.2849C134.383 64.2849 133.832 63.7046 133.832 62.9912C133.832 62.2778 134.383 61.707 135.067 61.707C135.752 61.707 136.303 62.2873 136.303 63.0007Z" fill="#263238"/>
<path d="M129.992 61.821L130.401 69.2788L134.287 67.947L129.992 61.821Z" fill="#F3AB86"/>
<path d="M110.729 256.855V255.723C111.489 256.056 113.247 262.791 116.393 265.664C118.892 267.947 122.303 270.581 123.177 273.131C124.08 275.775 118.426 277.24 116.088 276.831C113.371 276.346 108.667 274.434 107.489 272.665C106.31 270.886 105.75 268.27 104.79 266.976C103.83 265.673 101.616 264.227 101.093 262.715C100.808 261.887 101.151 260.08 101.55 258.548C101.92 257.14 102.319 255.599 102.794 255.733C102.794 255.904 102.794 256.598 102.794 256.598C103.374 257.236 104.961 257.873 106.757 257.939C107.926 257.968 110.739 257.74 110.729 256.855Z" fill="#263238"/>
<path d="M138.306 249.093C138.714 249.112 139.056 249.692 139.959 250.672C141.061 251.861 142.848 253.145 144.625 254.03C147.59 255.514 153.367 257.806 155.98 258.986C157.615 259.718 157.539 261.697 155.847 262.819C154.156 263.942 150.089 264.75 145.195 263.656C142.534 263.057 139.066 260.593 136.861 260.727C134.666 260.86 130.561 260.831 128.936 259.709C127.311 258.586 127.967 256.199 128.423 254.153C128.927 251.918 129.639 248.484 130.381 248.636L130.352 249.34C131.302 250.786 136.158 251.376 138.258 250.31L138.306 249.093Z" fill="#263238"/>
<path d="M123.062 159.733C123.062 159.733 129.401 157.945 134.104 153.398C134.104 153.398 131.976 157.393 125.638 161.113L127.462 196.851L123.062 159.733Z" fill="#E0E0E0"/>
<path d="M91.0482 151.391C91.3998 154.834 91.7894 159.476 92.4735 162.121C94.8492 171.291 97.89 174.04 101.948 174.306C108.419 174.734 108.457 172.318 105.558 168.142C103.411 165.06 102.67 162.178 102.67 162.178C103.943 163.139 104.969 163.871 105.777 164.185C107.392 164.813 108.419 163.957 108.694 163.396C108.903 162.958 107.782 162.52 106.547 161.008C104.96 159.077 104.152 157.536 101.976 155.928C101.168 155.329 100.912 154.226 100.665 153.255C100.332 151.952 100.114 131.158 101.282 126.849L106.851 106.854C111.374 103.743 116.201 88.3519 109.321 85.0796C102.86 85.8025 98.1465 94.2686 91.1052 120.39C89.8508 125.013 90.3165 144.276 91.0482 151.391Z" fill="#FFBE9D"/>
<path d="M110.736 84.6993C110.736 84.6993 113.349 86.6208 113.529 90.9775C113.71 95.3342 111.667 101.612 110.432 105.541C109.196 109.47 106.631 116.585 106.631 116.585C106.631 116.585 95.9974 115.367 93.5742 109.118C93.5742 109.118 98.5535 92.9846 103.352 87.7337C106.631 84.1285 110.736 84.6993 110.736 84.6993Z" fill="#FFC71B"/>
<path d="M154.24 119.058L153.404 118.335V118.345C153.214 118.192 152.919 118.145 152.539 118.249L143.445 120.723C142.599 120.951 141.687 121.807 141.402 122.635L134.855 141.536C134.703 141.973 134.76 142.306 134.978 142.497H134.969L135.834 143.239L135.796 142.62C135.815 142.611 135.843 142.611 135.862 142.611L144.956 140.138C145.802 139.909 146.714 139.053 146.999 138.226C148.282 134.516 152.254 123.044 153.546 119.324C153.584 119.21 153.613 119.096 153.622 118.991L154.24 119.058Z" fill="#455A64"/>
<path d="M135.703 142.259L142.25 123.358C142.535 122.53 143.448 121.674 144.293 121.446L153.387 118.972C154.233 118.744 154.68 119.229 154.395 120.057C153.112 123.767 149.14 135.239 147.847 138.958C147.562 139.786 146.65 140.642 145.804 140.87L136.71 143.343C135.865 143.562 135.418 143.077 135.703 142.259Z" fill="#263238"/>
<path d="M151.722 127.667C151.086 129.589 148.795 130.873 145.042 131.767C141.288 132.661 139.207 136.647 139.816 137.864C140.424 139.082 146.486 140.204 148.919 139.862C151.342 139.52 153.784 136 154.525 134.916C155.257 133.831 156.112 126.24 155.333 125.194C154.554 124.157 152.91 124.309 152.91 124.309L151.722 127.667Z" fill="#FFBE9D"/>
<path d="M81.9996 100.223L58.6235 86.8484C58.6235 86.8484 47.249 102.496 54.9936 106.91C62.7381 111.324 70.4256 115.833 78.1416 120.285C86.8839 116.87 81.9996 100.223 81.9996 100.223Z" fill="#9FD6EE"/>
<path opacity="0.2" d="M81.9997 100.223L58.6235 86.8484C58.6235 86.8484 47.249 102.496 54.9936 106.91C62.7381 111.324 70.4256 115.833 78.1416 120.285C86.8839 116.87 81.9997 100.223 81.9997 100.223Z" fill="black"/>
<path d="M78.1413 102.458L62.7188 93.5356V94.5535L78.1413 103.571V102.458Z" fill="#263238"/>
<path d="M81.9985 100.223C80.4876 105.131 75.9739 119.038 78.1405 120.285C80.307 121.54 87.0063 117.222 86.8733 114.625C86.4932 107.281 81.9985 100.223 81.9985 100.223Z" fill="#9FD6EE"/>
<path d="M67.4874 52.9082H30.6367V16.9321C30.6367 7.58142 38.2102 0 47.5512 0H50.5635C59.9044 0 67.4779 7.58142 67.4779 16.9321V52.9082H67.4874Z" fill="#263238"/>
<path d="M82.2296 82.2635C84.4437 80.1993 83.5314 77.8117 80.4716 71.2386C77.4118 64.6655 70.1329 49.4551 68.3084 46.2018C65.1251 40.5229 61.3906 40.209 55.7746 40.228C53.5131 40.2375 59.2526 46.7155 61.8277 53.0032C64.1558 58.6917 73.2117 77.3075 73.2117 77.3075L82.2296 82.2635Z" fill="#A36957"/>
<path d="M46.338 229.554C45.5303 228.831 44.7131 228.127 43.9719 227.452C41.6723 225.359 39.9238 221.802 38.9165 219.376C38.3464 217.987 38.0518 216.513 38.0518 215.01V210.282H29.7656V217.978V218.187L29.8036 218.206C30.2027 219.928 34.0037 224.513 36.1608 227.5C37.6052 229.507 40.3609 232.056 43.6488 232.494C46.7656 232.903 48.362 231.913 46.338 229.554Z" fill="#A36957"/>
<path d="M70.279 216.941C70.507 216.808 70.7161 216.627 70.8776 216.408C71.5238 215.514 71.0107 215.029 70.545 214.325C69.9369 213.412 69.5378 212.232 69.1197 211.224C68.7396 210.301 68.2359 208.598 68.2359 208.598C68.2359 208.598 68.2549 207.362 68.2549 206.867V202.14H59.9688V209.835V210.044L60.0068 210.063C60.4344 211.899 62.1068 213.678 63.1996 215.153C64.0548 216.294 66.2404 216.865 67.5612 217.15C68.1504 217.274 68.7491 217.359 69.3382 217.264C69.6708 217.217 69.9939 217.112 70.279 216.941Z" fill="#A36957"/>
<path d="M31.4223 89.3884C24.9986 103.429 31.6504 152.893 31.6504 152.893C31.4603 155.176 28.8567 159.657 27.8874 169.683C26.7376 181.535 29.6834 211.281 29.6834 211.281C29.6834 211.281 33.5224 213.792 38.0551 211.614C38.0551 211.614 45.9516 166.801 47.434 155.024C48.7264 144.741 51.216 122.14 51.216 122.14L56.1573 155.015C56.1573 155.015 54.3423 160.77 53.9147 165.165C53.2401 172.099 59.9488 204.356 59.9488 204.356C59.9488 204.356 62.8091 205.402 68.235 204.603C68.235 204.603 70.6106 161.788 71.2283 153.436C72.2831 139.414 70.6866 95.6286 68.1115 87.3337L31.4223 89.3884Z" fill="#555555"/>
<path d="M51.2148 122.14L53.2959 109.098C53.2959 109.098 62.1142 107.272 66.1148 103.505C66.1148 103.505 61.9147 108.727 55.681 110.44L53.3434 120.485L55.4435 150.268L51.2148 122.14Z" fill="#263238"/>
<path d="M38.0739 216.722L38.0644 215.523C38.8626 215.866 40.7156 222.924 44.013 225.94C46.6356 228.327 50.2086 231.095 51.1113 233.759C52.0521 236.536 46.132 238.058 43.6899 237.63C40.8486 237.126 35.9168 235.119 34.6815 233.264C33.4462 231.409 32.8665 228.67 31.8593 227.3C30.852 225.94 28.5334 224.418 27.9917 222.839C27.6972 221.973 28.0488 220.08 28.4669 218.472C28.8565 217.007 29.2651 215.39 29.7687 215.523C29.7687 215.704 29.7687 216.427 29.7687 216.427C30.3674 217.093 32.0398 217.759 33.9213 217.835C35.1376 217.892 38.0834 217.645 38.0739 216.722Z" fill="#263238"/>
<path d="M68.2256 208.608C68.6532 208.627 69.1188 209.274 70.0691 210.311C71.2189 211.557 73.1004 212.898 74.9533 213.83C78.0607 215.39 84.1042 217.788 86.841 219.015C88.5514 219.785 88.4659 221.849 86.7079 223.029C84.9405 224.209 80.6738 225.055 75.552 223.904C72.7583 223.276 69.1283 220.698 66.8287 220.841C64.5291 220.984 60.2245 220.946 58.533 219.776C56.8321 218.606 57.5163 216.104 57.9914 213.954C58.514 211.605 59.1697 207.952 59.9489 208.113V208.922C60.9467 210.434 66.097 211.053 68.2921 209.94L68.2256 208.608Z" fill="#263238"/>
<path d="M42.7493 40.6087C34.5201 41.1795 33.9405 45.1557 31.8784 49.5124C30.3105 52.8227 30.8236 56.7799 32.021 60.2424L37.2283 76.7465C37.2283 76.7465 34.5391 83.2435 31.4223 89.3886C45.8186 97.4361 63.7973 93.203 68.1305 87.3339C68.311 86.0877 67.1992 76.3565 66.515 69.9927C69.0522 63.6289 69.7174 59.5861 68.6531 55.3816C66.6671 47.5718 58.9605 39.9524 55.5491 40.2378L42.7493 40.6087Z" fill="#9FD6EE"/>
<path d="M29.7496 7.60986L32.2392 11.6241C31.1369 12.3661 29.683 12.0617 28.9894 10.9582C28.3052 9.8548 28.6473 8.35183 29.7496 7.60986Z" fill="#263238"/>
<path d="M61.441 7.45776C63.389 8.60877 65.7931 13.5077 65.5556 23.7811C65.356 32.485 62.5338 34.6348 61.1179 35.2531C59.702 35.8714 56.9748 35.5004 54.3141 35.0534V40.2757C54.3141 40.2757 57.9821 44.5373 57.754 46.9344C57.5259 49.3315 52.4611 49.8928 49.0212 47.5527C45.5908 45.2127 43.3862 41.6455 43.3862 41.6455V29.032C43.3862 29.032 41.5902 31.4291 38.6635 29.4791C35.7367 27.529 35.6227 22.7062 37.3236 20.9749C39.0246 19.2437 42.702 19.7954 43.3862 22.183C43.3862 22.183 47.6148 22.3352 53.2593 19.2342C58.8943 16.1426 61.0609 10.8347 61.441 7.45776Z" fill="#A36957"/>
<path d="M54.8587 21.5929C54.8872 22.2208 54.4311 22.7535 53.8229 22.782C53.2243 22.8105 52.7016 22.3254 52.6731 21.6976C52.6446 21.0698 53.1008 20.5371 53.7089 20.5085C54.3171 20.48 54.8302 20.9651 54.8587 21.5929Z" fill="#263238"/>
<path d="M56.122 28.9746L58.6592 29.7832C58.4501 30.5156 57.7089 30.9151 57.0057 30.6964C56.3121 30.4776 55.913 29.7071 56.122 28.9746Z" fill="#8E5544"/>
<path d="M63.8391 18.2351L61.625 16.7036C62.0241 16.0758 62.8508 15.9046 63.459 16.3231C64.0766 16.7417 64.2382 17.5978 63.8391 18.2351Z" fill="#263238"/>
<path d="M63.3235 20.8039C63.3521 21.4317 62.8959 21.9644 62.2878 21.9929C61.6891 22.0215 61.1665 21.5363 61.138 20.9085C61.1095 20.2807 61.5656 19.748 62.1738 19.7195C62.7819 19.6909 63.295 20.1761 63.3235 20.8039Z" fill="#263238"/>
<path d="M57.9805 20.176L58.1515 26.7681L61.6199 25.6932L57.9805 20.176Z" fill="#8E5544"/>
<path d="M54.3127 35.063C51.5189 34.6921 45.7604 33.0369 44.8672 30.7634C44.8672 30.7634 45.1618 32.1903 46.8817 33.6647C48.6017 35.1391 54.3127 36.8038 54.3127 36.8038V35.063V35.063Z" fill="#8E5544"/>
<path opacity="0.1" d="M46.4271 90.9485C42.512 90.0163 38.5305 85.7262 40.3265 81.5407C40.8301 80.3707 41.7233 79.3719 42.8351 78.7536C43.7949 78.2114 44.5551 78.4397 45.4483 79.0294C43.5858 77.7928 40.3265 71.7714 39.8893 69.5741L37.6658 62.1639C37.6658 62.1639 37.2762 59.8619 38.1124 57.1128L32.3254 50.416C32.3254 50.416 31.9072 50.7014 31.2516 51.158C30.3488 54.0593 31.0235 57.3411 32.0213 60.2424L37.2286 76.7465C37.2286 76.7465 34.5394 83.2435 31.4226 89.3885C42.0369 95.3148 54.5802 94.5728 62.1822 91.4242C56.1766 92.3659 50.6082 91.9378 46.4271 90.9485Z" fill="black"/>
<path d="M18.3084 80.0759C24.5421 54.5635 29.0082 45.5552 33.9495 42.5778C35.8405 41.4363 38.6058 40.8465 39.9931 40.9797C40.7343 41.6836 41.0289 43.0629 41.1619 43.9381C41.8081 48.1331 40.6393 54.3447 37.608 58.5492C37.608 58.5492 28.5141 77.7643 27.0602 84.5943C25.7869 90.5681 24.352 98.0829 24.428 103.239C24.4375 104.161 24.7986 105.065 25.4353 105.74C27.1077 107.548 27.1077 109.003 28.191 111.001C29.0367 112.561 29.9585 113.141 29.6924 113.493C29.3503 113.94 28.286 114.53 26.9652 113.693C26.3 113.274 25.8629 112.78 24.8936 111.705C24.8936 111.705 25.1597 114.121 26.5376 117.231C28.4001 121.445 27.9535 123.595 22.271 122.092C18.7075 121.151 16.4744 118.183 15.9423 109.612C15.7903 107.139 15.5527 103.248 15.8473 100.128C16.5885 92.014 17.1301 84.8701 18.3084 80.0759Z" fill="#A36957"/>
<path d="M53.7502 78.0306C55.4607 78.5252 57.1236 78.3065 59.4708 79.1911C61.5423 79.9711 62.9107 80.4087 64.9632 80.5799C67.0157 80.7512 69.0303 78.5918 74.2946 75.6049C79.274 72.7797 85.4316 78.6204 82.2292 82.2636C81.6971 82.8724 80.0247 84.1281 78.3427 84.8035C75.9576 85.7547 73.62 86.2589 67.4909 88.1138C66.4456 88.4277 65.4763 88.9319 64.4976 89.4075C63.2813 90.0068 62.1124 90.3492 60.8391 90.7678C57.9979 91.7 54.9191 91.8902 51.9923 91.3005C50.2343 90.9485 48.3908 90.2256 47.1745 88.8462C46.0817 87.6096 45.0935 85.2601 45.4736 83.6049C45.5876 83.1102 45.8252 82.6251 46.2243 82.3207C47.1745 81.5692 48.6474 82.0448 49.7212 82.2161C51.023 82.4158 52.2394 82.6727 53.5602 82.6156C55.6032 82.53 57.0381 82.1875 56.7625 81.8831C56.4775 81.5882 55.2801 81.7214 53.6552 80.9699C52.1063 80.247 51.0135 78.6204 51.4887 77.7833C51.9543 76.9462 52.0398 77.536 53.7502 78.0306Z" fill="#A36957"/>
<path d="M72.694 76.4515C72.694 76.4515 75.4877 75.9854 77.3027 79.1625C79.1177 82.3397 80.0679 99.1101 80.0679 99.1101L78.1389 97.9971C78.1389 97.9971 77.4833 84.5561 75.8773 80.7226C74.4329 77.2791 70.8125 77.7261 70.8125 77.7261C71.1926 77.0508 71.8388 76.6417 72.694 76.4515Z" fill="#263238"/>
<path d="M8.30519 121.503H0V251.157C0 251.776 0.408606 252.384 1.21632 252.851C2.84125 253.783 5.46394 253.783 7.08886 252.851C7.89658 252.384 8.30519 251.766 8.30519 251.157V121.503Z" fill="#37474F"/>
<path d="M4.15259 123.9C6.446 123.9 8.30519 122.826 8.30519 121.503C8.30519 120.179 6.446 119.105 4.15259 119.105C1.85918 119.105 0 120.179 0 121.503C0 122.826 1.85918 123.9 4.15259 123.9Z" fill="#455A64"/>
<path d="M6.64844 137.531C36.1537 165.555 71.8451 185.578 112.734 198.848V190.62C71.8356 177.35 36.1537 157.326 6.64844 129.303V137.531Z" fill="#27DEBF"/>
<path opacity="0.7" d="M6.64844 137.531C36.1537 165.555 71.8451 185.578 112.734 198.848V190.62C71.8356 177.35 36.1537 157.326 6.64844 129.303V137.531Z" fill="white"/>
<path d="M114.532 183.229H106.227V312.884C106.227 313.502 106.635 314.111 107.443 314.577C109.068 315.509 111.691 315.509 113.315 314.577C114.123 314.111 114.532 313.492 114.532 312.884V183.229Z" fill="#37474F"/>
<path d="M107.446 184.922C109.071 185.864 111.694 185.864 113.318 184.922C114.943 183.98 114.943 182.468 113.318 181.526C111.694 180.594 109.071 180.594 107.446 181.526C105.831 182.468 105.831 183.98 107.446 184.922Z" fill="#455A64"/>
<path d="M112.387 198.487C141.892 226.511 177.583 246.534 218.473 259.804V251.576C177.574 238.306 141.892 218.282 112.387 190.259V198.487V198.487Z" fill="#27DEBF"/>
<path opacity="0.7" d="M112.387 198.487C141.892 226.511 177.583 246.534 218.473 259.804V251.576C177.574 238.306 141.892 218.282 112.387 190.259V198.487V198.487Z" fill="white"/>
<path d="M220.77 244.946H212.465V374.6C212.465 375.219 212.873 375.827 213.681 376.293C215.306 377.235 217.929 377.235 219.554 376.293C220.361 375.827 220.77 375.209 220.77 374.6V244.946V244.946Z" fill="#37474F"/>
<path d="M216.617 247.343C218.911 247.343 220.77 246.27 220.77 244.946C220.77 243.622 218.911 242.549 216.617 242.549C214.324 242.549 212.465 243.622 212.465 244.946C212.465 246.27 214.324 247.343 216.617 247.343Z" fill="#455A64"/>
</svg>
