<svg width="1282" height="824" viewBox="0 0 1282 824" fill="none" xmlns="http://www.w3.org/2000/svg" style="">
<path d="M0.000610352 823.679C124.775 607.18 545.527 589.734 615.077 609.308C658.954 621.554 755.832 658.386 834.507 636.778C834.507 636.778 834.507 636.778 834.649 636.778C837.061 635.975 839.472 635.313 841.883 634.509H842.025C906.374 613.469 956.492 550.16 950.913 397.112C942.497 166.901 1186.09 51.1578 1346.98 -6.10352e-05V823.679H0.000610352Z" fill="#9FD6EE" class="GSnorvkJ_0"></path>
<path opacity="0.2" d="M834.649 636.779C837.061 635.975 839.472 635.313 841.883 634.509H842.025C906.374 613.469 956.492 550.16 950.913 397.112C942.497 166.902 1186.09 51.158 1346.98 0.000183105V471.627C1240.74 435.882 1092.24 410.729 1021.03 511.484C908.265 671.199 840.134 639.71 834.649 636.779Z" fill="black" class="GSnorvkJ_1"></path>
<path d="M1346.98 107.611C1346.98 107.611 1023.54 57.3988 956.587 170.4C889.637 283.401 1026.04 514.699 787.132 522.595C548.222 530.491 178.959 633.752 210.022 823.727" stroke="#FFC71B" stroke-width="3" stroke-miterlimit="10" class="GSnorvkJ_2"></path>
<style data-made-with="vivus-instant">.GSnorvkJ_0{stroke-dasharray:3971 3973;stroke-dashoffset:3972;animation:GSnorvkJ_draw_0 2700ms ease-in-out 0ms infinite,GSnorvkJ_fade 2700ms linear 0ms infinite;}.GSnorvkJ_1{stroke-dasharray:1956 1958;stroke-dashoffset:1957;animation:GSnorvkJ_draw_1 2700ms ease-in-out 0ms infinite,GSnorvkJ_fade 2700ms linear 0ms infinite;}.GSnorvkJ_2{stroke-dasharray:1572 1574;stroke-dashoffset:1573;animation:GSnorvkJ_draw_2 2700ms ease-in-out 0ms infinite,GSnorvkJ_fade 2700ms linear 0ms infinite;}@keyframes GSnorvkJ_draw{100%{stroke-dashoffset:0;}}@keyframes GSnorvkJ_fade{0%{stroke-opacity:1;}85.18518518518519%{stroke-opacity:1;}100%{stroke-opacity:0;}}@keyframes GSnorvkJ_draw_0{29.629629629629626%{stroke-dashoffset: 3972}85.18518518518519%{ stroke-dashoffset: 0;}100%{ stroke-dashoffset: 0;}}@keyframes GSnorvkJ_draw_1{29.629629629629626%{stroke-dashoffset: 1957}85.18518518518519%{ stroke-dashoffset: 0;}100%{ stroke-dashoffset: 0;}}@keyframes GSnorvkJ_draw_2{29.629629629629626%{stroke-dashoffset: 1573}85.18518518518519%{ stroke-dashoffset: 0;}100%{ stroke-dashoffset: 0;}}</style></svg>
