<svg width="1477" height="1478" viewBox="0 0 1477 1478" fill="none" xmlns="http://www.w3.org/2000/svg">
<g clip-path="url(#clip0)">
<path d="M713.478 1011.9C410.735 1015.22 184.016 964.382 17.2803 897.215C20.3931 911.351 23.8651 925.487 27.8559 939.624C138.601 1332.32 546.502 1560.86 938.959 1450.05C1214.92 1372.14 1409.75 1147.2 1462.59 883.997C1286.28 952.003 1042 1008.31 713.478 1011.9Z" fill="url(#paint0_linear)"/>
<path d="M713.477 1011.9C1042 1008.31 1286.28 952.003 1462.63 883.997C1484.94 772.864 1481.95 654.942 1449.1 538.377C1447.99 534.344 1446.75 530.351 1445.55 526.397C1401.37 547.003 1342.75 568.567 1265.73 587.695C1137.5 619.561 958.234 644.639 709.527 647.394C582.14 648.792 471.076 643.92 374.458 634.975C222.687 620.919 106.714 596.719 19.4751 570.763C-5.0684 675.268 -7.06381 786.441 17.3201 897.295C184.016 964.343 410.774 1015.22 713.477 1011.9Z" fill="url(#paint1_linear)"/>
<path d="M709.487 647.354C958.194 644.639 1137.46 619.521 1265.69 587.654C1342.71 568.526 1401.33 546.963 1445.51 526.357C1329.94 141.044 926.427 -81.7026 538.001 27.9534C270.218 103.547 78.8584 317.587 19.4751 570.723C106.714 596.719 222.687 620.879 374.458 634.935C471.036 643.88 582.1 648.752 709.487 647.354Z" fill="url(#paint2_linear)"/>
<path fill-rule="evenodd" clip-rule="evenodd" d="M778.927 780.091C728.124 806.886 683.946 844.383 648.946 889.427L697.075 699.985C747.36 673.829 791.418 637.331 826.418 593.244L778.927 780.091ZM1129 732.93H1028.43C1026.12 629.823 970.087 539.535 887.278 489.538C899.928 457.792 908.469 424.248 912.739 389.227C1038.93 452.68 1126.53 582.942 1129 732.93ZM1223.82 758.887C1221.87 802.294 1214.6 844.064 1202.11 883.837H1101.23C1043.72 1027.88 902.363 1130.18 738.34 1130.18C685.901 1130.18 635.976 1119.84 590.241 1101.07C595.19 1050.92 609.796 1003.56 632.464 961.107H632.305C695.399 841.388 821.309 758.847 965.098 758.847H1223.82V758.887ZM888.395 378.046C870.636 565.331 707.93 719.752 512.54 719.752H253.177C254.813 676.345 262.396 634.575 274.887 594.762H375.137C432.644 450.404 573.999 347.776 738.34 347.776C791.418 347.776 842.221 358.638 888.395 378.046ZM347.56 745.749H448.128C450.403 849.335 507.432 939.943 591.439 989.46C578.947 1021.21 570.247 1054.91 566.137 1090.09C438.431 1027.12 349.994 896.376 347.56 745.749ZM486.56 594.762H513.179C613.747 594.442 700.867 534.263 740.615 448.408C739.937 448.408 739.298 448.408 738.34 448.408C630.868 448.408 536.844 507.588 486.56 594.762ZM965.138 884.196C865.208 884.196 778.129 944.056 738.021 1029.55H738.34C845.494 1029.55 939.477 970.691 989.802 883.837L965.138 884.196Z" fill="#F7F7F7"/>
</g>
<defs>
<linearGradient id="paint0_linear" x1="-257.518" y1="1381.39" x2="1943.84" y2="760.528" gradientUnits="userSpaceOnUse">
<stop offset="0.0531" stop-color="#EC1459"/>
<stop offset="0.9749" stop-color="#622061"/>
</linearGradient>
<linearGradient id="paint1_linear" x1="-530.213" y1="1089.92" x2="1974.83" y2="383.412" gradientUnits="userSpaceOnUse">
<stop offset="0.0531" stop-color="#622061"/>
<stop offset="1" stop-color="#EC1459"/>
</linearGradient>
<linearGradient id="paint2_linear" x1="-2816.01" y1="1358.03" x2="3387.79" y2="-391.663" gradientUnits="userSpaceOnUse">
<stop stop-color="#EC1459"/>
<stop offset="1" stop-color="#622061"/>
</linearGradient>
<clipPath id="clip0">
<rect width="1477" height="1478" fill="white"/>
</clipPath>
</defs>
</svg>
