<svg width="48" height="48" viewBox="0 0 48 48" fill="none" xmlns="http://www.w3.org/2000/svg">
<path d="M23.186 32.8619C13.3474 32.9695 5.97943 31.3186 0.560791 29.1373C0.661953 29.5964 0.774787 30.0555 0.904482 30.5146C4.50351 43.268 17.7596 50.69 30.5138 47.0912C39.4822 44.561 45.8139 37.2557 47.531 28.708C41.8011 30.9166 33.8625 32.7452 23.186 32.8619Z" fill="url(#paint0_linear)"/>
<path d="M23.1863 32.8623C33.8627 32.7456 41.8013 30.9169 47.5325 28.7083C48.2575 25.0991 48.1603 21.2694 47.0929 17.4838C47.0566 17.3528 47.0164 17.2231 46.9775 17.0947C45.5417 17.7639 43.6365 18.4642 41.1334 19.0854C36.9663 20.1204 31.1404 20.9348 23.0579 21.0243C18.918 21.0697 15.3086 20.9115 12.1687 20.621C7.23641 20.1645 3.46749 19.3785 0.63236 18.5356C-0.165262 21.9295 -0.230109 25.5401 0.562325 29.1402C5.97967 31.3177 13.3489 32.9699 23.1863 32.8623Z" fill="url(#paint1_linear)"/>
<path d="M23.0563 21.0235C31.1389 20.9353 36.9647 20.1196 41.1318 19.0847C43.6349 18.4635 45.5401 17.7631 46.9759 17.094C43.2199 4.58034 30.1065 -2.65366 17.4833 0.907574C8.78079 3.36257 2.56194 10.3139 0.63208 18.5348C3.46721 19.3791 7.23613 20.1637 12.1684 20.6202C15.307 20.9107 18.9164 21.0689 23.0563 21.0235Z" fill="url(#paint2_linear)"/>
<path fill-rule="evenodd" clip-rule="evenodd" d="M21.7779 9.94064C23.012 8.74739 24.988 8.74732 26.2222 9.94045C29.0098 12.6333 32.993 14.3325 34.9852 15.0619C36.2173 15.513 37.0625 16.6873 37.0176 18.0272C36.8987 21.5939 35.6111 30.9846 26.0909 39.2303C24.8981 40.2646 23.1032 40.2636 21.9102 39.231L21.91 39.2308C12.3894 30.9865 11.1016 21.5943 10.9827 18.0275M21.7776 9.94092C18.9902 12.6347 15.0072 14.3338 13.0157 15.0617L13.0154 15.0618L13.0151 15.0619C11.783 15.513 10.9378 16.6873 10.9827 18.0272M21.7779 9.94064C21.7778 9.94074 21.7777 9.94083 21.7776 9.94092L21.7779 9.94064ZM24.4843 11.7385C24.2194 11.4823 23.7809 11.4823 23.516 11.7385L23.5157 11.7388C20.3375 14.8104 15.943 16.6542 13.8748 17.4102C13.6051 17.5089 13.475 17.7377 13.4819 17.9436L13.4819 17.9439C13.5861 21.0691 14.7186 29.6955 23.547 37.3404C23.8014 37.5604 24.2008 37.5594 24.4527 37.341L24.453 37.3407L24.4532 37.3405C33.2817 29.6943 34.4142 21.069 34.5184 17.9439L34.5184 17.9436C34.5253 17.7377 34.3952 17.5089 34.1255 17.4102C32.0583 16.6533 27.6632 14.8095 24.4848 11.739L24.4843 11.7385Z" fill="#F7F7F7"/>
<path d="M24.0476 24.5412C25.8827 24.5412 27.3704 22.9503 27.3704 20.9878C27.3704 19.0253 25.8827 17.4343 24.0476 17.4343C22.2125 17.4343 20.7249 19.0253 20.7249 20.9878C20.7249 22.9503 22.2125 24.5412 24.0476 24.5412Z" fill="#F7F7F7"/>
<path d="M29.8511 31.7816C29.8511 28.6937 27.252 25.2764 24.0472 25.2764C20.8425 25.2764 18.2434 28.6937 18.2434 31.7816C18.2434 34.8695 20.8425 38.1584 24.0472 38.1584C27.252 38.1584 29.8511 34.8695 29.8511 31.7816Z" fill="#F7F7F7"/>
<defs>
<linearGradient id="paint0_linear" x1="-8.36663" y1="44.8604" x2="63.1666" y2="24.6718" gradientUnits="userSpaceOnUse">
<stop offset="0.0531" stop-color="#FFD333"/>
<stop offset="0.9749" stop-color="#FFA90A"/>
</linearGradient>
<linearGradient id="paint1_linear" x1="-9.12315" y1="30.301" x2="61.0669" y2="5.54121" gradientUnits="userSpaceOnUse">
<stop offset="0.225787" stop-color="#FFA90A"/>
<stop offset="0.648628" stop-color="#FFD333"/>
</linearGradient>
<linearGradient id="paint2_linear" x1="-8.17628" y1="17.6094" x2="66.134" y2="54.6735" gradientUnits="userSpaceOnUse">
<stop offset="0.0531" stop-color="#FFD333"/>
<stop offset="0.591499" stop-color="#FFA90A"/>
</linearGradient>
</defs>
</svg>
