<svg width="29" height="25" viewBox="0 0 29 25" fill="none" xmlns="http://www.w3.org/2000/svg">
<path d="M27.4375 11.125L17.4375 1.125C16.6875 0.3125 15.375 0.3125 14.625 1.125C13.8125 1.875 13.8125 3.1875 14.625 3.9375L21.1875 10.5H2C0.9375 10.5 0 11.4375 0 12.5C0 13.625 0.9375 14.5 2 14.5H21.1875L14.625 21.125C13.8125 21.875 13.8125 23.1875 14.625 23.9375C15.375 24.75 16.6875 24.75 17.4375 23.9375L27.4375 13.9375C28.25 13.1875 28.25 11.875 27.4375 11.125Z" fill="#622061"/>
</svg>
