{
  "kind": "singleType",
  "collectionName": "cars",
  "info": {
    "name": "Cars"
  },
  "options": {
    "increments": true,
    "timestamps": true
  },
  "attributes": {
    "sections": {
      "collection": "sections"
    }
  }
}
