{
  "routes": [
    {
      "method": "GET",
      "path": "/transport",
      "handler": "transport.find",
      "config": {
        "policies": []
      }
    },
    {
      "method": "PUT",
      "path": "/transport",
      "handler": "transport.update",
      "config": {
        "policies": []
      }
    },
    {
      "method": "DELETE",
      "path": "/transport",
      "handler": "transport.delete",
      "config": {
        "policies": []
      }
    }
  ]
}
