{
  "routes": [
    {
      "method": "GET",
      "path": "/housing",
      "handler": "housing.find",
      "config": {
        "policies": []
      }
    },
    {
      "method": "PUT",
      "path": "/housing",
      "handler": "housing.update",
      "config": {
        "policies": []
      }
    },
    {
      "method": "DELETE",
      "path": "/housing",
      "handler": "housing.delete",
      "config": {
        "policies": []
      }
    }
  ]
}
