{
  "required": "err_required",
  "unauthorized": "err_unauthorized",
  "not_an_email": "err_not_an_email",
  "not_an_id": "err_not_an_id",
  "not_a_boolean": "err_not_a_boolean",
  "not_found": "err_not_found",
  "password_required": "err_password_required",
  "email_exists": "err_email_exists",
  "invalid_credentials": "err_invalid_credentials",
  "invitation_not_accepted_yet": "err_invitation_not_accepted_yet",
  "no_access_token": "err_no_access_token",
  "already_deleted": "err_already_deleted",
  "already_expired": "err_already_expired",
  "already_accepted": "err_already_accepted",
  "forbidden": "err_forbidden",
  "value_not_allowed": "err_value_not_allowed",
  "not_a_number": "err_not_a_number",
  "not_an_array": "err_not_an_array",
  "min_max_invalid": "err_min_max_invalid",
  "cannot_create_more_than_one": "err_cannot_create_more_than_one",
  "request_entity_too_large": "err_request_entity_too_large",
  "parent_role_not_allowed": "err_parent_role_not_allowed",
  "role_can_not_have_parent": "err_role_can_not_have_parent",
  "must_start_with_slash": "err_must_start_with_slash",
  "protocol_host_port_format_required": "err_protocol_host_port_format_required",
  "recaptcha_required": "err_recaptcha_required",
  "invalid_recaptcha": "err_invalid_recaptcha",
  "invalid_password": "err_invalid_password"
}