[
    {
        "sequence": 1,
        "arr_delay": 0,
        "dep_delay": 0
    },
    {
        "sequence": 2,
        "arr_delay": 130,
        "dep_delay": 0
    },
    {
        "sequence": 3,
        "arr_delay": 0,
        "dep_delay": 0
    },
    {
        "sequence": 4,
        "arr_delay": 120,
        "dep_delay": 120
    },
    {
        "sequence": 5,
        "arr_delay": 0,
        "dep_delay": 0
    },
    {
        "sequence": 6,
        "arr_delay": 80,
        "dep_delay": 80
    },
    {
        "sequence": 7,
        "arr_delay": 80,
        "dep_delay": 0
    }
]
