<mxfile modified="2023-05-23T09:47:11.166Z" host="Electron" agent="Mozilla/5.0 (Windows NT 10.0; Win64; x64) AppleWebKit/537.36 (KHTML, like Gecko) draw.io/21.2.8 Chrome/112.0.5615.165 Electron/24.2.0 Safari/537.36" etag="4dM1wg4TBuCNhn9Dqkni" version="21.2.8" type="device">
  <diagram id="WI9T0HZ2pTsCkuznbFz-" name="Page-1">
    <mxGraphModel dx="1418" dy="828" grid="1" gridSize="10" guides="1" tooltips="1" connect="1" arrows="1" fold="1" page="1" pageScale="1" pageWidth="1169" pageHeight="827" math="0" shadow="0">
      <root>
        <mxCell id="0" />
        <mxCell id="1" parent="0" />
        <mxCell id="dkLkBtVoeD-QzUvh4KKE-39" value="" style="rounded=1;whiteSpace=wrap;html=1;movable=0;resizable=0;rotatable=0;deletable=0;editable=0;locked=1;connectable=0;" vertex="1" parent="1">
          <mxGeometry x="164.8" y="90" width="975.2" height="760" as="geometry" />
        </mxCell>
        <mxCell id="dkLkBtVoeD-QzUvh4KKE-20" value="" style="rounded=1;whiteSpace=wrap;html=1;align=left;" vertex="1" parent="1">
          <mxGeometry x="380" y="127.4" width="140" height="198" as="geometry" />
        </mxCell>
        <mxCell id="AcxdMaKK0mU5kZiv2lnr-9" value="Azure Blob&lt;br&gt;Storage&lt;br&gt;" style="aspect=fixed;html=1;perimeter=none;align=center;shadow=0;dashed=0;image;fontSize=12;image=img/lib/mscae/BlobBlock.svg;" parent="1" vertex="1">
          <mxGeometry x="422" y="396" width="62" height="53" as="geometry" />
        </mxCell>
        <mxCell id="Yb9yHQ_m3vMcTtYt7nYP-4" value="Cron" style="verticalLabelPosition=bottom;html=1;verticalAlign=top;align=center;strokeColor=none;fillColor=#2875E2;shape=mxgraph.azure.scheduler;pointerEvents=1;rotation=0;" parent="1" vertex="1">
          <mxGeometry x="803" y="188" width="70" height="80" as="geometry" />
        </mxCell>
        <mxCell id="Yb9yHQ_m3vMcTtYt7nYP-5" value="Azure Flexible PostgreSQL" style="verticalLabelPosition=bottom;html=1;verticalAlign=top;align=center;strokeColor=none;fillColor=#2875E2;shape=mxgraph.azure.sql_database_sql_azure;rotation=0;" parent="1" vertex="1">
          <mxGeometry x="615.25" y="560" width="70" height="80" as="geometry" />
        </mxCell>
        <mxCell id="Yb9yHQ_m3vMcTtYt7nYP-6" value="Uživatelé" style="verticalLabelPosition=bottom;html=1;verticalAlign=top;align=center;strokeColor=none;fillColor=#00BEF2;shape=mxgraph.azure.user;" parent="1" vertex="1">
          <mxGeometry x="1213.25" y="564.5" width="47.5" height="50" as="geometry" />
        </mxCell>
        <mxCell id="Yb9yHQ_m3vMcTtYt7nYP-7" value="Input Gateway" style="sketch=0;html=1;dashed=0;whitespace=wrap;fillColor=#2875E2;strokeColor=#ffffff;points=[[0.005,0.63,0],[0.1,0.2,0],[0.9,0.2,0],[0.5,0,0],[0.995,0.63,0],[0.72,0.99,0],[0.5,1,0],[0.28,0.99,0]];verticalLabelPosition=bottom;align=center;verticalAlign=top;shape=mxgraph.kubernetes.icon;prIcon=api" parent="1" vertex="1">
          <mxGeometry x="425" y="145.2" width="50" height="48" as="geometry" />
        </mxCell>
        <mxCell id="Yb9yHQ_m3vMcTtYt7nYP-8" value="Output Gateway" style="sketch=0;html=1;dashed=0;whitespace=wrap;fillColor=#2875E2;strokeColor=#ffffff;points=[[0.005,0.63,0],[0.1,0.2,0],[0.9,0.2,0],[0.5,0,0],[0.995,0.63,0],[0.72,0.99,0],[0.5,1,0],[0.28,0.99,0]];verticalLabelPosition=bottom;align=center;verticalAlign=top;shape=mxgraph.kubernetes.icon;prIcon=api" parent="1" vertex="1">
          <mxGeometry x="800" y="560" width="80" height="70" as="geometry" />
        </mxCell>
        <mxCell id="dkLkBtVoeD-QzUvh4KKE-1" value="Data Proxy" style="pointerEvents=1;shadow=0;dashed=0;html=1;strokeColor=none;fillColor=#2875E2;labelPosition=center;verticalLabelPosition=bottom;verticalAlign=top;align=center;outlineConnect=0;shape=mxgraph.veeam.2d.proxy_appliance;" vertex="1" parent="1">
          <mxGeometry x="210" y="192" width="74.8" height="78" as="geometry" />
        </mxCell>
        <mxCell id="dkLkBtVoeD-QzUvh4KKE-2" value="API key Management" style="verticalLabelPosition=bottom;html=1;verticalAlign=top;align=center;strokeColor=none;fillColor=#2875E2;shape=mxgraph.azure.access_control;" vertex="1" parent="1">
          <mxGeometry x="1016" y="384" width="50" height="50" as="geometry" />
        </mxCell>
        <mxCell id="dkLkBtVoeD-QzUvh4KKE-3" value="Integration Engine" style="sketch=0;html=1;dashed=0;whitespace=wrap;fillColor=#2875E2;strokeColor=#ffffff;points=[[0.005,0.63,0],[0.1,0.2,0],[0.9,0.2,0],[0.5,0,0],[0.995,0.63,0],[0.72,0.99,0],[0.5,1,0],[0.28,0.99,0]];verticalLabelPosition=bottom;align=center;verticalAlign=top;shape=mxgraph.kubernetes.icon;prIcon=pod;rotation=0;" vertex="1" parent="1">
          <mxGeometry x="601" y="380" width="80" height="70" as="geometry" />
        </mxCell>
        <mxCell id="dkLkBtVoeD-QzUvh4KKE-5" value="Permission proxy" style="sketch=0;html=1;dashed=0;whitespace=wrap;fillColor=#2875E2;strokeColor=#ffffff;points=[[0.005,0.63,0],[0.1,0.2,0],[0.9,0.2,0],[0.5,0,0],[0.995,0.63,0],[0.72,0.99,0],[0.5,1,0],[0.28,0.99,0]];verticalLabelPosition=bottom;align=center;verticalAlign=top;shape=mxgraph.kubernetes.icon;prIcon=role;rotation=0;" vertex="1" parent="1">
          <mxGeometry x="1002" y="562" width="80" height="70" as="geometry" />
        </mxCell>
        <mxCell id="dkLkBtVoeD-QzUvh4KKE-8" value="TCP Input Gateway" style="sketch=0;html=1;dashed=0;whitespace=wrap;fillColor=#2875E2;strokeColor=#ffffff;points=[[0.005,0.63,0],[0.1,0.2,0],[0.9,0.2,0],[0.5,0,0],[0.995,0.63,0],[0.72,0.99,0],[0.5,1,0],[0.28,0.99,0]];verticalLabelPosition=bottom;align=center;verticalAlign=top;shape=mxgraph.kubernetes.icon;prIcon=master" vertex="1" parent="1">
          <mxGeometry x="425" y="233.2" width="50" height="48" as="geometry" />
        </mxCell>
        <mxCell id="dkLkBtVoeD-QzUvh4KKE-9" value="RabbitMQ&lt;br&gt;" style="sketch=0;outlineConnect=0;fontColor=#232F3E;gradientColor=none;fillColor=#2875E2;strokeColor=none;dashed=0;verticalLabelPosition=bottom;verticalAlign=top;align=center;html=1;fontSize=12;fontStyle=0;aspect=fixed;pointerEvents=1;shape=mxgraph.aws4.mq_broker;fillStyle=auto;rotation=0;" vertex="1" parent="1">
          <mxGeometry x="601" y="191.4" width="80" height="70" as="geometry" />
        </mxCell>
        <mxCell id="dkLkBtVoeD-QzUvh4KKE-12" value="Redis" style="outlineConnect=0;dashed=0;verticalLabelPosition=bottom;verticalAlign=top;align=center;html=1;shape=mxgraph.aws3.cache_node;fillColor=#2875E2;gradientColor=none;" vertex="1" parent="1">
          <mxGeometry x="812" y="380" width="60" height="63" as="geometry" />
        </mxCell>
        <mxCell id="dkLkBtVoeD-QzUvh4KKE-13" value="Url Proxy" style="image;aspect=fixed;html=1;points=[];align=center;fontSize=12;image=img/lib/azure2/ai_machine_learning/Translator_Text.svg;" vertex="1" parent="1">
          <mxGeometry x="1016" y="740" width="50" height="50" as="geometry" />
        </mxCell>
        <mxCell id="dkLkBtVoeD-QzUvh4KKE-17" value="" style="shape=flexArrow;endArrow=classic;html=1;rounded=0;" edge="1" parent="1">
          <mxGeometry width="50" height="50" relative="1" as="geometry">
            <mxPoint x="528.5" y="229" as="sourcePoint" />
            <mxPoint x="588.5" y="229" as="targetPoint" />
          </mxGeometry>
        </mxCell>
        <mxCell id="dkLkBtVoeD-QzUvh4KKE-21" value="" style="shape=flexArrow;endArrow=classic;html=1;rounded=0;" edge="1" parent="1">
          <mxGeometry width="50" height="50" relative="1" as="geometry">
            <mxPoint x="300" y="233.20000000000002" as="sourcePoint" />
            <mxPoint x="360" y="233.20000000000002" as="targetPoint" />
          </mxGeometry>
        </mxCell>
        <mxCell id="dkLkBtVoeD-QzUvh4KKE-22" value="" style="shape=flexArrow;endArrow=classic;html=1;rounded=0;" edge="1" parent="1">
          <mxGeometry width="50" height="50" relative="1" as="geometry">
            <mxPoint x="790" y="230" as="sourcePoint" />
            <mxPoint x="700" y="229" as="targetPoint" />
          </mxGeometry>
        </mxCell>
        <mxCell id="dkLkBtVoeD-QzUvh4KKE-23" value="" style="shape=flexArrow;endArrow=classic;startArrow=classic;html=1;rounded=0;" edge="1" parent="1">
          <mxGeometry width="100" height="100" relative="1" as="geometry">
            <mxPoint x="640" y="370" as="sourcePoint" />
            <mxPoint x="640" y="295" as="targetPoint" />
          </mxGeometry>
        </mxCell>
        <mxCell id="dkLkBtVoeD-QzUvh4KKE-24" value="cache pro výpočty" style="shape=flexArrow;endArrow=classic;startArrow=classic;html=1;rounded=0;" edge="1" parent="1">
          <mxGeometry y="-30" width="100" height="100" relative="1" as="geometry">
            <mxPoint x="691" y="412" as="sourcePoint" />
            <mxPoint x="791" y="412" as="targetPoint" />
            <mxPoint as="offset" />
          </mxGeometry>
        </mxCell>
        <mxCell id="dkLkBtVoeD-QzUvh4KKE-26" value="cache pro requesty" style="shape=flexArrow;endArrow=classic;startArrow=classic;html=1;rounded=0;" edge="1" parent="1">
          <mxGeometry y="-60" width="100" height="100" relative="1" as="geometry">
            <mxPoint x="841" y="553" as="sourcePoint" />
            <mxPoint x="841" y="473" as="targetPoint" />
            <mxPoint as="offset" />
          </mxGeometry>
        </mxCell>
        <mxCell id="dkLkBtVoeD-QzUvh4KKE-28" value="" style="shape=flexArrow;endArrow=classic;startArrow=classic;html=1;rounded=0;" edge="1" parent="1">
          <mxGeometry width="100" height="100" relative="1" as="geometry">
            <mxPoint x="1040" y="550" as="sourcePoint" />
            <mxPoint x="1040" y="470" as="targetPoint" />
          </mxGeometry>
        </mxCell>
        <mxCell id="dkLkBtVoeD-QzUvh4KKE-29" value="" style="shape=flexArrow;endArrow=classic;startArrow=classic;html=1;rounded=0;" edge="1" parent="1">
          <mxGeometry width="100" height="100" relative="1" as="geometry">
            <mxPoint x="890" y="600" as="sourcePoint" />
            <mxPoint x="990" y="600" as="targetPoint" />
          </mxGeometry>
        </mxCell>
        <mxCell id="dkLkBtVoeD-QzUvh4KKE-31" value="" style="shape=flexArrow;endArrow=classic;startArrow=classic;html=1;rounded=0;" edge="1" parent="1">
          <mxGeometry width="100" height="100" relative="1" as="geometry">
            <mxPoint x="1040" y="733" as="sourcePoint" />
            <mxPoint x="1040" y="653" as="targetPoint" />
          </mxGeometry>
        </mxCell>
        <mxCell id="dkLkBtVoeD-QzUvh4KKE-32" value="" style="endArrow=classic;html=1;rounded=0;" edge="1" parent="1">
          <mxGeometry width="50" height="50" relative="1" as="geometry">
            <mxPoint x="1090" y="600" as="sourcePoint" />
            <mxPoint x="1190" y="600" as="targetPoint" />
          </mxGeometry>
        </mxCell>
        <mxCell id="dkLkBtVoeD-QzUvh4KKE-33" value="Informační tabule&lt;br&gt;" style="outlineConnect=0;dashed=0;verticalLabelPosition=bottom;verticalAlign=top;align=center;html=1;shape=mxgraph.aws3.hardware_board;fillColor=#00BEF2;gradientColor=none;" vertex="1" parent="1">
          <mxGeometry x="1202" y="714.75" width="84" height="100.5" as="geometry" />
        </mxCell>
        <mxCell id="dkLkBtVoeD-QzUvh4KKE-34" value="" style="endArrow=classic;html=1;rounded=0;" edge="1" parent="1">
          <mxGeometry width="50" height="50" relative="1" as="geometry">
            <mxPoint x="1080" y="760" as="sourcePoint" />
            <mxPoint x="1190" y="760" as="targetPoint" />
          </mxGeometry>
        </mxCell>
        <mxCell id="dkLkBtVoeD-QzUvh4KKE-35" value="" style="shape=flexArrow;endArrow=classic;startArrow=classic;html=1;rounded=0;" edge="1" parent="1">
          <mxGeometry width="100" height="100" relative="1" as="geometry">
            <mxPoint x="690" y="594.5" as="sourcePoint" />
            <mxPoint x="790" y="594.5" as="targetPoint" />
          </mxGeometry>
        </mxCell>
        <mxCell id="dkLkBtVoeD-QzUvh4KKE-37" value="Realtime data" style="endArrow=classic;html=1;rounded=0;" edge="1" parent="1">
          <mxGeometry width="50" height="50" relative="1" as="geometry">
            <mxPoint x="40" y="240" as="sourcePoint" />
            <mxPoint x="200" y="240" as="targetPoint" />
          </mxGeometry>
        </mxCell>
        <mxCell id="dkLkBtVoeD-QzUvh4KKE-38" value="Periodická aktualizace dat (jízdní řády apob.)" style="endArrow=classic;html=1;rounded=0;" edge="1" parent="1">
          <mxGeometry width="50" height="50" relative="1" as="geometry">
            <mxPoint x="580" y="470" as="sourcePoint" />
            <mxPoint x="50" y="564.5" as="targetPoint" />
            <Array as="points">
              <mxPoint x="460" y="565" />
            </Array>
          </mxGeometry>
        </mxCell>
        <mxCell id="dkLkBtVoeD-QzUvh4KKE-40" value="Datová platforma Golemio" style="text;html=1;strokeColor=none;fillColor=none;align=center;verticalAlign=middle;whiteSpace=wrap;rounded=0;" vertex="1" parent="1">
          <mxGeometry x="870" y="90" width="180" height="30" as="geometry" />
        </mxCell>
        <mxCell id="dkLkBtVoeD-QzUvh4KKE-43" value="" style="shape=flexArrow;endArrow=classic;startArrow=classic;html=1;rounded=0;" edge="1" parent="1">
          <mxGeometry width="100" height="100" relative="1" as="geometry">
            <mxPoint x="640.5" y="554" as="sourcePoint" />
            <mxPoint x="640.5" y="474" as="targetPoint" />
          </mxGeometry>
        </mxCell>
        <mxCell id="dkLkBtVoeD-QzUvh4KKE-50" value="" style="shape=flexArrow;endArrow=classic;html=1;rounded=0;" edge="1" parent="1">
          <mxGeometry width="50" height="50" relative="1" as="geometry">
            <mxPoint x="450" y="330" as="sourcePoint" />
            <mxPoint x="450" y="390" as="targetPoint" />
          </mxGeometry>
        </mxCell>
        <mxCell id="dkLkBtVoeD-QzUvh4KKE-53" value="" style="shape=flexArrow;endArrow=classic;html=1;rounded=0;" edge="1" parent="1">
          <mxGeometry width="50" height="50" relative="1" as="geometry">
            <mxPoint x="840" y="720" as="sourcePoint" />
            <mxPoint x="840" y="660" as="targetPoint" />
          </mxGeometry>
        </mxCell>
        <mxCell id="dkLkBtVoeD-QzUvh4KKE-54" value="" style="shape=flexArrow;endArrow=classic;html=1;rounded=0;" edge="1" parent="1">
          <mxGeometry width="50" height="50" relative="1" as="geometry">
            <mxPoint x="590" y="420" as="sourcePoint" />
            <mxPoint x="496" y="420" as="targetPoint" />
          </mxGeometry>
        </mxCell>
      </root>
    </mxGraphModel>
  </diagram>
</mxfile>
