[
    {
        "gtfs_trip_id": "137_2032_240103",
        "route_type": 3,
        "gtfs_route_short_name": "137",
        "lat": 50.06061,
        "lng": 14.38097,
        "bearing": 229,
        "delay": 89,
        "state_position": "on_track",
        "vehicle_id": "service-3-3927",
        "detailed_info": {
            "is_wheelchair_accessible": true,
            "origin_route_name": "137",
            "shape_id": "L137V2",
            "run_number": 1,
            "trip_headsign": "U Waltrovky",
            "shape_dist_traveled": 2.316,
            "last_stop_sequence": 6,
            "origin_timestamp": "2024-02-01T16:02:29.000Z",
            "registration_number": 3927,
            "operator": "DP PRAHA",
            "vehicle_type_id": 3
        }
    },
    {
        "gtfs_trip_id": "535_31_231201",
        "route_type": 3,
        "gtfs_route_short_name": "535",
        "lat": 50.02284,
        "lng": 15.21076,
        "bearing": 149,
        "delay": 11,
        "state_position": "on_track",
        "vehicle_id": "service-3-8650",
        "detailed_info": {
            "is_wheelchair_accessible": true,
            "origin_route_name": "421",
            "shape_id": "L535V4",
            "run_number": 69,
            "trip_headsign": "Kolín,nádraží",
            "shape_dist_traveled": 27.545,
            "last_stop_sequence": 20,
            "origin_timestamp": "2024-02-01T16:02:59.000Z",
            "registration_number": 8650,
            "operator": "OAD KOLÍN (Nymburk)",
            "vehicle_type_id": 4
        }
    },
    {
        "gtfs_trip_id": "135_1001_240219",
        "route_type": 3,
        "gtfs_route_short_name": "135",
        "lat": 50.07211,
        "lng": 14.44531,
        "bearing": 97,
        "delay": 16,
        "state_position": "on_track",
        "vehicle_id": "service-3-6837",
        "detailed_info": {
            "is_wheelchair_accessible": true,
            "origin_route_name": "135",
            "shape_id": "L135V2",
            "run_number": 10,
            "trip_headsign": "Chodov",
            "shape_dist_traveled": 3.248,
            "last_stop_sequence": 7,
            "origin_timestamp": "2024-04-17T17:34:59+02:00",
            "registration_number": 6837,
            "operator": "DP PRAHA",
            "vehicle_type_id": 3
        }
    }
]
