{
    "type": "FeatureCollection",
    "name": "parkoviste_orez_okresy_max",
    "crs": { "type": "name", "properties": { "name": "urn:ogc:def:crs:OGC:1.3:CRS84" } },
    "features": [
        {
            "type": "Feature",
            "properties": {
                "ogc_fid": 10255,
                "osm_id": "441584",
                "osm_way_id": null,
                "name": "okres Praha-východ",
                "type": "boundary",
                "aeroway": null,
                "amenity": null,
                "admin_level": "7",
                "barrier": null,
                "boundary": "administrative",
                "building": null,
                "craft": null,
                "geological": null,
                "historic": null,
                "land_area": null,
                "landuse": null,
                "leisure": null,
                "man_made": null,
                "military": null,
                "natural": null,
                "office": null,
                "place": null,
                "shop": null,
                "sport": null,
                "tourism": null
            },
            "geometry": {
                "type": "MultiPolygon",
                "coordinates": [
                    [
                        [
                            [12.45602388050232, 50.108972232378093],
                            [12.47003897922426, 50.216987160880919],
                            [12.354427486227694, 50.290784719768844],
                            [12.375695853202689, 50.332028510698045],
                            [12.45821413747054, 50.371329416431678],
                            [12.497626583017805, 50.412705237149389],
                            [12.611991866327024, 50.433395842963684],
                            [12.696793213951507, 50.427408802336721],
                            [12.721735497057804, 50.448375742960557],
                            [12.820701732457481, 50.478242114619334],
                            [12.963410901844084, 50.433726157191614],
                            [12.992460045999801, 50.455226900103661],
                            [13.016659816388559, 50.524974915500373],
                            [13.078435267914241, 50.518172301271093],
                            [13.128270731737871, 50.536392422253179],
                            [13.170006082834885, 50.524065787308231],
                            [13.231845461177048, 50.607392307003217],
                            [13.293146797199027, 50.608238014886091],
                            [13.360964440411513, 50.637367429809366],
                            [13.398642511799061, 50.603253099297554],
                            [13.458926210674587, 50.601073863584382],
                            [13.514842167519204, 50.5579287276515],
                            [13.586972962058223, 50.488368084242666],
                            [13.597055387918797, 50.435843227335447],
                            [13.631447681924381, 50.44869060983779],
                            [13.73164356671403, 50.436552172032258],
                            [13.765228099522512, 50.484704189298306],
                            [13.85367172292127, 50.511946365341714],
                            [13.881652957154536, 50.572416687218087],
                            [14.02132057844327, 50.604382804194785],
                            [14.115906564157275, 50.608664223501798],
                            [14.167321651898789, 50.64176075947703],
                            [14.198520698638575, 50.644281469957612],
                            [14.131973549394395, 50.702210353699186],
                            [14.041287598428623, 50.737913158150107],
                            [14.042285902518273, 50.761815333174859],
                            [14.011402485598072, 50.787763160115752],
                            [14.030593360584485, 50.82405414516068],
                            [14.190272620798977, 50.86932584782177],
                            [14.222415058923769, 50.904189527530434],
                            [14.35741339896466, 50.918216827096998],
                            [14.230725329338028, 50.984091524224681],
                            [14.249669714327705, 51.049325269037233],
                            [14.29141954288788, 51.071768617494754],
                            [14.370713007632121, 51.062442973097973],
                            [14.412997646079354, 51.03831867344492],
                            [14.493207529486678, 51.064121328797739],
                            [14.528755727538083, 51.055901469681309],
                            [14.534847270093328, 51.035407309193019],
                            [14.624722317528404, 50.994994644179378],
                            [14.612056656557471, 50.943055905015989],
                            [14.675450123074459, 50.939809033359573],
                            [14.681240201531205, 50.904648659826762],
                            [14.653227880902469, 50.868429602695514],
                            [14.774484829446616, 50.839658697546717],
                            [14.820365041514679, 50.889754399311201],
                            [14.968169765529993, 50.884642315645884],
                            [14.961990710013058, 50.92631760419534],
                            [14.985970353902268, 50.949625980819711],
                            [14.940000501694994, 50.987689397020894],
                            [14.966787760951602, 51.024444720915909],
                            [15.015765758753597, 51.040868187293341],
                            [15.122847444004526, 51.02512887896571],
                            [15.179233220524349, 51.037390980447285],
                            [15.203178206642971, 51.010581557423762],
                            [15.247487401613091, 51.015565188599417],
                            [15.297912140206217, 50.98938144704745],
                            [15.320659688447149, 50.953609640016403],
                            [15.298020235502284, 50.926966634500801],
                            [15.305089083327738, 50.897747768353859],
                            [15.378555801323168, 50.860291997298326],
                            [15.40394266236861, 50.817824121105645],
                            [15.43979015237816, 50.827031586236615],
                            [15.523667009821866, 50.80689609898981],
                            [15.593998848232692, 50.752467291778096],
                            [15.591987634211398, 50.685006618199694],
                            [15.630344369551944, 50.614563798227039],
                            [15.60975324108127, 50.588856982768398],
                            [15.680813507855834, 50.496192730957183],
                            [15.678757410197129, 50.467430701024547],
                            [15.712504628448155, 50.454753213300918],
                            [15.752705904479384, 50.407669074933374],
                            [15.759609721074524, 50.365243468256544],
                            [15.841149431385494, 50.361142655366486],
                            [15.905797033288403, 50.341055393009846],
                            [15.916505949400813, 50.322664187043671],
                            [15.975771169517541, 50.326688001668913],
                            [16.08881174795399, 50.235936385479135],
                            [16.084229181791837, 50.197298923551301],
                            [16.033115646829309, 50.15546914476402],
                            [16.037316762442114, 50.130530645033758],
                            [16.082820328796746, 50.125733121782517],
                            [16.166259298289397, 50.067032833984541],
                            [16.144238825842436, 50.015577957830082],
                            [16.075588777824922, 49.962935399147895],
                            [16.117372250409062, 49.872926762772892],
                            [16.174394382842056, 49.840862307430932],
                            [16.18140342016607, 49.78900189632401],
                            [16.155591766540791, 49.739890692908375],
                            [16.11030589769647, 49.739846253362742],
                            [16.116521977543016, 49.702653409226471],
                            [16.047591185709486, 49.693384609628943],
                            [16.000185856760375, 49.704322992159305],
                            [15.958094720663476, 49.668995708760193],
                            [15.894417472356791, 49.673630698511644],
                            [15.859271699756549, 49.615987961943446],
                            [15.813273475879679, 49.600293242251382],
                            [15.802824215816941, 49.530127890710105],
                            [15.747960649374317, 49.514162817692217],
                            [15.71504671217642, 49.483642184625523],
                            [15.647366040892729, 49.495749502685662],
                            [15.648460754799853, 49.464302776811898],
                            [15.600713800358019, 49.450432709734777],
                            [15.453875029145884, 49.479654866288378],
                            [15.398884418634891, 49.455760393871977],
                            [15.44296583504584, 49.363012750361293],
                            [15.408880546188641, 49.348980173789542],
                            [15.359670752490882, 49.262292754745062],
                            [15.302642104571337, 49.2558736776231],
                            [15.303790065780678, 49.235385727474188],
                            [15.3693428611701, 49.225284496755016],
                            [15.371529746851804, 49.171872041003574],
                            [15.403735815062959, 49.151021931512602],
                            [15.47833559402558, 49.139838112411034],
                            [15.550914730837997, 49.153135778160717],
                            [15.613948790541826, 49.113404724220921],
                            [15.622127189314774, 49.06825229327287],
                            [15.579988919856662, 49.053845978550093],
                            [15.544832612238627, 49.008830663864181],
                            [15.60494317512544, 48.973512886609917],
                            [15.613934307011091, 48.943829236518667],
                            [15.589827992994527, 48.915528048499553],
                            [15.53291951863895, 48.890839857655827],
                            [15.492845670935214, 48.902029833148966],
                            [15.472668166394199, 48.92640619973416],
                            [15.346241189950618, 48.965885150605168],
                            [15.297962643544542, 48.96070327874353],
                            [15.270717640436919, 48.936691702095374],
                            [15.224021667468627, 48.94068745064795],
                            [15.157084883818195, 48.923826847282918],
                            [15.128913349205323, 48.94172543230777],
                            [15.123939354192203, 48.979488124512791],
                            [15.026627227031373, 48.995701932427934],
                            [15.004119190133597, 48.968628172362735],
                            [15.011768913240847, 48.842637052814872],
                            [14.986645850804791, 48.808889071480898],
                            [15.001176483858208, 48.761493122468011],
                            [14.954992517075762, 48.740108490764335],
                            [14.839016055902563, 48.761320538666681],
                            [14.829110655106451, 48.722445303978731],
                            [14.716678444617235, 48.658042581396003],
                            [14.681309139086974, 48.669943214835591],
                            [14.603967468035144, 48.759872576158394],
                            [14.559945228451987, 48.78228523521792],
                            [14.477706697521842, 48.77752794459721],
                            [14.423156055360536, 48.846606857608073],
                            [14.373672079407802, 48.859551948058765],
                            [14.338520215476471, 48.895271923197825],
                            [14.19858599478456, 48.959591519585487],
                            [14.186596551685467, 49.001026134451863],
                            [14.246984243828141, 49.041417973554161],
                            [14.218529422690676, 49.075410095224214],
                            [14.050519104190691, 49.077045275342591],
                            [13.995058549824661, 49.107253161484103],
                            [13.861109454682891, 49.088291023136989],
                            [13.832504641700986, 49.115124931923525],
                            [13.762032879128697, 49.111573203871849],
                            [13.671350746387963, 49.144206570994839],
                            [13.657088169341232, 49.164311670141025],
                            [13.676137917196678, 49.203215824577384],
                            [13.671856199761059, 49.283382664437482],
                            [13.699051299908572, 49.320255230422141],
                            [13.741054570354937, 49.34035541112015],
                            [13.753417244165847, 49.362668990407983],
                            [13.735845960801145, 49.3863753948797],
                            [13.666233696847369, 49.404468387221321],
                            [13.612738974756811, 49.400921442600044],
                            [13.587396266205918, 49.415445005813709],
                            [13.482060196303165, 49.416278495657075],
                            [13.427044083275357, 49.442210626149681],
                            [13.428312207057822, 49.477371939775459],
                            [13.353570766833689, 49.458642208096137],
                            [13.321427678518551, 49.470640493093022],
                            [13.316192848520668, 49.492627503413665],
                            [13.27964257775743, 49.493358018719846],
                            [13.26074300401485, 49.509054380534067],
                            [13.199423011936117, 49.488820168790653],
                            [13.054928401276587, 49.554193782754368],
                            [12.943544290025613, 49.571106440970055],
                            [12.950914415679927, 49.623217561823971],
                            [13.019891294755384, 49.662797800427334],
                            [13.022272564138669, 49.726648339229058],
                            [13.059639691604621, 49.751302315586408],
                            [13.037430836642118, 49.768688759122973],
                            [13.054585882203819, 49.809792364810491],
                            [12.993143810829535, 49.834968673262445],
                            [13.010620807304452, 49.865862034335407],
                            [12.989857467604629, 49.894202821875929],
                            [12.930854721006027, 49.948747944597812],
                            [12.896696502443012, 49.956081617143134],
                            [12.895442839272267, 49.9914672090623],
                            [12.860805737327045, 49.98865039298078],
                            [12.8446504706345, 50.010808065428613],
                            [12.736455443238208, 50.04951854320813],
                            [12.616795486331066, 50.030925383528846],
                            [12.559166249600565, 50.04466881727123],
                            [12.54746600811561, 50.065718354800119],
                            [12.45602388050232, 50.108972232378093]
                        ],
                        [
                            [15.010921741790048, 48.975430627124645],
                            [15.010947042555804, 48.975443184902659],
                            [15.010927313413301, 48.97543526245704],
                            [15.010921741790048, 48.975430627124645]
                        ]
                    ]
                ]
            }
        }
    ]
}
