{
    "AppStoreConnect": "https://api.appstoreconnect.apple.com/v1/salesReports?filter[frequency]=DAILY&filter[reportDate]=:reportDate&filter[reportSubType]=SUMMARY&filter[reportType]=SALES&filter[vendorNumber]=85867124",
    "AppStoreConnectCredentials": {
        "iss": "",
        "kid": "",
        "private_key": ""
    },
    "AirQualityStations1H": "http://portal.chmi.cz/files/portal/docs/uoco/web_generator/actual_hour_data_cze.json",
    "AirQualityStations3H": "http://portal.chmi.cz/files/portal/docs/uoco/web_generator/aqindex_3h_cze.json",
    "CityDistricts": "https://services5.arcgis.com/SBTXIEUGWbqzUecw/arcgis/rest/services/MAP_CUR_MAP_MESTSKECASTI_P/FeatureServer/0/query?outFields=*&where=1%3D1&f=geojson&resultRecordCount=1000&resultOffset=0",
    "FlowAPI": {
        "url": "https://10.200.4.4:8080/api/cubes",
        "token": ""
    },
    "Gardens": "https://www.mojepraha.eu/api/gardens",
    "HoppyGoSharedCars": "",
    "HoppyGoSharedCarsToken": "",
    "MedicalInstitutionsHealthCare": "https://opendata.mzcr.cz/data/nrpzs/narodni-registr-poskytovatelu-zdravotnich-sluzeb.csv",
    "MedicalInstitutionsPharmacies": "https://opendata.sukl.cz/soubory/SODERECEPT/LEKARNYAKTUALNI.zip",
    "MunicipalAuthorities": "https://www.mojepraha.eu/api/municipal-authorities",
    "MunicipalLibraries": "https://www.mlp.cz/cz/pobocky/?export=xml",
    "MunicipalPoliceStations": "https://services5.arcgis.com/SBTXIEUGWbqzUecw/arcgis/rest/services/FSB_CUR_BEZ_OBJEKTMPP_B/FeatureServer/0/query?outFields=*&where=1%3D1&f=geojson&resultRecordCount=1000&resultOffset=0",
    "NextbikeSharedBikes": {
        "headers": {
            "cache-control": "no-cache"
        },
        "baseUrl": "https://gbfs.nextbike.net/maps/gbfs/v2/",
        "sourceIds": ["nextbike_tg", "nextbike_tq", "nextbike_tk", "nextbike_td"]
    },
    "OICTEndpointApikey": "",
    "OICTEnergetikaApiHeaders": {
        "X-Api-Key": ""
    },
    "OICTEnergetikaApiUrl": "https://api.oictenergetika.cz",
    "BicycleCountersCamea": "https://unicam.camea.cz/api/bike-counter/get-all-sensors/",
    "BicycleCountersCameaMeasurements": "https://unicam.camea.cz/api/bike-counter/get-sensor-data-history/id/:id/from/:from/to/:to",
    "BicycleCountersEcoCounter": "https://apieco.eco-counter-tools.com/api/1.0/site",
    "BicycleCountersEcoCounterMeasurements": "https://apieco.eco-counter-tools.com/api/1.0/data/site/:id?begin=:from&end=:to&step=:step&complete=:complete",
    "CountersEcoCounterTokens": {
        "OICT": "",
        "PRAHA": ""
    },
    "ParkingZones": "https://services5.arcgis.com/SBTXIEUGWbqzUecw/arcgis/rest/services/DOP_CUR_DOP_ZPS_USEKY_P/FeatureServer/0/query?outFields=*&where=1%3D1&f=geojson&resultRecordCount=2000&resultOffset=0",
    "ZtpParkingsApiUrl": "https://services5.arcgis.com/SBTXIEUGWbqzUecw/arcgis/rest/services/DOP_CUR_DOP_TSK_STANI_ZTP_B/FeatureServer/0/query?outFields=*&where=1%3D1&f=geojson&resultRecordCount=1000&resultOffset=0",
    "Playgrounds": "http://www.hristepraha.cz/api/get-all-items?type=hriste",
    "PlayStoreKeyFilename": "config/filename.json",
    "PSASApi": {
        "url": "",
        "user": "",
        "password": ""
    },
    "RekolaSharedBikesBaseUrl": "https://www.rekola.cz/api/mobile/regions/1",
    "RekolaSharedBikesHeaders": {
        "X-Api-Version": "",
        "X-Client": "",
        "X-Api-Key": "",
        "X-Client-OS": "",
        "X-Device-Name": "",
        "cache-control": "no-cache"
    },
    "SkodaPalaceQueues": "https://prod.kadlecelektro.cz/webcall/v4_mhmp/master/json.php",
    "SkodaPalaceQueuesApiKey": "",
    "TSKFTP": {
        "host": "",
        "port": 21,
        "user": "",
        "password": ""
    },
    "TSKFTPParkingZonesPath": "/external/tsk/parking-zones",
    "TSKParkings": "http://www.tsk-praha.cz/tskexport3/json/parkings",
    "TSKParkomats": "http://vyvoj.ctgroup.cz/cisservice/cisictservice.svc",
    "TSKParkomatsToken": "",
    "UnimonitorCemApiEnergetics": {
        "url": "https://cemapi.unimonitor.eu/api",
        "authCookieName": "CEMAPI",
        "user": "",
        "pass": ""
    },
    "WasteCollectionSensorSources": {
        "sensoneoApi": {
            "name": "Sensoneo",
            "url": "https://sensoneotools.azurewebsites.net/api",
            "code": ""
        },
        "sensorityApi": {
            "name": "Sensority",
            "url": "https://sensemanag.sensority.eu/external",
            "token": ""
        }
    },
    "WasteCollectionYards": "https://services5.arcgis.com/SBTXIEUGWbqzUecw/arcgis/rest/services/ZPK_CUR_ZPK_O_SBERODPADU_B/FeatureServer/0/query?outFields=ADRESA,KONTAKT,NAZEV,OBJECTID,PROVOZNIDOBA,PROVOZOVATEL,PLATNOST,ODPADPRIJEM,ODPADOMEZENI,NEBEZPODPADPRIJEM,ZPETNYODBER,PLATBAODPAD,PLATBANEBEZPODPAD,POZNAMKA&where=PLATNOST%3D1&f=geojson&resultRecordCount=1000&resultOffset=0",
    "WazeCCP": "https://world-georss.waze.com/rtserver/web/TGeoRSS?format=JSON&polygon=14.613000,50.291000;14.468000,50.308000;14.324000,50.287000;14.290000,50.231000;14.178000,50.132000;14.153000,49.974000;14.465000,49.885000;14.863000,49.929000;14.752000,50.128000;14.829000,50.250000;14.613000,50.291000;14.613000,50.291000",
    "KSNKOApi": {
        "url": "https://ksnko.praha.eu/api",
        "user": "",
        "password": ""
    },
    "WazeTT": [],
    "CeskyCarsharingRequestHeaders": {
        "Content-Type": "application/json"
    },
    "CeskyCarsharingRequestBody": {
        "guid": "",
        "password": ""
    },
    "CeskyCarsharingVehiclesApiUrl": "https://api.ceskycarsharing.cz/iis_cs_api_demo/IIS_API.svc/getAllCarsIct",
    "CeskyCarsharingGeofencingApiUrl": "https://api.ceskycarsharing.cz/iis_cs_api_demo/IIS_API.svc/getPolygonsIct",
    "waste-collection": {
        "rfid": {
            "sensoneo": {
                "containerVendorUrl": "",
                "containerVendorCode": "",
                "picksUrl": "",
                "picksCode": ""
            },
            "nam": {
                "containerVendorUrl": "",
                "picksUrl": "",
                "apiKey": ""
            }
        },
        "itop": {
            "url": "",
            "username": "",
            "password": ""
        },
        "venzeo": {
            "url": "",
            "token": ""
        }
    },
    "chmu": {
        "ftpInput": {
            "path": "/external/chmi-meteo/",
            "host": "",
            "port": 21,
            "user": "",
            "password": ""
        }
    },
    "TrafficCommon": {
        "RsdTmcOsmMapping": {
            "url": "https://deviptoict.blob.core.windows.net/storage/OSM-TMC/rsd_tmc_osm_mapping.csv"
        }
    },
    "parking": {
        "TskApiBaseUrl": "https://apicore.zpspraha.cz/cisvphcdapi/api/",
        "TskApiCredentials": {
            "user": "",
            "pass": ""
        },
        "TskApiEndpoints": {
            "parkingSections": "Section/list",
            "parkingSectionLevel251": "SectionItem/list?level=251",
            "parkingSectionLevel253": "SectionItem/list?level=253",
            "parkingTariffs": "Tariff/list",
            "parkingMachines": "ParkMachine/list"
        },
        "mrParkit": {
            "datasource": {
                "url": "https://mr-parkit-alpha.herokuapp.com/api/oict/garages",
                "apiVersion": "",
                "apiKey": ""
            }
        },
        "Smart4City": {
            "ApiBaseUrl": "https://www.smart4city.cz/api/v1/cities"
        },
        "osm": {
            "datasource": {
                "parkingUrl": "",
                "parkingLocationUrl": "",
                "entrancesUrl": "",
                "parkingMachinesUrl": "https://deviptoict.blob.core.windows.net/storage/OSM-ParkingExport/vending_machines.geojson"
            }
        },
        "iptoict": {
            "datasource": {
                "entrances": "",
                "prohibitions": "https://deviptoict.blob.core.windows.net/storage/Carparking/staticData/parkings_prohibitions.json"
            }
        },
        "bedrichov": {
            "datasource": {
                "url": "",
                "token": ""
            }
        },
        "addresses": {
            "batchSize": 2000,
            "updateIntervalDays": 180
        }
    },
    "vehiclesharing": {
        "staticData": {
            "baseUrl": "https://xxxxx.windows.net/storage/Vehiclesharing/staticData/",
            "resources": {
                "CeskyCarsharing": ["pricingPlans", "pricings", "systemInformation", "vehicleTypes"],
                "HoppyGo": ["rentalApps", "systemInformation", "vehicleTypes"],
                "Rekola": ["pricingPlans", "pricings", "systemInformation"]
            }
        }
    },
    "energetics": {
        "commodityProviders": {
            "staticData": {
                "baseUrl": "https://rabingolemio.blob.core.windows.net",
                "acccesConfigurationPath": "/rabin-energetics/access_configuration.json",
                "metersettings": {
                    "path": "/rabin-energetics/meterssettings.json"
                }
            },
            "cem_api_veolia_water": {
                "authCookieName": "CEMAPI",
                "user": "",
                "pass": ""
            },
            "cem_api_veolia_electro": {
                "authCookieName": "CEMAPI",
                "user": "",
                "pass": ""
            },
            "ppas_ave_api": {
                "baseUrl": "https://iave.ppas.cz/website/api"
            },
            "ppas_ave_api_v": {
                "user": "",
                "pass": ""
            },
            "ppas_ave_api_m": {
                "user": "",
                "pass": ""
            },
            "ppas_ave_api_a": {
                "user": "",
                "pass": ""
            },
            "ppas_ave_api_c": {
                "user": "",
                "pass": ""
            },
            "ppas_ave_api_mo": {
                "user": "",
                "pass": ""
            },
            "pre_electro_ftp": {
                "host": "",
                "port": 16421,
                "user": "",
                "password": ""
            }
        }
    }
}
