<?xml version="1.0" encoding="utf-8"?>
<svg width="21" height="20" viewBox="0 0 21 20" fill="none" xmlns="http://www.w3.org/2000/svg">
  <path fill-rule="evenodd" clip-rule="evenodd" d="M 6.165 1.5 C 3.635 1.5 2 3.233 2 5.916 L 2 14.084 C 2 16.767 3.635 18.5 6.165 18.5 L 14.833 18.5 C 17.364 18.5 19 16.767 19 14.084 L 19 5.916 C 19 3.233 17.364 1.5 14.834 1.5 L 6.165 1.5 Z M 14.833 20 L 6.165 20 C 2.776 20 0.5 17.622 0.5 14.084 L 0.5 5.916 C 0.5 2.378 2.776 0 6.165 0 L 14.834 0 C 18.223 0 20.5 2.378 20.5 5.916 L 20.5 14.084 C 20.5 17.622 18.223 20 14.833 20 Z" fill="#545F78"/>
  <path fill-rule="evenodd" clip-rule="evenodd" d="M 14.448 11.014 C 13.895 11.014 13.443 10.567 13.443 10.014 C 13.443 9.461 13.886 9.014 14.438 9.014 L 14.448 9.014 C 15.001 9.014 15.448 9.461 15.448 10.014 C 15.448 10.567 15.001 11.014 14.448 11.014 Z" fill="#545F78"/>
  <path fill-rule="evenodd" clip-rule="evenodd" d="M 10.439 11.014 C 9.886 11.014 9.435 10.567 9.435 10.014 C 9.435 9.461 9.877 9.014 10.43 9.014 L 10.439 9.014 C 10.992 9.014 11.439 9.461 11.439 10.014 C 11.439 10.567 10.992 11.014 10.439 11.014 Z" fill="#545F78"/>
  <path fill-rule="evenodd" clip-rule="evenodd" d="M 6.43 11.014 C 5.877 11.014 5.425 10.567 5.425 10.014 C 5.425 9.461 5.868 9.014 6.421 9.014 L 6.43 9.014 C 6.983 9.014 7.43 9.461 7.43 10.014 C 7.43 10.567 6.983 11.014 6.43 11.014 Z" fill="#545F78"/>
</svg>