<svg width="9" height="9" viewBox="0 0 12 10" fill="none" xmlns="http://www.w3.org/2000/svg">
<path d="M4.07573 9.29867L0.175729 5.39867C-0.0585762 5.16437 -0.0585762 4.78447 0.175729 4.55014L1.02424 3.70161C1.25854 3.46728 1.63846 3.46728 1.87277 3.70161L4.49999 6.32881L10.1272 0.701607C10.3615 0.467303 10.7414 0.467303 10.9758 0.701607L11.8243 1.55014C12.0586 1.78444 12.0586 2.16434 11.8243 2.39867L4.92426 9.29869C4.68993 9.533 4.31003 9.533 4.07573 9.29867Z" fill="white"/>
</svg>
