<svg width="16" height="16" viewBox="0 0 16 16" fill="none" xmlns="http://www.w3.org/2000/svg">
<path fill-rule="evenodd" clip-rule="evenodd" d="M7.83301 10.7694C7.55701 10.7694 7.33301 10.5454 7.33301 10.2694V5.38477C7.33301 5.10877 7.55701 4.88477 7.83301 4.88477C8.10901 4.88477 8.33301 5.10877 8.33301 5.38477V10.2694C8.33301 10.5454 8.10901 10.7694 7.83301 10.7694Z" fill="white"/>
<path fill-rule="evenodd" clip-rule="evenodd" d="M10.2773 8.32666H5.38867C5.11201 8.32666 4.88867 8.10266 4.88867 7.82666C4.88867 7.55066 5.11201 7.32666 5.38867 7.32666H10.2773C10.5533 7.32666 10.7773 7.55066 10.7773 7.82666C10.7773 8.10266 10.5533 8.32666 10.2773 8.32666Z" fill="white"/>
<path fill-rule="evenodd" clip-rule="evenodd" d="M4.70917 1.6665C2.86117 1.6665 1.6665 2.93117 1.6665 4.88984V10.7765C1.6665 12.7352 2.86117 13.9998 4.70917 13.9998H10.9572C12.8058 13.9998 13.9998 12.7352 13.9998 10.7765V4.88984C13.9998 2.93117 12.8058 1.6665 10.9572 1.6665H4.70917ZM10.9572 14.9998H4.70917C2.29117 14.9998 0.666504 13.3025 0.666504 10.7765V4.88984C0.666504 2.36384 2.29117 0.666504 4.70917 0.666504H10.9572C13.3752 0.666504 14.9998 2.36384 14.9998 4.88984V10.7765C14.9998 13.3025 13.3752 14.9998 10.9572 14.9998Z" fill="white"/>
</svg>
