{
  "fileServerFolder": ".",
  "fixturesFolder": "./src/fixtures",
  "integrationFolder": "./src/integration",
  "pluginsFile": "./src/plugins/index",
  "supportFile": false,
  "video": true,
  "videosFolder": "../../../dist/cypress/apps/client-panel/client-panel-e2e/videos",
  "screenshotsFolder": "../../../dist/cypress/apps/client-panel/client-panel-e2e/screenshots",
  "chromeWebSecurity": false
}
