<svg width="27" height="27" viewBox="0 0 27 27" xmlns="http://www.w3.org/2000/svg">
<path d="M23.7083 0.375H3.29167C1.6875 0.375 0.375 1.6875 0.375 3.29167V23.7083C0.375 25.3125 1.6875 26.625 3.29167 26.625H23.7083C25.3125 26.625 26.625 25.3125 26.625 23.7083V3.29167C26.625 1.6875 25.3125 0.375 23.7083 0.375ZM9.125 20.7917H6.20833V13.5H9.125V20.7917ZM14.9583 20.7917H12.0417V16.4167H14.9583V20.7917ZM14.9583 13.5H12.0417V10.5833H14.9583V13.5ZM20.7917 20.7917H17.875V6.20833H20.7917V20.7917Z"/>
</svg>
