{
  "fileServerFolder": ".",
  "fixturesFolder": "./src/fixtures",
  "integrationFolder": "./src/integration",
  "pluginsFile": "./src/plugins/index",
  "supportFile": "./src/support/index.ts",
  "video": true,
  "videosFolder": "../dist/cypress/e2e/videos",
  "screenshotsFolder": "../dist/cypress/e2e/screenshots",
  "chromeWebSecurity": false,
  "env": {
    "email": "admin@operatoricte2e.cz",
    "password": "test123",
    "passwordTempNew": "test123456",
    "testUserName": "testuser123456",
    "testUserEmail": "testuser123456@testuser123456.cz",
    "testRoleName": "testrole123456",
    "testRouteEndpoint": "testroute123456"
  }
}
