{
    "name": "openupmedia/satis",
    "description": "Open Up Media composer packages",
    "homepage": "https://packages.openupmedia.be",
    "repositories": [
        { "type": "vcs", "url": "https://gitlab.com/openupmedia/public/cortex_editor" },
        { "type": "vcs", "url": "https://gitlab.com/openupmedia/public/eucc_consent_file" },
        { "type": "vcs", "url": "https://gitlab.com/openupmedia/public/oum_gdpr_compliance" },
        { "type": "vcs", "url": "https://gitlab.com/openupmedia/public/oum_cookie_compliance" },
        { "type": "vcs", "url": "https://gitlab.com/openupmedia/public/oum_support" },
        { "type": "vcs", "url": "https://gitlab.com/openupmedia/public/oum_webform_lockdown" },
        { "type": "vcs", "url": "https://gitlab.com/openupmedia/public/oum_metatag" },
        { "type": "vcs", "url": "https://gitlab.com/openupmedia/public/cortex_favicon" },
        { "type": "vcs", "url": "https://gitlab.com/openupmedia/public/cortex_general_settings" },
        { "type": "vcs", "url": "https://gitlab.com/openupmedia/public/cortex_organisation" },
        { "type": "vcs", "url": "https://gitlab.com/openupmedia/public/cortex_seo" },
        { "type": "vcs", "url": "https://gitlab.com/openupmedia/public/cortex_socials" },
        { "type": "vcs", "url": "https://gitlab.com/openupmedia/public/bullhorn_api" },
        { "type": "vcs", "url": "https://gitlab.com/openupmedia/public/migrate_vacancies" },
        { "type": "vcs", "url": "https://gitlab.com/openupmedia/public/migrate_vacancies_bullhorn" },
        { "type": "vcs", "url": "https://gitlab.com/openupmedia/public/trakstar_api" },
        { "type": "vcs", "url": "https://gitlab.com/openupmedia/public/site_settings_advanced_tokens" },
        { "type": "vcs", "url": "https://gitlab.com/openupmedia/public/webform_bullhorn" }
    ],
    "abandoned": {
        "openupmedia/oum_cookie_compliance": "openupmedia/oum_gdpr_compliance"
    },
    "require-all": true
}
