<svg xmlns="http://www.w3.org/2000/svg" xmlns:xlink="http://www.w3.org/1999/xlink" xml:space="preserve" version="1.1" style="shape-rendering:geometricPrecision;text-rendering:geometricPrecision;image-rendering:optimizeQuality;" viewBox="0 0 100 125" x="0px" y="0px" fill-rule="evenodd" clip-rule="evenodd"><defs><style type="text/css">
   
    .fil0 {fill:black;fill-rule:nonzero}
   
  </style></defs><g><path class="fil0" d="M31.62 28.97c-2.19,0 -2.19,-3.34 0,-3.34l35.29 0c2.19,0 2.2,3.34 0,3.34l-35.29 0zm-13.81 26.2c0,-2.19 3.34,-2.21 3.34,0l0 6.67c0,2.18 -3.34,2.2 -3.34,0l0 -6.67zm0 16.66c0,-2.18 3.34,-2.2 3.34,0l0 6.67c0,2.19 -3.34,2.21 -3.34,0l0 -6.67zm0.19 16.07c-0.48,-2.38 2.84,-2.76 3.23,-0.83 0.15,0.74 0.6,1.43 1.19,1.89 0.56,0.44 1.31,0.73 2.02,0.73 0.63,0 1.29,0.41 1.5,0.93 0.55,1.12 -0.29,2.4 -1.5,2.4 -1.56,-0.05 -3.06,-0.52 -4.24,-1.58 -1.15,-1.02 -1.8,-2.04 -2.2,-3.54zm16.44 5.12c-0.63,0 -1.29,-0.41 -1.5,-0.94 -0.56,-1.11 0.29,-2.39 1.5,-2.39l9.98 0c0.63,0 1.29,0.41 1.5,0.93 0.55,1.12 -0.29,2.4 -1.5,2.4l-9.98 0zm47.75 -37.85c0,-2.19 -3.34,-2.21 -3.34,0l0 6.67c0,2.18 3.34,2.2 3.34,0l0 -6.67zm0 16.66c0,-2.18 -3.34,-2.2 -3.34,0l0 6.67c0,2.19 3.34,2.21 3.34,0l0 -6.67zm-0.19 16.07c0.48,-2.38 -2.84,-2.76 -3.23,-0.83 -0.15,0.74 -0.6,1.43 -1.19,1.89 -0.56,0.44 -1.31,0.73 -2.02,0.73 -0.63,0 -1.29,0.41 -1.5,0.93 -0.55,1.12 0.29,2.4 1.5,2.4 1.56,-0.05 3.06,-0.52 4.24,-1.58 1.15,-1.02 1.8,-2.04 2.2,-3.54zm-16.44 5.12c0.63,0 1.29,-0.41 1.5,-0.94 0.56,-1.11 -0.29,-2.39 -1.5,-2.39l-9.98 0c-0.63,0 -1.29,0.41 -1.5,0.93 -0.55,1.12 0.29,2.4 1.5,2.4l9.98 0zm-47.75 -48.19c0,2.19 3.34,2.21 3.34,0l0 -6.67c0,-2.18 -3.34,-2.2 -3.34,0l0 6.67zm0 -16.66c0,2.18 3.34,2.2 3.34,0l0 -6.67c0,-2.19 -3.34,-2.21 -3.34,0l0 6.67zm0.19 -16.07c-0.48,2.38 2.84,2.76 3.23,0.83 0.15,-0.74 0.6,-1.43 1.19,-1.89 0.56,-0.44 1.31,-0.73 2.02,-0.73 0.63,0 1.29,-0.41 1.5,-0.93 0.55,-1.12 -0.29,-2.4 -1.5,-2.4 -1.56,0.05 -3.06,0.52 -4.24,1.58 -1.15,1.02 -1.8,2.04 -2.2,3.54zm16.44 -5.12c-0.63,0 -1.29,0.41 -1.5,0.94 -0.56,1.11 0.29,2.39 1.5,2.39l9.98 0c0.63,0 1.29,-0.41 1.5,-0.93 0.55,-1.12 -0.29,-2.4 -1.5,-2.4l-9.98 0zm47.75 37.85c0,2.19 -3.34,2.21 -3.34,0l0 -6.67c0,-2.18 3.34,-2.2 3.34,0l0 6.67zm0 -16.66c0,2.18 -3.34,2.2 -3.34,0l0 -6.67c0,-2.19 3.34,-2.21 3.34,0l0 6.67zm-0.19 -16.07c0.48,2.38 -2.84,2.76 -3.23,0.83 -0.15,-0.74 -0.6,-1.43 -1.19,-1.89 -0.56,-0.44 -1.31,-0.73 -2.02,-0.73 -0.63,0 -1.29,-0.41 -1.5,-0.93 -0.55,-1.12 0.29,-2.4 1.5,-2.4 1.56,0.05 3.06,0.52 4.24,1.58 1.15,1.02 1.8,2.04 2.2,3.54zm-16.44 -5.12c0.63,0 1.29,0.41 1.5,0.94 0.56,1.11 -0.29,2.39 -1.5,2.39l-9.98 0c-0.63,0 -1.29,-0.41 -1.5,-0.93 -0.55,-1.12 0.29,-2.4 1.5,-2.4l9.98 0zm-16.29 59.14c-2.2,0 -2.2,-3.33 0,-3.33l17.64 0c2.19,0 2.2,3.33 0,3.33l-17.64 0zm-17.65 -12.39c-2.19,0 -2.19,-3.34 0,-3.34l35.29 0c2.19,0 2.19,3.34 0,3.34l-35.29 0zm0 -12.39c-2.19,0 -2.19,-3.33 0,-3.33l35.29 0c2.19,0 2.19,3.33 0,3.33l-35.29 0z"/></g><text x="0" y="115" fill="#000000" font-size="5px" font-weight="bold" font-family="'Helvetica Neue', Helvetica, Arial-Unicode, Arial, Sans-serif">Created by Hadi</text><text x="0" y="120" fill="#000000" font-size="5px" font-weight="bold" font-family="'Helvetica Neue', Helvetica, Arial-Unicode, Arial, Sans-serif">from the Noun Project</text></svg>