<?xml version="1.0" encoding="UTF-8" standalone="no"?>
<svg
   xmlns:dc="http://purl.org/dc/elements/1.1/"
   xmlns:cc="http://creativecommons.org/ns#"
   xmlns:rdf="http://www.w3.org/1999/02/22-rdf-syntax-ns#"
   xmlns:svg="http://www.w3.org/2000/svg"
   xmlns="http://www.w3.org/2000/svg"
   xmlns:sodipodi="http://sodipodi.sourceforge.net/DTD/sodipodi-0.dtd"
   xmlns:inkscape="http://www.inkscape.org/namespaces/inkscape"
   viewBox="0 0 80 80"
   version="1.1"
   x="0px"
   y="0px"
   id="svg18"
   sodipodi:docname="eye.svg"
   width="80"
   height="80"
   inkscape:version="0.92.5 (2060ec1f9f, 2020-04-08)">
  <metadata
     id="metadata24">
    <rdf:RDF>
      <cc:Work
         rdf:about="">
        <dc:format>image/svg+xml</dc:format>
        <dc:type
           rdf:resource="http://purl.org/dc/dcmitype/StillImage" />
        <dc:title>Eye, eyesign, healty, human, look, open, see</dc:title>
      </cc:Work>
    </rdf:RDF>
  </metadata>
  <defs
     id="defs22" />
  <sodipodi:namedview
     pagecolor="#ffffff"
     bordercolor="#666666"
     borderopacity="1"
     objecttolerance="10"
     gridtolerance="10"
     guidetolerance="10"
     inkscape:pageopacity="0"
     inkscape:pageshadow="2"
     inkscape:window-width="1544"
     inkscape:window-height="891"
     id="namedview20"
     showgrid="false"
     inkscape:zoom="4.17193"
     inkscape:cx="62.296171"
     inkscape:cy="36.203047"
     inkscape:window-x="0"
     inkscape:window-y="0"
     inkscape:window-maximized="0"
     inkscape:current-layer="svg18" />
  <title
     id="title2">Eye, eyesign, healty, human, look, open, see</title>
  <desc
     id="desc4">Created with Sketch.</desc>
  <g
     id="g12"
     style="fill:none;fill-rule:evenodd;stroke:none;stroke-width:0.3468602"
     transform="matrix(2.883006,0,0,2.883006,2.520922,16.935952)">
    <g
       transform="translate(-611,-104)"
       id="g10"
       style="fill:#000000;fill-rule:nonzero;stroke-width:0.3468602">
      <g
         transform="translate(611,104)"
         id="g8"
         style="stroke-width:0.3468602">
        <path
           d="m 13,0 c 5.693052,0 10.023958,2.5263618 12.868243,7.5038611 0.175676,0.3074326 0.175676,0.6848452 0,0.9922778 C 23.023958,13.473638 18.693052,16 13,16 7.306948,16 2.9760422,13.473638 0.13175686,8.4961389 c -0.17567581,-0.3074326 -0.17567581,-0.6848452 0,-0.9922778 C 2.9760422,2.5263618 7.306948,0 13,0 Z m 0,2 C 8.2190135,2 4.6434561,3.9777273 2.1627632,8 4.6434561,12.022273 8.2190135,14 13,14 17.780986,14 21.356544,12.022273 23.837237,8 21.356544,3.9777273 17.780986,2 13,2 Z m 0,2 c 0.552285,0 1,0.4477152 1,1 0,0.5522847 -0.447715,1 -1,1 -1.104569,0 -2,0.8954305 -2,2 0,1.1045695 0.895431,2 2,2 1.10457,0 2,-0.8954305 2,-2 0,-0.5522848 0.447715,-1 1,-1 0.552285,0 1,0.4477152 1,1 0,2.209139 -1.790861,4 -4,4 C 10.790861,12 9,10.209139 9,8 9,5.790861 10.790861,4 13,4 Z"
           id="path6"
           inkscape:connector-curvature="0"
           style="stroke-width:0.3468602" />
      </g>
    </g>
  </g>
</svg>
