<?xml version="1.0" encoding="UTF-8" standalone="no"?>
<svg
   xmlns:dc="http://purl.org/dc/elements/1.1/"
   xmlns:cc="http://creativecommons.org/ns#"
   xmlns:rdf="http://www.w3.org/1999/02/22-rdf-syntax-ns#"
   xmlns:svg="http://www.w3.org/2000/svg"
   xmlns="http://www.w3.org/2000/svg"
   xmlns:sodipodi="http://sodipodi.sourceforge.net/DTD/sodipodi-0.dtd"
   xmlns:inkscape="http://www.inkscape.org/namespaces/inkscape"
   viewBox="0 0 80 80"
   x="0px"
   y="0px"
   version="1.1"
   id="svg10"
   sodipodi:docname="badge.svg"
   width="80"
   height="80"
   inkscape:version="0.92.5 (2060ec1f9f, 2020-04-08)">
  <metadata
     id="metadata16">
    <rdf:RDF>
      <cc:Work
         rdf:about="">
        <dc:format>image/svg+xml</dc:format>
        <dc:type
           rdf:resource="http://purl.org/dc/dcmitype/StillImage" />
        <dc:title></dc:title>
      </cc:Work>
    </rdf:RDF>
  </metadata>
  <defs
     id="defs14" />
  <sodipodi:namedview
     pagecolor="#ffffff"
     bordercolor="#666666"
     borderopacity="1"
     objecttolerance="10"
     gridtolerance="10"
     guidetolerance="10"
     inkscape:pageopacity="0"
     inkscape:pageshadow="2"
     inkscape:window-width="1443"
     inkscape:window-height="789"
     id="namedview12"
     showgrid="false"
     inkscape:zoom="2.95"
     inkscape:cx="-30.881356"
     inkscape:cy="40"
     inkscape:window-x="0"
     inkscape:window-y="0"
     inkscape:window-maximized="0"
     inkscape:current-layer="svg10" />
  <path
     d="m 51.477864,23.538065 a 1.2824857,1.2824857 0 0 0 -1.025989,-0.860548 l -6.412429,-0.981102 -2.880462,-6.134129 a 1.2824857,1.2824857 0 0 0 -2.3213,0 l -2.880462,6.134129 -6.412429,0.981102 a 1.2824857,1.2824857 0 0 0 -0.724604,2.163553 l 4.678508,4.793932 -1.106786,6.785632 a 1.2824857,1.2824857 0 0 0 1.886537,1.328655 l 5.723734,-3.16261 5.719886,3.16261 a 1.2824857,1.2824857 0 0 0 1.886536,-1.328655 l -1.106785,-6.785632 4.678508,-4.793932 a 1.2824857,1.2824857 0 0 0 0.297537,-1.303005 z m -7.263999,4.769564 a 1.2824857,1.2824857 0 0 0 -0.347554,1.101655 l 0.786164,4.818299 -4.02957,-2.227677 a 1.2824857,1.2824857 0 0 0 -1.241447,0 l -4.02957,2.227677 0.786164,-4.818299 a 1.2824857,1.2824857 0 0 0 -0.347554,-1.101655 l -3.387044,-3.471689 4.616948,-0.706649 a 1.2824857,1.2824857 0 0 0 0.966994,-0.723322 l 2.014786,-4.279655 2.009655,4.279655 a 1.2824857,1.2824857 0 0 0 0.966994,0.723322 l 4.616948,0.706649 z"
     id="path2"
     inkscape:connector-curvature="0"
     style="stroke-width:1" />
  <path
     d="M 17.538545,76.787549 40,64.308963 62.461454,76.787549 a 1.2824857,1.2824857 0 0 0 1.905774,-1.120893 V 1.2824857 A 1.2824857,1.2824857 0 0 0 63.084742,0 H 16.915257 A 1.2824857,1.2824857 0 0 0 15.632771,1.2824857 V 75.666656 a 1.2824857,1.2824857 0 0 0 1.905774,1.120893 z M 40,61.559314 a 1.2824857,1.2824857 0 0 0 -0.623289,0.161593 l -16.049026,8.91584 V 2.5649714 H 56.672314 V 70.636747 L 40.623288,61.720907 A 1.2824857,1.2824857 0 0 0 40,61.559314 Z M 61.802256,73.486431 59.237285,72.062872 V 2.5649714 h 2.564971 z M 18.197743,2.5649714 h 2.564971 V 72.062872 l -2.564971,1.423559 z"
     id="path4"
     inkscape:connector-curvature="0"
     style="stroke-width:1" />
</svg>
