{
  "listItems": [
    {
      "text": "List Item 1 content 5"
    },
    {
      "text": "List Item 2 content 5"
    },
    {
      "text": "List Item 3 content 5"
    },
    {
      "text": "List Item 4 content 5"
    }
  ]
}
