<?xml version="1.0" encoding="UTF-8"?>
<glyph name="thorn" format="1">
  <advance width="540"/>
  <unicode hex="00FE"/>
  <outline>
    <contour>
      <point x="164" y="-10" type="curve" smooth="yes"/>
      <point x="326" y="-10"/>
      <point x="505" y="207"/>
      <point x="505" y="397" type="curve" smooth="yes"/>
      <point x="505" y="484"/>
      <point x="459" y="539"/>
      <point x="378" y="539" type="curve" smooth="yes"/>
      <point x="313" y="539"/>
      <point x="252" y="503"/>
      <point x="213" y="442" type="curve"/>
      <point x="210" y="444" type="line"/>
      <point x="337" y="829" type="line"/>
      <point x="145" y="820" type="line"/>
      <point x="137" y="790" type="line"/>
      <point x="189" y="790"/>
      <point x="213" y="779"/>
      <point x="213" y="755" type="curve" smooth="yes"/>
      <point x="213" y="743"/>
      <point x="205" y="715"/>
      <point x="198" y="691" type="curve" smooth="yes"/>
      <point x="-59" y="-164" type="line" smooth="yes"/>
      <point x="-69" y="-199"/>
      <point x="-91" y="-210"/>
      <point x="-147" y="-210" type="curve"/>
      <point x="-153" y="-250" type="line"/>
      <point x="130" y="-250" type="line"/>
      <point x="136" y="-210" type="line"/>
      <point x="67" y="-209"/>
      <point x="43" y="-197"/>
      <point x="43" y="-164" type="curve" smooth="yes"/>
      <point x="43" y="-154"/>
      <point x="46" y="-141"/>
      <point x="51" y="-121" type="curve" smooth="yes"/>
      <point x="88" y="24" type="line"/>
      <point x="91" y="25" type="line"/>
      <point x="109" y="1"/>
      <point x="133" y="-10"/>
    </contour>
    <contour>
      <point x="180" y="41" type="curve" smooth="yes"/>
      <point x="146" y="41"/>
      <point x="129" y="69"/>
      <point x="129" y="123" type="curve" smooth="yes"/>
      <point x="129" y="270"/>
      <point x="261" y="486"/>
      <point x="351" y="486" type="curve" smooth="yes"/>
      <point x="382" y="486"/>
      <point x="406" y="451"/>
      <point x="406" y="405" type="curve" smooth="yes"/>
      <point x="406" y="256"/>
      <point x="273" y="41"/>
    </contour>
  </outline>
</glyph>
