{
  "total_rows": 5,
  "offset": 0,
  "rows": [
    {
      "id": "6b37e7affbb12c0ed12c961f2800074a",
      "key": "6b37e7affbb12c0ed12c961f2800074a",
      "value": {
        "rev": "1-4123ce7e20bb449419d1fcf62b18c5b3"
      },
      "doc": {
        "_id": "6b37e7affbb12c0ed12c961f2800074a",
        "_rev": "1-4123ce7e20bb449419d1fcf62b18c5b3",
        "name": "My task",
        "status": "Draft",
        "owner": "Ciro DE CARO"
      }
    },
    {
      "id": "6b37e7affbb12c0ed12c961f280016af",
      "key": "6b37e7affbb12c0ed12c961f280016af",
      "value": {
        "rev": "1-4123ce7e20bb449419d1fcf62b18c5b3"
      },
      "doc": {
        "_id": "6b37e7affbb12c0ed12c961f280016af",
        "_rev": "1-4123ce7e20bb449419d1fcf62b18c5b3",
        "name": "My task",
        "status": "Draft",
        "owner": "Ciro DE CARO"
      }
    },
    {
      "id": "6b37e7affbb12c0ed12c961f28002412",
      "key": "6b37e7affbb12c0ed12c961f28002412",
      "value": {
        "rev": "1-4123ce7e20bb449419d1fcf62b18c5b3"
      },
      "doc": {
        "_id": "6b37e7affbb12c0ed12c961f28002412",
        "_rev": "1-4123ce7e20bb449419d1fcf62b18c5b3",
        "name": "My task",
        "status": "Draft",
        "owner": "Ciro DE CARO"
      }
    },
    {
      "id": "6b37e7affbb12c0ed12c961f28002422",
      "key": "6b37e7affbb12c0ed12c961f28002422",
      "value": {
        "rev": "1-4123ce7e20bb449419d1fcf62b18c5b3"
      },
      "doc": {
        "_id": "6b37e7affbb12c0ed12c961f28002422",
        "_rev": "1-4123ce7e20bb449419d1fcf62b18c5b3",
        "name": "My task",
        "status": "Draft",
        "owner": "Ciro DE CARO"
      }
    },
    {
      "id": "6b37e7affbb12c0ed12c961f280029be",
      "key": "6b37e7affbb12c0ed12c961f280029be",
      "value": {
        "rev": "1-4123ce7e20bb449419d1fcf62b18c5b3"
      },
      "doc": {
        "_id": "6b37e7affbb12c0ed12c961f280029be",
        "_rev": "1-4123ce7e20bb449419d1fcf62b18c5b3",
        "name": "My task",
        "status": "Draft",
        "owner": "Ciro DE CARO"
      }
    }
  ]
}
