[
  {
    "_id": "task-id-1",
    "_rev": "2-c607de85698565837340ee5fd961994c",
    "title": "Task 1",
    "description": "",
    "status": "Draft",
    "team": {
      "Ciro": "Owner"
    }
  },
  {
    "_id": "task-id-2",
    "_rev": "2-ec7b64ae4aeba922c65554525264d71b",
    "title": "Task 2",
    "description": "",
    "status": "Draft",
    "team": {
      "Ciro": "Owner"
    }
  },
  {
    "_id": "task-id-3",
    "_rev": "2-4161301107409c71eddb28ce0b7b0be1",
    "title": "Task 3",
    "description": "",
    "status": "Draft",
    "team": {
      "Ciro": "Owner"
    }
  },
  {
    "_id": "task-id-4",
    "_rev": "2-e11778adce0b281c6256e7480697acc3",
    "title": "Task 4",
    "description": "",
    "status": "Draft",
    "team": {
      "Ciro": "Owner"
    }
  },
  {
    "_id": "task-id-5",
    "_rev": "2-3996b0a1f93b22003241f25f864c369c",
    "title": "Task 5",
    "description": "",
    "status": "Draft",
    "team": {
      "Ciro": "Owner"
    }
  },
  {
    "_id": "task-id-6",
    "_rev": "2-251c502d209c26e45e7396e04d2056ee",
    "title": "Task 6",
    "description": "",
    "status": "Draft",
    "team": {
      "Ciro": "Owner"
    }
  },
  {
    "_id": "task-id-7",
    "_rev": "2-fc32d442147d3927a01854d3252a8c51",
    "title": "Task 7",
    "description": "",
    "status": "Draft",
    "team": {
      "Ciro": "Owner"
    }
  },
  {
    "_id": "task-id-8",
    "_rev": "2-64eceee124f90e8d2ec8643f44af6b7d",
    "title": "Task 8",
    "description": "",
    "status": "Draft",
    "team": {
      "Ciro": "Owner"
    }
  },
  {
    "_id": "task-id-9",
    "_rev": "2-e44f400f88fbe71b208c388583bd83b7",
    "title": "Task 9",
    "description": "",
    "status": "Draft",
    "team": {
      "Ciro": "Owner"
    }
  }
]