{
	"info": {
		"_postman_id": "54514ede-6a4c-4cd0-b504-44a5a704c3d7",
		"name": "civil-add",
		"schema": "https://schema.getpostman.com/json/collection/v2.1.0/collection.json"
	},
	"item": [
		{
			"name": "service",
			"item": [
				{
					"name": "tasks",
					"item": [
						{
							"name": "Create task",
							"request": {
								"method": "POST",
								"header": [
									{
										"key": "Content-Type",
										"name": "Content-Type",
										"value": "application/json",
										"type": "text"
									}
								],
								"body": {
									"mode": "raw",
									"raw": "{\n\t\"title\": \"My new task\",\n\t\"body\": \"New task description\"\n}",
									"options": {
										"raw": {
											"language": "json"
										}
									}
								},
								"url": {
									"raw": "{{scheme}}://{{civil-add_host}}:{{civil-add_port}}/{{civil-add_back_prefix}}/tasks",
									"protocol": "{{scheme}}",
									"host": [
										"{{civil-add_host}}"
									],
									"port": "{{civil-add_port}}",
									"path": [
										"{{civil-add_back_prefix}}",
										"tasks"
									]
								}
							},
							"response": []
						},
						{
							"name": "Read task list",
							"request": {
								"method": "GET",
								"header": [],
								"url": {
									"raw": "{{scheme}}://{{civil-add_host}}:{{civil-add_port}}/{{civil-add_back_prefix}}/tasks",
									"protocol": "{{scheme}}",
									"host": [
										"{{civil-add_host}}"
									],
									"port": "{{civil-add_port}}",
									"path": [
										"{{civil-add_back_prefix}}",
										"tasks"
									],
									"query": [
										{
											"key": "page",
											"value": "2",
											"disabled": true
										},
										{
											"key": "page_size",
											"value": "3",
											"disabled": true
										}
									]
								}
							},
							"response": []
						},
						{
							"name": "Read task",
							"request": {
								"method": "GET",
								"header": [],
								"url": {
									"raw": "{{scheme}}://{{civil-add_host}}:{{civil-add_port}}/{{civil-add_back_prefix}}/tasks/1",
									"protocol": "{{scheme}}",
									"host": [
										"{{civil-add_host}}"
									],
									"port": "{{civil-add_port}}",
									"path": [
										"{{civil-add_back_prefix}}",
										"tasks",
										"1"
									]
								}
							},
							"response": []
						},
						{
							"name": "Update task",
							"request": {
								"method": "PUT",
								"header": [
									{
										"key": "Content-Type",
										"name": "Content-Type",
										"value": "application/json",
										"type": "text"
									}
								],
								"body": {
									"mode": "raw",
									"raw": "{\n\t\"id\": 1,\n\t\"title\": \"My updated task\",\n\t\"body\": \"Task description\"\n}",
									"options": {
										"raw": {
											"language": "json"
										}
									}
								},
								"url": {
									"raw": "{{scheme}}://{{civil-add_host}}:{{civil-add_port}}/{{civil-add_back_prefix}}/tasks/1",
									"protocol": "{{scheme}}",
									"host": [
										"{{civil-add_host}}"
									],
									"port": "{{civil-add_port}}",
									"path": [
										"{{civil-add_back_prefix}}",
										"tasks",
										"1"
									]
								}
							},
							"response": []
						},
						{
							"name": "Delete task",
							"request": {
								"method": "DELETE",
								"header": [],
								"url": {
									"raw": "{{scheme}}://{{civil-add_host}}:{{civil-add_port}}/{{civil-add_back_prefix}}/tasks/1",
									"protocol": "{{scheme}}",
									"host": [
										"{{civil-add_host}}"
									],
									"port": "{{civil-add_port}}",
									"path": [
										"{{civil-add_back_prefix}}",
										"tasks",
										"1"
									]
								}
							},
							"response": []
						}
					],
					"protocolProfileBehavior": {},
					"_postman_isSubFolder": true
				},
				{
					"name": "users",
					"item": [
						{
							"name": "Read user list",
							"protocolProfileBehavior": {
								"disableBodyPruning": true
							},
							"request": {
								"method": "GET",
								"header": [
									{
										"key": "Content-Type",
										"name": "Content-Type",
										"type": "text",
										"value": "application/json"
									}
								],
								"body": {
									"mode": "raw",
									"raw": "",
									"options": {
										"raw": {
											"language": "json"
										}
									}
								},
								"url": {
									"raw": "{{scheme}}://{{civil-add_host}}:{{civil-add_port}}/{{civil-add_back_prefix}}/users",
									"protocol": "{{scheme}}",
									"host": [
										"{{civil-add_host}}"
									],
									"port": "{{civil-add_port}}",
									"path": [
										"{{civil-add_back_prefix}}",
										"users"
									]
								}
							},
							"response": []
						}
					],
					"protocolProfileBehavior": {},
					"_postman_isSubFolder": true
				},
				{
					"name": "authentication",
					"item": [
						{
							"name": "Login",
							"event": [
								{
									"listen": "test",
									"script": {
										"id": "2a30faea-1886-4d16-b3cc-404ddaa18f2f",
										"exec": [
											""
										],
										"type": "text/javascript"
									}
								}
							],
							"protocolProfileBehavior": {
								"tlsPreferServerCiphers": false
							},
							"request": {
								"auth": {
									"type": "oauth2",
									"oauth2": [
										{
											"key": "addTokenTo",
											"value": "queryParams",
											"type": "string"
										},
										{
											"key": "accessToken",
											"value": "",
											"type": "string"
										},
										{
											"key": "tokenType",
											"value": "bearer",
											"type": "string"
										}
									]
								},
								"method": "GET",
								"header": [],
								"url": {
									"raw": "{{scheme}}://{{civil-add_host}}:{{civil-add_port}}/{{civil-add_back_prefix}}/auth/login",
									"protocol": "{{scheme}}",
									"host": [
										"{{civil-add_host}}"
									],
									"port": "{{civil-add_port}}",
									"path": [
										"{{civil-add_back_prefix}}",
										"auth",
										"login"
									]
								}
							},
							"response": []
						},
						{
							"name": "Logout",
							"request": {
								"method": "GET",
								"header": [],
								"url": {
									"raw": "{{scheme}}://{{civil-add_host}}:{{civil-add_port}}/{{civil-add_back_prefix}}/auth/logout",
									"protocol": "{{scheme}}",
									"host": [
										"{{civil-add_host}}"
									],
									"port": "{{civil-add_port}}",
									"path": [
										"{{civil-add_back_prefix}}",
										"auth",
										"logout"
									]
								}
							},
							"response": []
						},
						{
							"name": "Session details",
							"request": {
								"method": "GET",
								"header": [],
								"url": {
									"raw": "{{scheme}}://{{civil-add_host}}:{{civil-add_port}}/{{civil-add_back_prefix}}/auth/details",
									"protocol": "{{scheme}}",
									"host": [
										"{{civil-add_host}}"
									],
									"port": "{{civil-add_port}}",
									"path": [
										"{{civil-add_back_prefix}}",
										"auth",
										"details"
									]
								}
							},
							"response": []
						}
					],
					"event": [
						{
							"listen": "prerequest",
							"script": {
								"id": "aa964451-dc56-4092-8ea5-2e8301e61513",
								"type": "text/javascript",
								"exec": [
									""
								]
							}
						},
						{
							"listen": "test",
							"script": {
								"id": "521fd537-f4d0-4726-b2a1-e755a393f99c",
								"type": "text/javascript",
								"exec": [
									""
								]
							}
						}
					],
					"protocolProfileBehavior": {},
					"_postman_isSubFolder": true
				},
				{
					"name": "test",
					"request": {
						"method": "GET",
						"header": [],
						"url": {
							"raw": "{{scheme}}://{{civil-add_host}}:{{civil-add_port}}/{{civil-add_back_prefix}}/",
							"protocol": "{{scheme}}",
							"host": [
								"{{civil-add_host}}"
							],
							"port": "{{civil-add_port}}",
							"path": [
								"{{civil-add_back_prefix}}",
								""
							]
						}
					},
					"response": []
				}
			],
			"event": [
				{
					"listen": "prerequest",
					"script": {
						"id": "5f1efc78-46a2-418d-890a-65afd82ca860",
						"type": "text/javascript",
						"exec": [
							""
						]
					}
				},
				{
					"listen": "test",
					"script": {
						"id": "a323f71c-ac6e-48ac-9fb3-5cd3f927b5b4",
						"type": "text/javascript",
						"exec": [
							""
						]
					}
				}
			],
			"protocolProfileBehavior": {}
		},
		{
			"name": "extra",
			"item": [
				{
					"name": "Keycloak",
					"item": [
						{
							"name": "Get security endpoints",
							"request": {
								"method": "GET",
								"header": [],
								"url": {
									"raw": "{{scheme}}://{{keycloak_host}}:{{keycloak_port}}/auth/realms/civil-add/.well-known/openid-configuration",
									"protocol": "{{scheme}}",
									"host": [
										"{{keycloak_host}}"
									],
									"port": "{{keycloak_port}}",
									"path": [
										"auth",
										"realms",
										"civil-add",
										".well-known",
										"openid-configuration"
									]
								}
							},
							"response": []
						},
						{
							"name": "User info",
							"request": {
								"auth": {
									"type": "oauth2",
									"oauth2": [
										{
											"key": "addTokenTo",
											"value": "queryParams",
											"type": "string"
										},
										{
											"key": "accessToken",
											"value": "",
											"type": "string"
										},
										{
											"key": "tokenType",
											"value": "bearer",
											"type": "string"
										}
									]
								},
								"method": "GET",
								"header": [
									{
										"warning": "This is a duplicate header and will be overridden by the Authorization header generated by Postman.",
										"key": "Authorization",
										"value": "bearer eyJhbGciOiJSUzI1NiIsInR5cCIgOiAiSldUIiwia2lkIiA6ICJZcGRqYXZwT29xMThyaDl6UDYzcXJ2SXAtWjlubFJWWlRMbTZEenNxZmRVIn0.eyJleHAiOjE1OTE1MTU2MzQsImlhdCI6MTU5MTUxNTMzNCwiYXV0aF90aW1lIjoxNTkxNTE1MzI3LCJqdGkiOiIzYmViNGViNi1jOTMyLTQ0ZmQtYTlmMC1lZDkxYjlhNmY5NDgiLCJpc3MiOiJodHRwczovL29hdXRoLm9wZW4udG9vbC1hZGQuZGV2LmxvY2FsL2F1dGgvcmVhbG1zL2NpdmlsLWFkZCIsImF1ZCI6ImFjY291bnQiLCJzdWIiOiIzOTY4ZGY3Ny1jYTA3LTRkZGEtYjk0Yi04YjUzODJjYWUyNDIiLCJ0eXAiOiJCZWFyZXIiLCJhenAiOiJjaXZpbC1hZGRfYmFjayIsInNlc3Npb25fc3RhdGUiOiJjN2EzNmM1ZS1kY2NkLTQ2MjMtYTY1NC03YTFhNWY1M2NmMjIiLCJhY3IiOiIwIiwicmVhbG1fYWNjZXNzIjp7InJvbGVzIjpbIm9mZmxpbmVfYWNjZXNzIiwidW1hX2F1dGhvcml6YXRpb24iXX0sInJlc291cmNlX2FjY2VzcyI6eyJhY2NvdW50Ijp7InJvbGVzIjpbIm1hbmFnZS1hY2NvdW50IiwibWFuYWdlLWFjY291bnQtbGlua3MiLCJ2aWV3LXByb2ZpbGUiXX19LCJzY29wZSI6InByb2ZpbGUgZW1haWwiLCJlbWFpbF92ZXJpZmllZCI6dHJ1ZSwidXNlcl9uYW1lIjoicHljIiwicHJlZmVycmVkX3VzZXJuYW1lIjoicHljIn0.yxRk72SgrctltMRcl3-Rk31DPifWJc03MEPVuYrhex6VjKpj377oOyLGLpMKhZjm6OAhBbe26S4NVhuQCFo-L0WnUHp8vl9qnGedKLvOu2KAZ5mP3X-KBOCvdrgqJB_PqndHU3ZVzPgoW5iQg-h6TDdFgK-CfNEAN_CAYY2tjdtv-Kq99ZoJWSEzPra77qmeMi4CRUwrdM3kXjO2-3KEF55PH7Q8t8_psJNAtHAvrHuSwJAYBcGy5yWVZkfLvqYFVPy80BeVFaGq5711ylWOT_I99gzJjKtwzCQk0KEWS2gKb0KshtzMaid-ZPP8pyOmxGc0Zx5rH2kZhcgxJO1a5Q",
										"type": "text"
									}
								],
								"url": {
									"raw": "{{scheme}}://{{keycloak_host}}:{{keycloak_port}}/auth/realms/civil-add/protocol/openid-connect/userinfo",
									"protocol": "{{scheme}}",
									"host": [
										"{{keycloak_host}}"
									],
									"port": "{{keycloak_port}}",
									"path": [
										"auth",
										"realms",
										"civil-add",
										"protocol",
										"openid-connect",
										"userinfo"
									],
									"query": [
										{
											"key": "access_token",
											"value": "eyJhbGciOiJSUzI1NiIsInR5cCIgOiAiSldUIiwia2lkIiA6ICJZcGRqYXZwT29xMThyaDl6UDYzcXJ2SXAtWjlubFJWWlRMbTZEenNxZmRVIn0.eyJleHAiOjE1OTE1MTU2MzQsImlhdCI6MTU5MTUxNTMzNCwiYXV0aF90aW1lIjoxNTkxNTE1MzI3LCJqdGkiOiIzYmViNGViNi1jOTMyLTQ0ZmQtYTlmMC1lZDkxYjlhNmY5NDgiLCJpc3MiOiJodHRwczovL29hdXRoLm9wZW4udG9vbC1hZGQuZGV2LmxvY2FsL2F1dGgvcmVhbG1zL2NpdmlsLWFkZCIsImF1ZCI6ImFjY291bnQiLCJzdWIiOiIzOTY4ZGY3Ny1jYTA3LTRkZGEtYjk0Yi04YjUzODJjYWUyNDIiLCJ0eXAiOiJCZWFyZXIiLCJhenAiOiJjaXZpbC1hZGRfYmFjayIsInNlc3Npb25fc3RhdGUiOiJjN2EzNmM1ZS1kY2NkLTQ2MjMtYTY1NC03YTFhNWY1M2NmMjIiLCJhY3IiOiIwIiwicmVhbG1fYWNjZXNzIjp7InJvbGVzIjpbIm9mZmxpbmVfYWNjZXNzIiwidW1hX2F1dGhvcml6YXRpb24iXX0sInJlc291cmNlX2FjY2VzcyI6eyJhY2NvdW50Ijp7InJvbGVzIjpbIm1hbmFnZS1hY2NvdW50IiwibWFuYWdlLWFjY291bnQtbGlua3MiLCJ2aWV3LXByb2ZpbGUiXX19LCJzY29wZSI6InByb2ZpbGUgZW1haWwiLCJlbWFpbF92ZXJpZmllZCI6dHJ1ZSwidXNlcl9uYW1lIjoicHljIiwicHJlZmVycmVkX3VzZXJuYW1lIjoicHljIn0.yxRk72SgrctltMRcl3-Rk31DPifWJc03MEPVuYrhex6VjKpj377oOyLGLpMKhZjm6OAhBbe26S4NVhuQCFo-L0WnUHp8vl9qnGedKLvOu2KAZ5mP3X-KBOCvdrgqJB_PqndHU3ZVzPgoW5iQg-h6TDdFgK-CfNEAN_CAYY2tjdtv-Kq99ZoJWSEzPra77qmeMi4CRUwrdM3kXjO2-3KEF55PH7Q8t8_psJNAtHAvrHuSwJAYBcGy5yWVZkfLvqYFVPy80BeVFaGq5711ylWOT_I99gzJjKtwzCQk0KEWS2gKb0KshtzMaid-ZPP8pyOmxGc0Zx5rH2kZhcgxJO1a5Q",
											"disabled": true
										}
									]
								}
							},
							"response": []
						},
						{
							"name": "{{scheme}}://{{keycloak_host}}:{{keycloak_port}}/auth/realms/civil-add/protocol/openid-connect/userinfo",
							"request": {
								"method": "GET",
								"header": [
									{
										"key": "Authorization",
										"value": "",
										"type": "text",
										"disabled": true
									}
								],
								"url": {
									"raw": "{{scheme}}://{{keycloak_host}}:{{keycloak_port}}/auth/realms/civil-add/protocol/openid-connect/userinfo",
									"protocol": "{{scheme}}",
									"host": [
										"{{keycloak_host}}"
									],
									"port": "{{keycloak_port}}",
									"path": [
										"auth",
										"realms",
										"civil-add",
										"protocol",
										"openid-connect",
										"userinfo"
									],
									"query": [
										{
											"key": "Authorization",
											"value": "Bearer  eyJhbGciOiJSUzI1NiIsInR5cCIgOiAiSldUIiwia2lkIiA6ICJiYkZQUU56YjY5aUtpNnlscEw5LVMyWFBOQ3lMbGlISDVXcmdhSnpMVFg4In0.eyJleHAiOjE1OTU4Nzc2NzUsImlhdCI6MTU5NTg3NzM3NSwiYXV0aF90aW1lIjoxNTk1ODc2MzIzLCJqdGkiOiI0MWM4YzM1Zi05YzJmLTRmOTctYTVhYS1jOWY0MWYxZjhiMWIiLCJpc3MiOiJodHRwczovL29hdXRoLm9wZW4udG9vbC1hZGQuZGV2LmxvY2FsL2F1dGgvcmVhbG1zL2NpdmlsLWFkZCIsImF1ZCI6ImFjY291bnQiLCJzdWIiOiJkNWI3ZjlkOS00OTk1LTQyMTQtOWZmZi0zOGFmM2VkYWU2NjYiLCJ0eXAiOiJCZWFyZXIiLCJhenAiOiJjaXZpbC1hZGRfYmFjayIsInNlc3Npb25fc3RhdGUiOiIxZTJhZWM1MC1lYTcwLTQ4NzYtOTdhZC0xMDczZWY2YTEyZWQiLCJhY3IiOiIwIiwicmVhbG1fYWNjZXNzIjp7InJvbGVzIjpbIm9mZmxpbmVfYWNjZXNzIiwidW1hX2F1dGhvcml6YXRpb24iXX0sInJlc291cmNlX2FjY2VzcyI6eyJhY2NvdW50Ijp7InJvbGVzIjpbIm1hbmFnZS1hY2NvdW50IiwibWFuYWdlLWFjY291bnQtbGlua3MiLCJ2aWV3LXByb2ZpbGUiXX19LCJzY29wZSI6InByb2ZpbGUgZW1haWwiLCJlbWFpbF92ZXJpZmllZCI6dHJ1ZSwidXNlcl9uYW1lIjoidGFfdXNlciIsIm5hbWUiOiJ0YSB1c2VyIiwicHJlZmVycmVkX3VzZXJuYW1lIjoidGFfdXNlciIsImdpdmVuX25hbWUiOiJ0YSIsImZhbWlseV9uYW1lIjoidXNlciIsImVtYWlsIjoiZW1haWxAdG9vbC1hZGQuY29tIn0.dR-NTRNDF9WiaQ0WiqCbVcSIoD7l6dRWXVacdCRqso_HU_05bRjrOFcfkzJB91dEb9IyAWdsU_yZjzC91agxGm68Oy69aG47ZD_w7kXg35dcxb8b_zTWuoMWEZiE5czouAOE8kK5I01P6Kze2nGm5cyMk92ywznRt7n0-5o8qmeE8VkpAroqcnr77R5_PM8eaAd-67HVKeZtohCILKL8xjDDLTnylptWDzcZOcARtZHlVNRWLmzm57m5-ocurQtGIe4XGPXH4lWQQrzxRLEIyRqM4oX8kRmGi5o1RrBQ9o2FFyggi-BpC3TuWGulgYONlD6kdLiUFMmpriNW3lrdIw",
											"disabled": true
										}
									]
								}
							},
							"response": []
						}
					],
					"protocolProfileBehavior": {},
					"_postman_isSubFolder": true
				}
			],
			"protocolProfileBehavior": {}
		}
	],
	"event": [
		{
			"listen": "prerequest",
			"script": {
				"id": "e464ecc5-71c3-4e2d-a24e-e7a07de13830",
				"type": "text/javascript",
				"exec": [
					""
				]
			}
		},
		{
			"listen": "test",
			"script": {
				"id": "7a757bda-2e08-49bf-92be-d8881da5d96e",
				"type": "text/javascript",
				"exec": [
					""
				]
			}
		}
	],
	"protocolProfileBehavior": {}
}