<?xml version="1.0" encoding="utf-8"?>
<!-- Generator: Adobe Illustrator 19.0.0, SVG Export Plug-In . SVG Version: 6.00 Build 0)  -->
<svg version="1.1" id="Layer_1" xmlns="http://www.w3.org/2000/svg" xmlns:xlink="http://www.w3.org/1999/xlink" x="0px" y="0px"
	 viewBox="0 0 50 50" style="enable-background:new 0 0 50 50;" xml:space="preserve">
<style type="text/css">
	.st0{fill:#FFFFFF;}
</style>
<g id="XMLID_2_">
	<path id="XMLID_4_" class="st0" d="M15.9,38.3V27.2H6.5l0,11.1H0.5V11.7h5.9v10.2h9.4l0-10.2h6v26.7H15.9z"/>
	<path id="XMLID_6_" class="st0" d="M49.5,11.7l-10,26.7h-5.1l-10-26.7h6.1l6.4,17.4l6.4-17.4H49.5z"/>
</g>
</svg>
