<?xml version="1.0" encoding="utf-8"?>
<!-- Generator: Adobe Illustrator 21.0.0, SVG Export Plug-In . SVG Version: 6.00 Build 0)  -->
<svg version="1.1" id="Capa_1" xmlns="http://www.w3.org/2000/svg" xmlns:xlink="http://www.w3.org/1999/xlink" x="0px" y="0px"
	 viewBox="0 0 42 42" style="enable-background:new 0 0 42 42;" xml:space="preserve">
<style type="text/css">
	.st0{fill:#4D4D4D;}
</style>
<path class="st0" d="M21.8,35.8L41.5,7.3c0.2-0.3,0.2-0.7,0.1-1C41.4,6,41,5.8,40.7,5.8H1.3C1,5.8,0.6,6,0.5,6.3
	C0.4,6.4,0.4,6.6,0.4,6.7c0,0.2,0.1,0.4,0.2,0.6l19.7,28.5c0.2,0.3,0.5,0.4,0.8,0.4C21.3,36.2,21.6,36.1,21.8,35.8z"/>
</svg>
