HMAIN,HNAME
10734,รพท.สมุทรสาคร
10753,"บางพลี,รพช."
11476,"กองพยาบาลโรงเรียนเตรียมทหาร,รพ."
11652,สถานพยาบาลเพชรเกษมบางแค
11671,บางปะกอกโพลีคลินิก ราษฎร์บูรณะ
11678,"ยันฮี(บจ รพ.ยันฮี.),รพ."
11696,"พร้อมมิตร ,รพ."
14348,สถานพยาบาลบางปะกอก 5
14569,"นครธน   ,รพ."
14581,"สุขสวัสดิ์โพลีคลีนิก  ,รพ."
15178,สหคลินิกเกษมราษฎร์ สาขาทุ่งสองห้อง
15183,คลินิกเวชกรรมพุทธบูชา (เดิม)
15192,คลินิกเวชกรรมบางไผ่-กระโจมทอง (เดิม)
15203,สหคลินิกเกษมราษฎร์ สาขามหาวิทยาลัยธุรกิจบัณฑิตย์
17079,คลินิทันตแพทย์สุธาสินี
21332,สหคลินิกเวชกรรมสุทธาราม
21540,สหคลินิกกล้วยน้ำไท สาขาวงเวียน 22
21664,สหคลินิกกล้วยน้ำไท สาขาตลาดยิ่งเจริญ (เดิม)
21839,คลินิกเวชกรรมเกษมราษฎร์ สาขาหลักสี่
22224,คลีโอคลินิกเวชกรรม
23531,สำโรงคลินิกทันตแพทย์
23534,คลินิกบุญทรงทันตแพทย์
23720,คลินิกสมเกียรติทันตแพทย์
23818,ศูนย์สุขภาพชุมชนซอยสวนเงิน
24314,เด็นทัลวันคลินิกทันตกรรม
28001,คลินิกทันตกรรมเสนา
28002,รัตน์คลินิกทันตแพทย์
28004,วิภาพร  คลินิกทันตกรรม 3
28023,นูเด้นท์คลินิกทันตกรรม
28896,โปรแล็บสหคลินิก
28898,สุขผลินคลินิกเวชกรรม
29201,เจริญกรุง 56 คลินิกเวชกรรม
29202,จันทร์16 คลินิกเวชกรรม
29203,บางจากคลินิกเวชกรรม
29204,คลินิกเวชกรรมแพทย์ศรีนครินทร์ สาขาประเวศ
29205,เจริญกรุง 91 คลินิกเวชกรรม
29206,คลินิกเวชกรรมแพทย์ศรีนครินทร์ สาขาพัฒนาการ
39335,ทันตกรรมไบร์ทสไมล์
40053,สำนักงานบริการเทคโนโลยีสาธารณสุข และสิ่งแวดล้อม มหาวิทยาลัยมหิดล 
40841,เอ็น เฮลท์ คลินิกเฉพาะทางด้านเวชกรรมพยาธิวิทยาการวิภาค
40843,คลินิกเวชกรรม สวท ดินแดง
40906,ศูนย์บริการสาธารณสุข โรงพยาบาลทันตกรรม คณะทันตแพทย์ศาสตร์ มหาวิทยาลัยศรีนครินทรวิโรฒ
40986,มิตรไมตรีสหคลินิก สาขาลาซาล
40987,บางกอกใหญ่คลินิกเวชกรรม
41063,คลินิกเวชกรรมท่าพระ
41064,คลินิกเวชกรรมตลิ่งชัน
41065,คลินิกเวชกรรมฉัตรลดา
41068,สุขะวิทยาสหคลินิก
41073,มิตรไมตรีสหคลินิก สาขาแก้วเงินทอง
41074,ธนารมย์สหคลินิก(ราชพฤกษ์-สวนผัก)
41088,คลินิกทันตกรรมยิ้มสุขใจ
41105,โปรเซ็นทรัลแล็บ คลินิกเทคนิคการแพทย์ 
41167,คลินิกทันตกรรมเดนทัลเดอแบร์
41324,คลินิกทันตกรรมมูลนิธิทันตนวัตกรรมในพระบรมราชูถัมภ์
41367,โรงพยาบาลอรวรรณโรงพยาบาลทั่วไปขนาดเล็ก
41371,คลินิกเวชกรรม สจล.
41373,โรงพยาบาลรามาจักรีนฤบดินทร์
41395,คลินิกทันตกรรมสตอรี่เดนทัลโฮม
41402,เอ็มดีสหคลินิก
41407,มายเด้นท์คลินิกทันตกรรม สาขาตรงข้ามซีคอน
41432,คลินิกทันตกรรมสไมล์เซอร์เคิล
41527,คลินิกเวชกรรมชุมชน
41529,คลินิกวัธนีทันตแพทย์
41532,มิตรไมตรีคลินิกเวชกรรม (อุดมสุข)
41560,คลินิกทันตแพทย์บุญชู
55555,ศูนย์ธรรมชาติบำบัดสไมล์เฮลธ
66666,วิทยาลัยพยาบาลเกื้อการุณย์
99991,ศสช.โรงพยาบาลกุยบุรี
99993,ศสช.ตำบลวัดเพลง
99994,สำนักตรวจสอบการชดเชยและคุณภาพบริการ
99995,หน่วยรับลงทะเบียนเคลื่อนที่
99999,บันทึกข้อมูลที่ สปสช.
D0037,พรพงษ์เภสัช
D0038,ร้านยามหานคร 
D0039,ร้านศาลายา
D0040,สถานปฏิบัติการเภสัชกรรมชุมชน (จุฬาฯ โอสถศาลา)
D0041,บ้านยาหนึ่ง
D0042,ร้านจตุธรรมเภสัช 
D0043,ร้านกนก ฟาร์มา เซน (ศรีวรา)
D0044,ร้านกนก ฟาร์มา เซน (ประชาอุทิศ)
D0045,ร้านนนทวีเภสัช
D0046,ร้านขายยาเซฟดรัก เซ็นเตอร์
D0408,ร้าน ชัยยะเวช
D0412,อุ่นใจเภสัช
D0420,ร้าน ศิรินทร์ ฟาร์มาซี
HP001,กองออกกำลังกายเพื่อสขภาพ  กรมอนามัย
HP003,กองเวชกรรมป้องกัน กรมแพทย์ทหารเรือ 
HP004,มหาวิทยาลัย ศรีนครินทรวิโรฒ
HP015,กองพันเสนารักษ์ที่ 13 (กองพลทหารปืนใหญ่ต่อสู้อากาศยาน)
40889,คณะกายภาพบำบัด และวิทยาศาสตร์การเคลื่อนไหวประยุกต์ ม.มหิดล
HP023,สมาคมเภสัชกรรมชุมชน
PJ001,หน่วยให้คำปรึกษาและพัฒนาศักยภาพมนุษย์
PJ002,สถาบันวิจัยโภชนา มหาวิทยาลัยมหิดล
PJ003,โรงพยาบาลกุนนทรีสุทธารามวิทยาคม
PJ004,โรงเรียนแม่พระฟาติมา
PJ005,ภาควิชาจิตวิทยาการศึกษาและการแนะแนวมหาวิทยาลัยเกษตรศาสตร์
PJ006,ศูนย์ส่งเสริมสุขภาพและโภชนาการ
PJ007,โรงเรียนสตรีวัดมหาพฤฒาราม
PJ008,สมาคมฟ้าสีรุ้งแห่งประเทศไทย
PJ009,โรงเรียนเพี้ยนพินอนุสรณ์
PJ010,โรงเรียนพณิชยการสยาม
PJ011,โครงการศูนย์ให้คำปรึกษาและพัฒนาศักยภาพมนุษย์ ม.ศรีนครินทรวิโรฒ
PJ012,โรงเรียนพระโขนงพิทยาลัย
PJ013,โรงเรียนจันทร์ประดิษฐารามวิทยาคม
PJ014,คณะสาธารณสุขศาสตร์  มหาวิทยาลัยมหิดล
PJ015,การทางพิเศษแห่งประเทศไทย
