// Gmsh file for foil  
 
foil_Points[] = {} ; 
foil_Splines[] = {} ; 

// Points ..............................    
p = newp ; 
Point(p) = {0.61,-0.000122,0,0.002} ; 
foil_Points[0] = p ; 
p = newp ; 
Point(p) = {0.60695,0.000427,0,0.002} ; 
foil_Points[1] = p ; 
p = newp ; 
Point(p) = {0.60085,0.001586,0,0.002} ; 
foil_Points[2] = p ; 
p = newp ; 
Point(p) = {0.5917,0.003233,0,0.002} ; 
foil_Points[3] = p ; 
p = newp ; 
Point(p) = {0.5734,0.006222,0,0.002} ; 
foil_Points[4] = p ; 
p = newp ; 
Point(p) = {0.549,0.009821,0,0.002} ; 
foil_Points[5] = p ; 
p = newp ; 
Point(p) = {0.5185,0.013542,0,0.002} ; 
foil_Points[6] = p ; 
p = newp ; 
Point(p) = {0.488,0.016714,0,0.002} ; 
foil_Points[7] = p ; 
p = newp ; 
Point(p) = {0.4575,0.019337,0,0.002} ; 
foil_Points[8] = p ; 
p = newp ; 
Point(p) = {0.427,0.021533,0,0.002} ; 
foil_Points[9] = p ; 
p = newp ; 
Point(p) = {0.3965,0.023424,0,0.002} ; 
foil_Points[10] = p ; 
p = newp ; 
Point(p) = {0.366,0.024949,0,0.002} ; 
foil_Points[11] = p ; 
p = newp ; 
Point(p) = {0.3355,0.026169,0,0.002} ; 
foil_Points[12] = p ; 
p = newp ; 
Point(p) = {0.305,0.027084,0,0.002} ; 
foil_Points[13] = p ; 
p = newp ; 
Point(p) = {0.2745,0.027816,0,0.002} ; 
foil_Points[14] = p ; 
p = newp ; 
Point(p) = {0.244,0.028182,0,0.002} ; 
foil_Points[15] = p ; 
p = newp ; 
Point(p) = {0.2135,0.028365,0,0.002} ; 
foil_Points[16] = p ; 
p = newp ; 
Point(p) = {0.183,0.028243,0,0.002} ; 
foil_Points[17] = p ; 
p = newp ; 
Point(p) = {0.1525,0.027816,0,0.002} ; 
foil_Points[18] = p ; 
p = newp ; 
Point(p) = {0.122,0.026901,0,0.002} ; 
foil_Points[19] = p ; 
p = newp ; 
Point(p) = {0.0915,0.025376,0,0.002} ; 
foil_Points[20] = p ; 
p = newp ; 
Point(p) = {0.0671,0.023546,0,0.002} ; 
foil_Points[21] = p ; 
p = newp ; 
Point(p) = {0.04575,0.021106,0,0.002} ; 
foil_Points[22] = p ; 
p = newp ; 
Point(p) = {0.0305,0.018544,0,0.002} ; 
foil_Points[23] = p ; 
p = newp ; 
Point(p) = {0.019825,0.016043,0,0.002} ; 
foil_Points[24] = p ; 
p = newp ; 
Point(p) = {0.0122,0.013542,0,0.002} ; 
foil_Points[25] = p ; 
p = newp ; 
Point(p) = {0.007625,0.011407,0,0.002} ; 
foil_Points[26] = p ; 
p = newp ; 
Point(p) = {0.00427,0.00915,0,0.002} ; 
foil_Points[27] = p ; 
p = newp ; 
Point(p) = {0.00244,0.0069235,0,0.002} ; 
foil_Points[28] = p ; 
p = newp ; 
Point(p) = {0.000915,0.004575,0,0.002} ; 
foil_Points[29] = p ; 
p = newp ; 
Point(p) = {0.0002135,0.002135,0,0.002} ; 
foil_Points[30] = p ; 
p = newp ; 
Point(p) = {0,0,0,0.002} ; 
foil_Points[31] = p ; 
p = newp ; 
Point(p) = {0.0002135,-0.002135,0,0.002} ; 
foil_Points[32] = p ; 
p = newp ; 
Point(p) = {0.000915,-0.004575,0,0.002} ; 
foil_Points[33] = p ; 
p = newp ; 
Point(p) = {0.00244,-0.0072285,0,0.002} ; 
foil_Points[34] = p ; 
p = newp ; 
Point(p) = {0.00427,-0.00915,0,0.002} ; 
foil_Points[35] = p ; 
p = newp ; 
Point(p) = {0.007625,-0.011407,0,0.002} ; 
foil_Points[36] = p ; 
p = newp ; 
Point(p) = {0.0122,-0.013542,0,0.002} ; 
foil_Points[37] = p ; 
p = newp ; 
Point(p) = {0.019825,-0.016043,0,0.002} ; 
foil_Points[38] = p ; 
p = newp ; 
Point(p) = {0.0305,-0.018544,0,0.002} ; 
foil_Points[39] = p ; 
p = newp ; 
Point(p) = {0.04575,-0.021106,0,0.002} ; 
foil_Points[40] = p ; 
p = newp ; 
Point(p) = {0.0671,-0.023546,0,0.002} ; 
foil_Points[41] = p ; 
p = newp ; 
Point(p) = {0.071169,-0.023851,0,0.002} ; 
foil_Points[42] = p ; 
p = newp ; 
Point(p) = {0.0915,-0.025376,0,0.002} ; 
foil_Points[43] = p ; 
p = newp ; 
Point(p) = {0.122,-0.026901,0,0.002} ; 
foil_Points[44] = p ; 
p = newp ; 
Point(p) = {0.1525,-0.027816,0,0.002} ; 
foil_Points[45] = p ; 
p = newp ; 
Point(p) = {0.183,-0.028243,0,0.002} ; 
foil_Points[46] = p ; 
p = newp ; 
Point(p) = {0.2135,-0.028365,0,0.002} ; 
foil_Points[47] = p ; 
p = newp ; 
Point(p) = {0.244,-0.028182,0,0.002} ; 
foil_Points[48] = p ; 
p = newp ; 
Point(p) = {0.2745,-0.027755,0,0.002} ; 
foil_Points[49] = p ; 
p = newp ; 
Point(p) = {0.305,-0.027023,0,0.002} ; 
foil_Points[50] = p ; 
p = newp ; 
Point(p) = {0.3355,-0.025803,0,0.002} ; 
foil_Points[51] = p ; 
p = newp ; 
Point(p) = {0.366,-0.023729,0,0.002} ; 
foil_Points[52] = p ; 
p = newp ; 
Point(p) = {0.3965,-0.020191,0,0.002} ; 
foil_Points[53] = p ; 
p = newp ; 
Point(p) = {0.427,-0.014823,0,0.002} ; 
foil_Points[54] = p ; 
p = newp ; 
Point(p) = {0.4575,-0.009943,0,0.002} ; 
foil_Points[55] = p ; 
p = newp ; 
Point(p) = {0.488,-0.006039,0,0.002} ; 
foil_Points[56] = p ; 
p = newp ; 
Point(p) = {0.5185,-0.003172,0,0.002} ; 
foil_Points[57] = p ; 
p = newp ; 
Point(p) = {0.549,-0.001708,0,0.002} ; 
foil_Points[58] = p ; 
p = newp ; 
Point(p) = {0.5734,-0.001952,0,0.002} ; 
foil_Points[59] = p ; 
p = newp ; 
Point(p) = {0.5917,-0.003538,0,0.002} ; 
foil_Points[60] = p ; 
p = newp ; 
Point(p) = {0.60085,-0.0046665,0,0.002} ; 
foil_Points[61] = p ; 
p = newp ; 
Point(p) = {0.60695,-0.005551,0,0.002} ; 
foil_Points[62] = p ; 
p = newp ; 
Point(p) = {0.61,-0.0061,0,0.002} ; 
foil_Points[63] = p ; 
 
// Splines .............................    
c = newc ; 
Spline(c) = foil_Points[{0:63}] ; 
foil_Splines[0] = c ; 
c = newc ; 
Spline(c) = foil_Points[{63,0}] ; 
foil_Splines[1] = c ; 
