# p  FACE_DATA 2631
#  x  y  z  p
0.16631 -0.0280594 0.02875 1184.68
0.16678 -0.0280659 0.02875 1182.29
0.170068 -0.0281086 0.02875 1169.87
0.170538 -0.0281143 0.02875 1167.48
0.173827 -0.0281523 0.02875 1154.97
0.174296 -0.0281575 0.02875 1153.1
0.177586 -0.0281917 0.02875 1140.38
0.178055 -0.0281965 0.02875 1138.16
0.181344 -0.0282279 0.02875 1124.75
0.181814 -0.0282322 0.02875 1122.95
0.185104 -0.0282611 0.02875 1108.79
0.185573 -0.028265 0.02875 1106.91
0.188863 -0.02829 0.02875 1092.68
0.189333 -0.0282933 0.02875 1091.26
0.192622 -0.0283143 0.02875 1077.22
0.193092 -0.028317 0.02875 1075.55
0.196382 -0.028334 0.02875 1062.29
0.196852 -0.028336 0.02875 1060.65
0.200141 -0.028349 0.02875 1047.56
0.200611 -0.0283506 0.02875 1045.56
0.2039 -0.0283593 0.02875 1033.14
0.20437 -0.0283604 0.02875 1030.97
0.20766 -0.028365 0.02875 1018.62
0.20813 -0.0283656 0.02875 1016.66
0.211419 -0.0283662 0.02875 1003.86
0.211889 -0.028366 0.02875 1002.32
0.215179 -0.0283626 0.02875 989.522
0.215648 -0.0283618 0.02875 987.856
0.218938 -0.0283537 0.02875 975.454
0.219408 -0.0283523 0.02875 974.057
0.222697 -0.0283398 0.02875 961.846
0.223167 -0.0283378 0.02875 960.559
0.226457 -0.0283213 0.02875 948.685
0.226927 -0.0283186 0.02875 946.962
0.230216 -0.0282983 0.02875 935.815
0.230686 -0.028295 0.02875 933.909
0.233975 -0.0282712 0.02875 922.792
0.234445 -0.0282676 0.02875 921.026
0.237735 -0.0282404 0.02875 909.966
0.238205 -0.0282364 0.02875 908.069
0.241494 -0.0282063 0.02875 896.857
0.241963 -0.0282019 0.02875 895.061
0.245253 -0.0281692 0.02875 883.191
0.245723 -0.0281644 0.02875 881.354
0.249011 -0.0281292 0.02875 869.2
0.249481 -0.028124 0.02875 867.377
0.25277 -0.0280858 0.02875 854.911
0.25324 -0.0280802 0.02875 853.401
0.256501 -0.0280395 0.02875 840.706
0.256906 -0.0280341 0.02875 839.429
0.0766585 -0.0242929 0.02875 1738.22
0.0798408 -0.0245493 0.02875 1707.25
0.0803106 -0.0245867 0.02875 1702.74
0.143757 -0.0276069 0.02875 1290.37
0.144226 -0.0276191 0.02875 1288.02
0.147512 -0.0277009 0.02875 1271.78
0.147981 -0.0277122 0.02875 1269.66
0.151269 -0.0277885 0.02875 1252.89
0.151739 -0.0277989 0.02875 1250.72
0.155028 -0.0278691 0.02875 1233.67
0.155498 -0.0278785 0.02875 1231.89
0.158788 -0.0279407 0.02875 1215.95
0.159257 -0.0279489 0.02875 1214.59
0.162547 -0.0280037 0.02875 1199.83
0.163017 -0.028011 0.02875 1198.13
0.260291 -0.0279882 0.02875 826.128
0.260761 -0.0279816 0.02875 824.296
0.264051 -0.0279332 0.02875 811.744
0.264521 -0.0279261 0.02875 809.377
0.26781 -0.0278735 0.02875 797.492
0.26828 -0.0278658 0.02875 794.89
0.27157 -0.0278088 0.02875 782.953
0.272039 -0.0278005 0.02875 781.378
0.275328 -0.0277392 0.02875 769.414
0.275797 -0.0277302 0.02875 767.476
0.279085 -0.027666 0.02875 754.799
0.279555 -0.0276567 0.02875 752.877
0.282842 -0.02759 0.02875 738.628
0.283307 -0.0275802 0.02875 737.254
0.354292 -0.0246703 0.02875 424.482
0.354746 -0.0246378 0.02875 423.828
0.358025 -0.0243969 0.02875 409.672
0.358488 -0.0243613 0.02875 406.63
0.0422747 -0.0206044 0.02875 2099.48
0.0427317 -0.0206739 0.02875 2093.05
0.0723295 -0.0239417 0.02875 1778.98
0.0727964 -0.0239784 0.02875 1776.43
0.0761428 -0.0242508 0.02875 1743.46
0.361794 -0.0240965 0.02875 397.564
0.362263 -0.0240573 0.02875 391.981
0.391868 -0.0208421 0.02875 357.719
0.392339 -0.0207777 0.02875 356.871
0.0234648 -0.0169917 0.02875 2333.85
0.0239522 -0.0171097 0.02875 2329.8
0.038994 -0.0200865 0.02875 2142.71
0.39563 -0.0203167 0.02875 360.74
0.396092 -0.0202496 0.02875 357.416
0.414429 -0.017092 0.02875 512.142
0.414894 -0.0170054 0.02875 516.428
0.418158 -0.0163984 0.02875 548.194
0.418619 -0.0163135 0.02875 551.946
0.436971 -0.0131566 0.02875 631.847
0.437426 -0.0130813 0.02875 634.23
0.00472788 -0.00948909 0.02875 761.184
0.440705 -0.0125428 0.02875 644.667
0.459524 -0.00965404 0.02875 690.837
0.460014 -0.00958465 0.02875 690.532
0.00156048 -0.00578976 0.02875 -1675.45
0.463275 -0.00912835 0.02875 695.376
0.463767 -0.00906055 0.02875 694.633
0.489578 -0.0058651 0.02875 706.793
0.490089 -0.00580901 0.02875 706.409
0.493268 -0.00546568 0.02875 707.034
0.606197 -0.00543521 0.02875 -357.243
0.606657 -0.00550884 0.02875 -398.984
0.00128588 -0.00530845 0.02875 -2124.6
0.493783 -0.00541079 0.02875 707.294
0.497113 -0.00506272 0.02875 708.195
0.497557 -0.00501724 0.02875 708.089
0.538487 -0.00205059 0.02875 667.816
0.538957 -0.00203152 0.02875 666.322
0.542246 -0.00190555 0.02875 660.341
0.542716 -0.00188921 0.02875 660.356
0.546002 -0.00178499 0.02875 652.431
0.546472 -0.00177169 0.02875 653.316
0.549761 -0.00169286 0.02875 644.069
0.55023 -0.00168318 0.02875 643.895
0.564807 -0.00168503 0.02875 582.238
0.565277 -0.00169485 0.02875 577.569
0.568565 -0.00177718 0.02875 560.628
0.569035 -0.00179208 0.02875 554.554
0.572322 -0.00190811 0.02875 535.59
0.572792 -0.00192786 0.02875 532.656
0.576143 -0.00209726 0.02875 505.57
0.553525 -0.00163519 0.02875 632.302
0.553994 -0.00163003 0.02875 631.063
0.557284 -0.00161437 0.02875 618.497
0.557754 -0.00161415 0.02875 616.326
0.561043 -0.00163083 0.02875 601.295
0.561512 -0.00163559 0.02875 597.779
0.602367 0.00130284 0.02875 -1205.01
0.602823 0.00121593 0.02875 -1200.15
0.00140122 0.00536891 0.02875 -7737.88
0.579837 0.00520381 0.02875 -1538.98
0.580296 0.00512978 0.02875 -1532.05
0.00169011 0.00582613 0.02875 -7224.57
0.527178 0.0125404 0.02875 -2247.44
0.489613 0.0165598 0.02875 -2585.11
0.490082 0.0165146 0.02875 -2581.32
0.0389898 0.0200856 0.02875 -3622.26
0.444502 0.0203186 0.02875 -2890.44
0.44497 0.0202846 0.02875 -2887.56
0.448155 0.020051 0.02875 -2867.4
0.0723255 0.0240097 0.02875 -3784.19
0.0727933 0.0240488 0.02875 -3785.87
0.380536 0.0242636 0.02875 -3363.94
0.381078 0.0242368 0.02875 -3359.18
0.384351 0.0240722 0.02875 -3331.05
0.384821 0.0240482 0.02875 -3326.95
0.388102 0.0238787 0.02875 -3300.28
0.388565 0.0238543 0.02875 -3296.31
0.143756 0.027607 0.02875 -4030.29
0.144225 0.0276191 0.02875 -4031.76
0.147512 0.0277009 0.02875 -4043.2
0.147981 0.0277123 0.02875 -4044.98
0.151269 0.0277884 0.02875 -4056.57
0.151739 0.027799 0.02875 -4058.51
0.155028 0.027869 0.02875 -4070.19
0.155498 0.0278785 0.02875 -4072.08
0.158788 0.0279407 0.02875 -4083.43
0.159257 0.0279489 0.02875 -4084.96
0.162547 0.0280037 0.02875 -4096.53
0.163016 0.028011 0.02875 -4098.19
0.260307 0.0280212 0.02875 -4256.64
0.260762 0.0280158 0.02875 -4255.4
0.264051 0.0279754 0.02875 -4248.34
0.264521 0.0279693 0.02875 -4246.89
0.26781 0.027924 0.02875 -4238.95
0.26828 0.0279172 0.02875 -4237.24
0.27157 0.0278662 0.02875 -4227.4
0.272039 0.0278584 0.02875 -4225.36
0.275329 0.0278006 0.02875 -4212.8
0.275798 0.027792 0.02875 -4211.39
0.279087 0.0277273 0.02875 -4196.13
0.279556 0.0277177 0.02875 -4194.31
0.282844 0.0276469 0.02875 -4177.29
0.283314 0.0276365 0.02875 -4174.93
0.286509 0.0275627 0.02875 -4157.09
0.164523 -0.0280338 0.02875 1191.51
0.164928 -0.0280397 0.02875 1190.23
0.168189 -0.0280847 0.02875 1177.33
0.168658 -0.0280909 0.02875 1174.74
0.171947 -0.028131 0.02875 1162.57
0.172417 -0.0281365 0.02875 1160.23
0.175706 -0.0281725 0.02875 1147.64
0.176176 -0.0281774 0.02875 1145.93
0.179465 -0.0282101 0.02875 1132.58
0.179935 -0.0282147 0.02875 1130.72
0.183224 -0.0282449 0.02875 1116.88
0.183694 -0.0282491 0.02875 1114.71
0.186983 -0.0282761 0.02875 1100.47
0.187453 -0.0282797 0.02875 1099.01
0.190743 -0.0283027 0.02875 1085.13
0.191212 -0.0283056 0.02875 1083.34
0.194502 -0.0283248 0.02875 1069.54
0.194972 -0.0283271 0.02875 1067.87
0.198261 -0.0283421 0.02875 1055.08
0.198731 -0.0283439 0.02875 1052.66
0.202021 -0.0283548 0.02875 1040.31
0.202491 -0.0283561 0.02875 1038.02
0.20578 -0.0283628 0.02875 1025.79
0.20625 -0.0283635 0.02875 1023.67
0.209539 -0.0283662 0.02875 1011.39
0.210009 -0.0283664 0.02875 1009.44
0.213299 -0.028365 0.02875 996.874
0.213769 -0.0283646 0.02875 994.996
0.217058 -0.0283588 0.02875 982.398
0.217528 -0.0283577 0.02875 981.051
0.220818 -0.0283475 0.02875 968.304
0.221288 -0.0283456 0.02875 967.336
0.224577 -0.0283311 0.02875 954.906
0.225047 -0.0283287 0.02875 953.959
0.228336 -0.0283103 0.02875 941.998
0.228806 -0.0283074 0.02875 940.461
0.232096 -0.0282852 0.02875 929.325
0.232566 -0.0282818 0.02875 927.297
0.235855 -0.0282563 0.02875 916.593
0.236325 -0.0282524 0.02875 914.355
0.239614 -0.0282237 0.02875 903.211
0.240084 -0.0282195 0.02875 901.791
0.243373 -0.0281882 0.02875 889.793
0.243843 -0.0281834 0.02875 888.337
0.247132 -0.0281496 0.02875 876.19
0.247602 -0.0281446 0.02875 874.412
0.250891 -0.0281079 0.02875 861.959
0.251361 -0.0281025 0.02875 860.553
0.254649 -0.028063 0.02875 847.595
0.255119 -0.028057 0.02875 846.116
0.0779712 -0.0243996 0.02875 1725.4
0.0784371 -0.0244373 0.02875 1720.87
0.0816991 -0.0246948 0.02875 1689.49
0.0822335 -0.0247361 0.02875 1684.61
0.0968601 -0.0256856 0.02875 1570.76
0.0986453 -0.0257842 0.02875 1558.96
0.0972676 -0.0257082 0.02875 1568.32
0.0991135 -0.0258097 0.02875 1555.95
0.100519 -0.0258857 0.02875 1546.52
0.102397 -0.0259852 0.02875 1534.1
0.100987 -0.0259107 0.02875 1543.22
0.106196 -0.0261806 0.02875 1508.74
0.102867 -0.0260098 0.02875 1530.63
0.104276 -0.0260829 0.02875 1521.54
0.10473 -0.0261062 0.02875 1518.1
0.106642 -0.026203 0.02875 1505.41
0.108042 -0.0262725 0.02875 1496.46
0.109916 -0.026364 0.02875 1484.08
0.10851 -0.0262956 0.02875 1493.23
0.110386 -0.0263867 0.02875 1480.8
0.111795 -0.0264536 0.02875 1471.63
0.113675 -0.0265411 0.02875 1459.38
0.112265 -0.0264758 0.02875 1468.6
0.114145 -0.0265628 0.02875 1456.3
0.14244 -0.0275724 0.02875 1296.43
0.145634 -0.0276547 0.02875 1281.2
0.146103 -0.0276665 0.02875 1278.85
0.14939 -0.0277454 0.02875 1262.54
0.14986 -0.0277563 0.02875 1260.14
0.153148 -0.0278298 0.02875 1243.31
0.153618 -0.0278398 0.02875 1241.15
0.156908 -0.027906 0.02875 1224.47
0.157378 -0.0279148 0.02875 1223.17
0.160667 -0.0279733 0.02875 1207.62
0.161137 -0.0279809 0.02875 1206.17
0.258412 -0.0280141 0.02875 832.436
0.258881 -0.0280077 0.02875 831.305
0.262171 -0.0279613 0.02875 818.77
0.262641 -0.0279543 0.02875 816.996
0.26593 -0.027904 0.02875 804.752
0.2664 -0.0278965 0.02875 802.119
0.26969 -0.0278418 0.02875 790.126
0.27016 -0.0278338 0.02875 788.06
0.273449 -0.0277745 0.02875 776.157
0.273918 -0.0277658 0.02875 774.391
0.277207 -0.027703 0.02875 762.205
0.277677 -0.0276938 0.02875 760.3
0.280964 -0.0276285 0.02875 747.073
0.281434 -0.0276189 0.02875 744.952
0.317094 -0.0266147 0.02875 594.025
0.318562 -0.0265606 0.02875 584.521
0.320442 -0.0264893 0.02875 575.045
0.319032 -0.0265429 0.02875 583.39
0.320912 -0.0264709 0.02875 573.95
0.322321 -0.0264153 0.02875 566.179
0.324198 -0.0263386 0.02875 557.324
0.322791 -0.0263962 0.02875 564.505
0.324667 -0.0263189 0.02875 554.95
0.326075 -0.0262589 0.02875 548.82
0.327923 -0.0261772 0.02875 540.896
0.326543 -0.0262384 0.02875 545.396
0.328328 -0.0261588 0.02875 537.41
0.32984 -0.0260885 0.02875 531.578
0.33172 -0.0259978 0.02875 524.572
0.33031 -0.0260663 0.02875 528.062
0.33219 -0.0259745 0.02875 521.444
0.333598 -0.0259028 0.02875 518
0.335473 -0.025804 0.02875 512.742
0.334067 -0.0258788 0.02875 515.56
0.335941 -0.025779 0.02875 511.04
0.337319 -0.0257041 0.02875 507.392
0.337725 -0.0256819 0.02875 505.8
0.356156 -0.0245365 0.02875 416.883
0.356624 -0.0245018 0.02875 415.242
0.0441246 -0.0208766 0.02875 2075.2
0.0446155 -0.0209474 0.02875 2068.75
0.0535375 -0.0220624 0.02875 1966.21
0.0573019 -0.0224865 0.02875 1925.62
0.0540008 -0.0221154 0.02875 1961.43
0.0554034 -0.0222745 0.02875 1946.08
0.0558949 -0.0223295 0.02875 1941.08
0.0577647 -0.0225375 0.02875 1920.88
0.0591644 -0.0226915 0.02875 1905.46
0.0596318 -0.0227424 0.02875 1900.61
0.0705453 -0.0238092 0.02875 1785.21
0.0709531 -0.0238361 0.02875 1790.77
0.0742019 -0.0240921 0.02875 1762.41
0.0746719 -0.0241303 0.02875 1758.05
0.359853 -0.0242543 0.02875 404.424
0.360399 -0.0242107 0.02875 398.42
0.363664 -0.0239373 0.02875 392.67
0.364125 -0.0238972 0.02875 388.655
0.37683 -0.0226545 0.02875 371.459
0.377298 -0.0226042 0.02875 371.461
0.378682 -0.0224535 0.02875 368.413
0.379132 -0.0224036 0.02875 368.691
0.380592 -0.02224 0.02875 364.499
0.38106 -0.0221867 0.02875 365.392
0.382454 -0.0220261 0.02875 362.079
0.382913 -0.0219721 0.02875 363.56
0.393721 -0.0205873 0.02875 359.966
0.394181 -0.0205226 0.02875 357.565
0.0310146 -0.0186433 0.02875 2249.59
0.0291232 -0.0182674 0.02875 2272.5
0.0295738 -0.0183584 0.02875 2266.78
0.0314706 -0.0187317 0.02875 2243.5
0.0328776 -0.0190006 0.02875 2225.86
0.0403681 -0.0203086 0.02875 2124.95
0.0408367 -0.0203836 0.02875 2118.06
0.397473 -0.0200458 0.02875 364.514
0.405014 -0.0188104 0.02875 415.516
0.405469 -0.0187311 0.02875 419.798
0.406903 -0.0184758 0.02875 434.298
0.407369 -0.0183926 0.02875 438.104
0.416261 -0.0167507 0.02875 530.582
0.0159882 -0.0148838 0.02875 2339.47
0.014585 -0.0144061 0.02875 2316.37
0.0164471 -0.0150308 0.02875 2344.59
0.0215898 -0.0165141 0.02875 2347.56
0.0220773 -0.016639 0.02875 2344.68
0.425692 -0.015046 0.02875 601.102
0.424277 -0.015292 0.02875 593.025
0.426147 -0.0149686 0.02875 600.79
0.427583 -0.014725 0.02875 604.82
0.429425 -0.0144158 0.02875 607.92
0.428052 -0.0146463 0.02875 604.635
0.43555 -0.0133922 0.02875 627.802
0.00659907 -0.0107909 0.02875 1525.72
0.00705847 -0.0110627 0.02875 1667.03
0.0103243 -0.0127632 0.02875 2112.48
0.0107817 -0.0129562 0.02875 2151.98
0.438862 -0.0128447 0.02875 638.305
0.439331 -0.0127677 0.02875 640.303
0.448259 -0.0113346 0.02875 667.981
0.448719 -0.0112626 0.02875 669.727
0.450118 -0.0110458 0.02875 673.892
0.452002 -0.0107576 0.02875 678.162
0.45061 -0.0109699 0.02875 674.753
0.452459 -0.0106882 0.02875 679.447
0.46141 -0.00938797 0.02875 692.737
0.461871 -0.00932358 0.02875 692.817
0.00286623 -0.00771471 0.02875 -590.494
0.465162 -0.00886935 0.02875 696.965
0.46562 -0.00880723 0.02875 696.723
0.47458 -0.00763264 0.02875 703.264
0.475045 -0.00757407 0.02875 704.494
0.476432 -0.00740069 0.02875 704.594
0.476893 -0.00734355 0.02875 705.869
0.478338 -0.00716575 0.02875 705.017
0.478805 -0.00710895 0.02875 706.452
0.480193 -0.00694144 0.02875 706.145
0.480655 -0.00688599 0.02875 706.747
0.49149 -0.00565664 0.02875 706.52
0.491955 -0.00560632 0.02875 706.549
0.608037 -0.00573424 0.02875 -498.939
0.608527 -0.00582317 0.02875 -579.079
0.495252 -0.00525594 0.02875 707.192
0.495721 -0.00520697 0.02875 707.159
0.508353 -0.00398413 0.02875 710.065
0.508898 -0.00393631 0.02875 710.147
0.51029 -0.0038158 0.02875 708.859
0.512159 -0.00365917 0.02875 708.017
0.510759 -0.00377605 0.02875 709.969
0.512621 -0.00362128 0.02875 709.41
0.513989 -0.0035116 0.02875 707.289
0.51593 -0.00336134 0.02875 705.141
0.514536 -0.00346838 0.02875 707.867
0.516399 -0.00332574 0.02875 705.606
0.517803 -0.00322273 0.02875 703.079
0.519588 -0.00309647 0.02875 700.722
0.51827 -0.0031888 0.02875 702.986
0.540366 -0.00197523 0.02875 664.197
0.540836 -0.00195748 0.02875 663.358
0.544124 -0.00184195 0.02875 656.291
0.544594 -0.00182708 0.02875 657.341
0.547881 -0.00173502 0.02875 648.485
0.548351 -0.00172342 0.02875 648.932
0.551613 -0.00165996 0.02875 639.031
0.552018 -0.00165341 0.02875 638.097
0.563016 -0.0016546 0.02875 591.165
0.563425 -0.00166094 0.02875 588.406
0.566686 -0.00172634 0.02875 571.658
0.567156 -0.00173871 0.02875 566.254
0.570443 -0.00183778 0.02875 547.903
0.570913 -0.00185495 0.02875 543.153
0.574201 -0.00199001 0.02875 524.498
0.574672 -0.00201417 0.02875 524.634
0.58747 -0.00309587 0.02875 286.433
0.587875 -0.00313869 0.02875 277.015
0.589244 -0.00328354 0.02875 242.402
0.591099 -0.00347621 0.02875 201.728
0.589711 -0.003333 0.02875 230.865
0.593016 -0.00367479 0.02875 169.809
0.594875 -0.00388096 0.02875 132.535
0.593477 -0.0037239 0.02875 160.643
0.591636 -0.00353072 0.02875 193.16
0.595343 -0.00393646 0.02875 116.186
0.604287 -0.00514661 0.02875 -241.517
0.604748 -0.00521568 0.02875 -277.285
0.555404 -0.00162015 0.02875 625.901
0.555874 -0.00161745 0.02875 624.191
0.559163 -0.00161791 0.02875 610.316
0.559633 -0.00162018 0.02875 607.581
0.600503 0.00164988 0.02875 -1226.23
0.600992 0.0015591 0.02875 -1220.49
0.608015 0.000231888 0.02875 -1161.61
0.591116 0.00333157 0.02875 -1360.23
0.591575 0.003254 0.02875 -1353.67
0.00297721 0.00767945 0.02875 -4908.84
0.555396 0.00893722 0.02875 -1912.81
0.555856 0.00887131 0.02875 -1906.49
0.566662 0.00726185 0.02875 -1743.08
0.56854 0.00697305 0.02875 -1714.05
0.567154 0.00718637 0.02875 -1735.3
0.568998 0.00690216 0.02875 -1706.49
0.00656304 0.0107746 0.02875 -3659.68
0.00703977 0.0110537 0.02875 -3701.83
0.0103252 0.0127571 0.02875 -3591.15
0.0107836 0.0129563 0.02875 -3583.23
0.525327 0.0127575 0.02875 -2266.26
0.525793 0.0127029 0.02875 -2261.41
0.540369 0.0109364 0.02875 -2103.01
0.542221 0.0107022 0.02875 -2081.63
0.540834 0.0108779 0.02875 -2098.23
0.542681 0.0106438 0.02875 -2077.11
0.0145857 0.0144069 0.02875 -3550.59
0.0215893 0.0165126 0.02875 -3548.42
0.0220771 0.0166389 0.02875 -3549.18
0.491476 0.0163802 0.02875 -2570.85
0.49192 0.0163368 0.02875 -2567.03
0.508409 0.0146519 0.02875 -2429.31
0.506939 0.0148088 0.02875 -2443.28
0.508877 0.0146018 0.02875 -2425.86
0.510257 0.0144531 0.02875 -2412.56
0.510698 0.0144054 0.02875 -2409.1
0.029121 0.0182668 0.02875 -3570.36
0.0295724 0.0183571 0.02875 -3572.2
0.0403676 0.0203094 0.02875 -3630.97
0.0408357 0.0203835 0.02875 -3632.25
0.442638 0.0204528 0.02875 -2902.31
0.443092 0.0204203 0.02875 -2899.55
0.446374 0.0201822 0.02875 -2878.42
0.446841 0.0201479 0.02875 -2875.95
0.467076 0.0185634 0.02875 -2744.27
0.467528 0.018526 0.02875 -2741.22
0.468937 0.0184087 0.02875 -2732.17
0.4708 0.018252 0.02875 -2719.56
0.469405 0.0183696 0.02875 -2729.21
0.471248 0.0182142 0.02875 -2717.1
0.0535335 0.0220987 0.02875 -3692.55
0.0521508 0.021932 0.02875 -3686.48
0.0539989 0.0221543 0.02875 -3695.21
0.0554007 0.0223185 0.02875 -3701.72
0.0558904 0.0223753 0.02875 -3704.4
0.0704863 0.0238517 0.02875 -3775.73
0.0709312 0.0238901 0.02875 -3777.54
0.0742014 0.0241652 0.02875 -3792.67
0.0746559 0.0242019 0.02875 -3793.95
0.382472 0.0241672 0.02875 -3347.06
0.382942 0.0241435 0.02875 -3342.99
0.386228 0.023976 0.02875 -3315.58
0.386697 0.0239518 0.02875 -3311.67
0.414366 0.0223561 0.02875 -3093.97
0.414912 0.0223216 0.02875 -3089.91
0.416306 0.0222331 0.02875 -3079.53
0.418183 0.0221126 0.02875 -3066
0.416776 0.0222029 0.02875 -3076.12
0.418651 0.0220824 0.02875 -3062.72
0.420048 0.0219919 0.02875 -3052.66
0.420494 0.0219628 0.02875 -3049.31
0.096862 0.0256904 0.02875 -3872.45
0.0986451 0.02579 0.02875 -3878.1
0.0972678 0.0257132 0.02875 -3873.8
0.0991132 0.0258156 0.02875 -3879.51
0.100519 0.0258921 0.02875 -3883.83
0.102397 0.0259919 0.02875 -3889.73
0.100987 0.025917 0.02875 -3885.23
0.102867 0.0260164 0.02875 -3891.17
0.104276 0.0260896 0.02875 -3895.99
0.104732 0.0261128 0.02875 -3897.21
0.142438 0.0275724 0.02875 -4025.41
0.145633 0.0276547 0.02875 -4036.74
0.146103 0.0276665 0.02875 -4038.38
0.149391 0.0277454 0.02875 -4049.75
0.14986 0.0277564 0.02875 -4051.72
0.153148 0.0278298 0.02875 -4063.33
0.153618 0.0278399 0.02875 -4065.51
0.156908 0.0279059 0.02875 -4076.84
0.157378 0.0279149 0.02875 -4078.66
0.160667 0.0279731 0.02875 -4089.82
0.161137 0.0279809 0.02875 -4091.5
0.262171 0.027999 0.02875 -4252.46
0.262641 0.0279932 0.02875 -4251.59
0.26593 0.0279506 0.02875 -4243.78
0.2664 0.027944 0.02875 -4242.26
0.26969 0.027896 0.02875 -4233.36
0.27016 0.0278887 0.02875 -4231.14
0.273449 0.0278344 0.02875 -4220.39
0.273919 0.0278263 0.02875 -4218.76
0.277208 0.027765 0.02875 -4204.79
0.277678 0.0277559 0.02875 -4203.41
0.280965 0.0276879 0.02875 -4187.03
0.281435 0.0276778 0.02875 -4184.79
0.284722 0.0276044 0.02875 -4167.19
0.285191 0.0275936 0.02875 -4164.8
0.33736 0.0261032 0.02875 -3760.27
0.339239 0.0260357 0.02875 -3742.68
0.337829 0.0260865 0.02875 -3755.79
0.339709 0.0260188 0.02875 -3738.69
0.341118 0.0259671 0.02875 -3725.04
0.342997 0.0258972 0.02875 -3707.86
0.341588 0.0259498 0.02875 -3721.35
0.343466 0.0258797 0.02875 -3704.01
0.344874 0.0258264 0.02875 -3690.74
0.34675 0.0257543 0.02875 -3673.42
0.345343 0.0258085 0.02875 -3686.55
0.347219 0.0257361 0.02875 -3669.29
0.348536 0.0256847 0.02875 -3656.72
0.165841 -0.0280528 0.02875 1186.9
0.167249 -0.0280722 0.02875 1181.08
0.169598 -0.0281026 0.02875 1171.78
0.171008 -0.0281199 0.02875 1166.05
0.173357 -0.028147 0.02875 1156.95
0.174766 -0.0281626 0.02875 1150.91
0.177116 -0.0281869 0.02875 1141.98
0.178525 -0.0282011 0.02875 1136.13
0.180874 -0.0282236 0.02875 1126.6
0.182284 -0.0282364 0.02875 1120.96
0.184634 -0.0282572 0.02875 1110.16
0.186043 -0.0282688 0.02875 1104.64
0.188393 -0.0282867 0.02875 1094.72
0.189803 -0.0282965 0.02875 1089.1
0.192152 -0.0283115 0.02875 1079.47
0.193562 -0.0283196 0.02875 1073.94
0.195912 -0.0283317 0.02875 1064.48
0.197321 -0.0283381 0.02875 1058.78
0.199671 -0.0283474 0.02875 1049.57
0.201081 -0.028352 0.02875 1043.83
0.20343 -0.0283583 0.02875 1034.67
0.20484 -0.0283613 0.02875 1028.75
0.20719 -0.0283646 0.02875 1020.07
0.2086 -0.0283659 0.02875 1014.18
0.210949 -0.0283663 0.02875 1005.62
0.212359 -0.0283659 0.02875 999.983
0.214709 -0.0283634 0.02875 990.813
0.216118 -0.0283609 0.02875 985.871
0.218468 -0.0283552 0.02875 976.939
0.219878 -0.0283508 0.02875 972.344
0.222227 -0.0283419 0.02875 963.903
0.223637 -0.0283356 0.02875 958.803
0.225987 -0.0283238 0.02875 950.46
0.227397 -0.0283158 0.02875 945.863
0.229746 -0.0283013 0.02875 937.747
0.231156 -0.0282918 0.02875 932.795
0.233506 -0.0282747 0.02875 924.687
0.234915 -0.0282638 0.02875 919.444
0.237265 -0.0282444 0.02875 911.664
0.238674 -0.0282322 0.02875 906.368
0.241024 -0.0282107 0.02875 898.129
0.242433 -0.0281974 0.02875 892.918
0.244783 -0.028174 0.02875 884.747
0.246192 -0.0281595 0.02875 879.917
0.248542 -0.0281344 0.02875 870.649
0.249951 -0.0281187 0.02875 865.88
0.2523 -0.0280915 0.02875 856.597
0.25371 -0.0280744 0.02875 851.686
0.256053 -0.0280453 0.02875 842.624
0.0770641 -0.0243259 0.02875 1734.22
0.0793718 -0.0245121 0.02875 1711.67
0.0807807 -0.0246237 0.02875 1697.62
0.12872 -0.0271525 0.02875 1367.23
0.128256 -0.0271362 0.02875 1370.54
0.129189 -0.0271687 0.02875 1365.2
0.129658 -0.0271848 0.02875 1363.01
0.132473 -0.0272792 0.02875 1347.29
0.132004 -0.0272637 0.02875 1350.32
0.132943 -0.0272942 0.02875 1344.63
0.133412 -0.0273092 0.02875 1342.67
0.136231 -0.0273966 0.02875 1328.07
0.135761 -0.0273823 0.02875 1330.43
0.136701 -0.0274107 0.02875 1324.89
0.137171 -0.0274245 0.02875 1323.08
0.139991 -0.0275057 0.02875 1308.92
0.139521 -0.0274924 0.02875 1311.28
0.140461 -0.0275188 0.02875 1306.29
0.14093 -0.0275317 0.02875 1303.67
0.143292 -0.0275948 0.02875 1292.48
0.144695 -0.0276312 0.02875 1285.03
0.147042 -0.0276896 0.02875 1273.78
0.148451 -0.0277235 0.02875 1266.82
0.150799 -0.027778 0.02875 1254.86
0.152209 -0.0278094 0.02875 1248.32
0.154558 -0.0278596 0.02875 1235.77
0.155968 -0.0278879 0.02875 1229.67
0.158318 -0.0279323 0.02875 1218.49
0.159727 -0.0279571 0.02875 1212.69
0.162077 -0.0279963 0.02875 1202.57
0.163471 -0.0280179 0.02875 1196.93
0.257416 -0.0280273 0.02875 838.402
0.259821 -0.0279948 0.02875 828.183
0.261231 -0.0279748 0.02875 822.564
0.263581 -0.0279403 0.02875 813.514
0.264991 -0.0279187 0.02875 807.838
0.26734 -0.0278812 0.02875 799.173
0.26875 -0.0278578 0.02875 793.297
0.2711 -0.0278172 0.02875 784.889
0.272509 -0.0277919 0.02875 778.679
0.274858 -0.0277481 0.02875 770.699
0.276267 -0.0277212 0.02875 765.507
0.278616 -0.0276754 0.02875 756.45
0.280025 -0.0276475 0.02875 750.826
0.282373 -0.0275997 0.02875 740.592
0.283754 -0.0275709 0.02875 735.482
0.286607 -0.0275095 0.02875 722.315
0.286137 -0.0275198 0.02875 724.317
0.287077 -0.027499 0.02875 720.524
0.287547 -0.0274886 0.02875 718.86
0.290367 -0.027424 0.02875 705.884
0.289897 -0.027435 0.02875 708.205
0.290836 -0.0274129 0.02875 704.063
0.291306 -0.0274016 0.02875 702.184
0.294126 -0.0273323 0.02875 689.796
0.293656 -0.027344 0.02875 692.202
0.294596 -0.0273204 0.02875 687.325
0.295065 -0.0273082 0.02875 685.808
0.297882 -0.0272335 0.02875 673.931
0.297413 -0.0272462 0.02875 676.014
0.298352 -0.0272206 0.02875 671.22
0.298821 -0.0272075 0.02875 669.346
0.301632 -0.0271265 0.02875 658.714
0.301168 -0.0271402 0.02875 660.558
0.302079 -0.0271133 0.02875 657.011
0.302485 -0.0271012 0.02875 654.206
0.353746 -0.0247084 0.02875 431.119
0.355216 -0.0246042 0.02875 423.214
0.357559 -0.0244319 0.02875 413.012
0.358933 -0.0243264 0.02875 407.474
0.0418143 -0.0205342 0.02875 2105.35
0.0431923 -0.020742 0.02875 2085.63
0.0653529 -0.0233586 0.02875 1834.5
0.0657821 -0.0234046 0.02875 1828.71
0.0685619 -0.0237003 0.02875 1777.37
0.0680931 -0.0236526 0.02875 1789.36
0.0690311 -0.0237344 0.02875 1758.85
0.0694871 -0.0237567 0.02875 1773.31
0.0718632 -0.023906 0.02875 1782.17
0.0732639 -0.0240161 0.02875 1771.87
0.0755963 -0.024206 0.02875 1748.97
0.361324 -0.0241349 0.02875 399.012
0.362731 -0.0240173 0.02875 393.721
0.364976 -0.023821 0.02875 390.16
0.365492 -0.0237745 0.02875 390.683
0.36604 -0.0237251 0.02875 387.089
0.366494 -0.023683 0.02875 385.267
0.369293 -0.0234188 0.02875 385.395
0.368832 -0.0234629 0.02875 385.585
0.369737 -0.0233763 0.02875 384.518
0.370143 -0.023337 0.02875 381.636
0.38762 -0.0213984 0.02875 360.375
0.391375 -0.0209082 0.02875 360.729
0.392802 -0.020714 0.02875 360.167
0.0230105 -0.0168782 0.02875 2337.89
0.0385088 -0.0200054 0.02875 2150.19
0.038017 -0.0199221 0.02875 2156.83
0.0394517 -0.0201611 0.02875 2136.46
0.39516 -0.0203836 0.02875 362.076
0.396552 -0.0201816 0.02875 362.58
0.399377 -0.0197523 0.02875 371.488
0.398917 -0.0198237 0.02875 369.469
0.399833 -0.0196804 0.02875 370.08
0.400291 -0.0196064 0.02875 373.79
0.413939 -0.0171834 0.02875 507.642
0.415351 -0.0169202 0.02875 521.321
0.0197217 -0.0160128 0.02875 2355.17
0.0192588 -0.0158831 0.02875 2355.88
0.0206879 -0.0162736 0.02875 2352.18
0.0202074 -0.0161439 0.02875 2353.88
0.417705 -0.0164824 0.02875 544.185
0.419106 -0.0162233 0.02875 556.767
0.42143 -0.0157989 0.02875 575.998
0.436511 -0.0132327 0.02875 629.779
0.437884 -0.0130057 0.02875 635.156
0.00896349 -0.0121054 0.02875 1977.77
0.00943517 -0.0123416 0.02875 2021.94
0.440247 -0.0126178 0.02875 643.389
0.441191 -0.0124637 0.02875 647.355
0.441682 -0.0123839 0.02875 648.264
0.460482 -0.00951828 0.02875 690.861
0.462789 -0.0091956 0.02875 694.152
0.0018364 -0.00627341 0.02875 -1674.33
0.464238 -0.00899582 0.02875 694.6
0.467059 -0.00861269 0.02875 698.846
0.466567 -0.00867891 0.02875 697.844
0.467529 -0.00854983 0.02875 697.986
0.467993 -0.00848789 0.02875 698.364
0.490555 -0.00575801 0.02875 706.49
0.49286 -0.00550896 0.02875 707.751
0.607114 -0.0055824 0.02875 -442.446
0.0010746 -0.00487524 0.02875 -3306.95
0.494329 -0.0053528 0.02875 707.061
0.496652 -0.00510998 0.02875 708.506
0.497964 -0.00497556 0.02875 708.052
0.500887 -0.00468266 0.02875 709.493
0.50042 -0.00472867 0.02875 708.887
0.501352 -0.00463719 0.02875 708.834
0.501812 -0.00459216 0.02875 708.804
0.538017 -0.00207034 0.02875 667.239
0.539427 -0.00201262 0.02875 664.767
0.541776 -0.00192271 0.02875 660.521
0.543186 -0.00187345 0.02875 658.054
0.545533 -0.00179903 0.02875 653.18
0.546942 -0.00175932 0.02875 651.288
0.549291 -0.00170288 0.02875 645.325
0.5507 -0.00167471 0.02875 644.098
0.564338 -0.0016758 0.02875 585.053
0.565747 -0.00170467 0.02875 574.558
0.568096 -0.0017635 0.02875 560.376
0.569504 -0.00180698 0.02875 550.611
0.571852 -0.00188986 0.02875 535.989
0.573261 -0.0019483 0.02875 527.459
0.575597 -0.00206573 0.02875 508.887
0.599616 -0.00449867 0.02875 -48.2437
0.602393 -0.00487641 0.02875 -151.963
0.601924 -0.0048114 0.02875 -139.685
0.603368 -0.00501464 0.02875 -207.422
0.602884 -0.00494588 0.02875 -182.604
0.605708 -0.00535994 0.02875 -338.576
0.55307 -0.00164019 0.02875 635.112
0.554464 -0.00162583 0.02875 632.024
0.556814 -0.0016146 0.02875 622.271
0.558224 -0.00161428 0.02875 615.382
0.560573 -0.00162605 0.02875 606.474
0.561966 -0.0016402 0.02875 595.848
0.601913 0.00138814 0.02875 -1210.62
0.00112305 0.00492866 0.02875 -9002.17
0.579369 0.00527929 0.02875 -1546.19
0.580751 0.00505588 0.02875 -1524.09
0.583572 0.00459375 0.02875 -1478.41
0.583117 0.00466884 0.02875 -1485.78
0.584031 0.00451812 0.02875 -1471.44
0.00199339 0.00629351 0.02875 -6498.66
0.00427903 0.00909845 0.02875 -3874.3
0.554463 0.00906975 0.02875 -1927.59
0.55726 0.00866938 0.02875 -1885.82
0.556774 0.00873986 0.02875 -1893.97
0.557753 0.00859767 0.02875 -1878.59
0.558223 0.00852925 0.02875 -1872.31
0.575591 0.0058803 0.02875 -1606.23
0.00896439 0.0121067 0.02875 -3637.48
0.00942799 0.012345 0.02875 -3629.71
0.52439 0.0128665 0.02875 -2276.03
0.526716 0.0125947 0.02875 -2252.63
0.528152 0.0124253 0.02875 -2236.95
0.53094 0.0120935 0.02875 -2208.18
0.530482 0.0121483 0.02875 -2212.85
0.531402 0.012038 0.02875 -2202.59
0.0131367 0.0138894 0.02875 -3559.43
0.0197218 0.0160109 0.02875 -3546.99
0.019259 0.0158835 0.02875 -3547.13
0.0202073 0.0161434 0.02875 -3547.21
0.020688 0.0162746 0.02875 -3548.36
0.489144 0.0166048 0.02875 -2589.68
0.49055 0.0164696 0.02875 -2578.13
0.493389 0.0161934 0.02875 -2555.86
0.492843 0.0162468 0.02875 -2560.5
0.493843 0.0161487 0.02875 -2551.71
0.494312 0.0161023 0.02875 -2548.11
0.497037 0.0158312 0.02875 -2526.98
0.496625 0.0158724 0.02875 -2529.73
0.0385021 0.0200048 0.02875 -3620.46
0.0380134 0.0199218 0.02875 -3617.24
0.0394511 0.0201605 0.02875 -3624.77
0.444032 0.0203526 0.02875 -2893.36
0.445439 0.0202506 0.02875 -2885.1
0.447749 0.0200811 0.02875 -2869.86
0.449215 0.0199722 0.02875 -2861.23
0.452017 0.0197614 0.02875 -2842.49
0.451549 0.019797 0.02875 -2846.14
0.452485 0.0197258 0.02875 -2839.74
0.452951 0.0196903 0.02875 -2837.34
0.477805 0.0176472 0.02875 -2671.91
0.0649136 0.0233362 0.02875 -3749.14
0.0653193 0.0233755 0.02875 -3751.19
0.0657637 0.0234185 0.02875 -3753.65
0.0685624 0.0236802 0.02875 -3766.8
0.0680931 0.0236373 0.02875 -3765.16
0.069017 0.0237209 0.02875 -3768.79
0.0695642 0.0237699 0.02875 -3771.3
0.0718586 0.0239699 0.02875 -3782.16
0.0732622 0.0240876 0.02875 -3787.86
0.381532 0.0242143 0.02875 -3355.76
0.383881 0.0240961 0.02875 -3335.23
0.38529 0.0240242 0.02875 -3323.67
0.387634 0.0239032 0.02875 -3304.78
0.389012 0.0238308 0.02875 -3292.71
0.39187 0.0236784 0.02875 -3269.46
0.3914 0.0237037 0.02875 -3273.64
0.39234 0.0236529 0.02875 -3265.26
0.39281 0.0236273 0.02875 -3261.57
0.395624 0.0234728 0.02875 -3239.52
0.395156 0.0234986 0.02875 -3242.98
0.396092 0.0234466 0.02875 -3235.27
0.39656 0.0234204 0.02875 -3231.28
0.12872 0.0271524 0.02875 -3978.15
0.128255 0.0271362 0.02875 -3976.77
0.129189 0.0271686 0.02875 -3979.81
0.129657 0.0271849 0.02875 -3981.62
0.132474 0.0272791 0.02875 -3990.97
0.132004 0.0272638 0.02875 -3989.79
0.132943 0.0272942 0.02875 -3992.53
0.133412 0.0273092 0.02875 -3994.32
0.136231 0.0273967 0.02875 -4003.99
0.135761 0.0273823 0.02875 -4002.53
0.136701 0.0274106 0.02875 -4005.45
0.137171 0.0274245 0.02875 -4007.06
0.139991 0.0275057 0.02875 -4017.25
0.139521 0.0274924 0.02875 -4015.29
0.140461 0.0275187 0.02875 -4018.55
0.14093 0.0275315 0.02875 -4020.28
0.143291 0.0275948 0.02875 -4028.4
0.144695 0.027631 0.02875 -4033.31
0.147042 0.0276895 0.02875 -4041.42
0.148451 0.0277234 0.02875 -4046.39
0.1508 0.0277779 0.02875 -4054.73
0.152209 0.0278094 0.02875 -4060.12
0.154558 0.0278595 0.02875 -4068.47
0.155968 0.027888 0.02875 -4074.05
0.158318 0.0279323 0.02875 -4081.8
0.159727 0.0279572 0.02875 -4086.99
0.162077 0.0279964 0.02875 -4094.99
0.163471 0.028018 0.02875 -4099.94
0.259764 0.0280274 0.02875 -4258.46
0.261231 0.0280103 0.02875 -4254.66
0.263581 0.0279814 0.02875 -4249.6
0.264991 0.0279631 0.02875 -4245.93
0.26734 0.0279307 0.02875 -4239.69
0.26875 0.0279102 0.02875 -4235.51
0.2711 0.0278737 0.02875 -4228.19
0.272509 0.0278505 0.02875 -4223.31
0.274859 0.0278092 0.02875 -4214.39
0.276268 0.0277831 0.02875 -4208.79
0.278617 0.0277369 0.02875 -4198.16
0.280026 0.0277079 0.02875 -4191.99
0.282374 0.0276574 0.02875 -4179.9
0.283784 0.027626 0.02875 -4173
0.286103 0.0275724 0.02875 -4159.29
0.287562 0.0275376 0.02875 -4151.27
0.290367 0.0274689 0.02875 -4133.75
0.289897 0.0274806 0.02875 -4137.02
0.290836 0.0274571 0.02875 -4130.74
0.291306 0.0274453 0.02875 -4127.89
0.294126 0.0273734 0.02875 -4109.36
0.293656 0.0273856 0.02875 -4112.83
0.294596 0.0273612 0.02875 -4106.27
0.295066 0.027349 0.02875 -4102.85
0.297884 0.027275 0.02875 -4083.73
0.297414 0.0272874 0.02875 -4087.13
0.298353 0.0272625 0.02875 -4080.07
0.298823 0.02725 0.02875 -4076.76
0.30164 0.0271746 0.02875 -4056.67
0.301171 0.0271872 0.02875 -4060.03
0.30211 0.027162 0.02875 -4052.95
0.30258 0.0271493 0.02875 -4049.77
0.165376 -0.0280461 0.02875 1188.85
0.167719 -0.0280785 0.02875 1179.34
0.169128 -0.0280967 0.02875 1173.43
0.171477 -0.0281254 0.02875 1164.24
0.172887 -0.0281418 0.02875 1158.34
0.175236 -0.0281675 0.02875 1149.19
0.176646 -0.0281823 0.02875 1143.42
0.178995 -0.0282056 0.02875 1134.26
0.180405 -0.0282191 0.02875 1128.6
0.182754 -0.0282407 0.02875 1118.76
0.184164 -0.0282532 0.02875 1112.89
0.186513 -0.0282726 0.02875 1102.53
0.187923 -0.0282833 0.02875 1096.81
0.190273 -0.0282996 0.02875 1087.13
0.191682 -0.0283086 0.02875 1081.71
0.194032 -0.0283223 0.02875 1072.17
0.195442 -0.0283294 0.02875 1066.33
0.197791 -0.0283401 0.02875 1057.02
0.199201 -0.0283456 0.02875 1051.28
0.201551 -0.0283534 0.02875 1042.18
0.202961 -0.0283573 0.02875 1036.33
0.20531 -0.028362 0.02875 1027.63
0.20672 -0.0283642 0.02875 1021.58
0.20907 -0.028366 0.02875 1012.71
0.210479 -0.0283664 0.02875 1006.96
0.212829 -0.0283655 0.02875 998.146
0.214239 -0.0283641 0.02875 992.703
0.216588 -0.02836 0.02875 983.833
0.217998 -0.0283565 0.02875 979.028
0.220348 -0.0283492 0.02875 970.352
0.221757 -0.0283437 0.02875 965.555
0.224107 -0.0283334 0.02875 957.35
0.225517 -0.0283263 0.02875 952.414
0.227866 -0.0283131 0.02875 944.128
0.229276 -0.0283043 0.02875 939.007
0.231626 -0.0282886 0.02875 930.919
0.233036 -0.0282783 0.02875 925.901
0.235385 -0.02826 0.02875 918.095
0.236795 -0.0282484 0.02875 912.658
0.239144 -0.028228 0.02875 904.903
0.240554 -0.0282152 0.02875 899.621
0.242903 -0.0281928 0.02875 891.517
0.244313 -0.0281788 0.02875 886.641
0.246662 -0.0281546 0.02875 877.648
0.248072 -0.0281395 0.02875 872.926
0.250421 -0.0281134 0.02875 863.622
0.251831 -0.028097 0.02875 858.88
0.25418 -0.0280687 0.02875 849.773
0.255588 -0.0280511 0.02875 844.277
0.0775093 -0.0243621 0.02875 1729.96
0.078904 -0.0244748 0.02875 1715.78
0.0812493 -0.02466 0.02875 1693.41
0.0981777 -0.0257586 0.02875 1562.42
0.0977143 -0.0257329 0.02875 1565.56
0.0995819 -0.0258351 0.02875 1552.97
0.100051 -0.0258605 0.02875 1549.87
0.101927 -0.0259604 0.02875 1537.26
0.101457 -0.0259356 0.02875 1540.32
0.105789 -0.02616 0.02875 1511.41
0.103337 -0.0260342 0.02875 1527.71
0.103807 -0.0260586 0.02875 1524.72
0.107105 -0.0262261 0.02875 1502.43
0.107573 -0.0262493 0.02875 1499.59
0.109448 -0.0263413 0.02875 1487.1
0.108979 -0.0263185 0.02875 1490
0.110855 -0.0264092 0.02875 1477.35
0.111325 -0.0264314 0.02875 1474.59
0.113205 -0.0265194 0.02875 1462.3
0.112735 -0.0264977 0.02875 1465.02
0.1146 -0.0265836 0.02875 1453
0.115144 -0.0266081 0.02875 1449.57
0.127403 -0.0271056 0.02875 1375.03
0.127809 -0.0271202 0.02875 1372.97
0.130596 -0.027217 0.02875 1357.23
0.130126 -0.027201 0.02875 1360.4
0.131066 -0.0272326 0.02875 1354.9
0.131535 -0.0272481 0.02875 1352.72
0.134352 -0.027339 0.02875 1337.62
0.133882 -0.0273241 0.02875 1340.37
0.134822 -0.0273536 0.02875 1334.65
0.135291 -0.0273679 0.02875 1332.78
0.138111 -0.0274521 0.02875 1318.5
0.137641 -0.0274383 0.02875 1320.97
0.138581 -0.0274657 0.02875 1315.57
0.139051 -0.027479 0.02875 1313.46
0.141929 -0.0275587 0.02875 1299.52
0.141385 -0.0275439 0.02875 1301.91
0.142844 -0.0275831 0.02875 1294.19
0.145164 -0.0276429 0.02875 1283.2
0.146573 -0.0276782 0.02875 1275.87
0.148921 -0.0277345 0.02875 1264.43
0.15033 -0.0277673 0.02875 1257.66
0.152679 -0.0278198 0.02875 1245.17
0.154088 -0.0278498 0.02875 1238.77
0.156438 -0.0278971 0.02875 1226.89
0.157848 -0.0279236 0.02875 1221.07
0.160197 -0.0279653 0.02875 1210.52
0.161607 -0.0279886 0.02875 1204.73
0.164014 -0.0280262 0.02875 1194.21
0.257958 -0.0280202 0.02875 835.449
0.259351 -0.0280012 0.02875 829.829
0.261701 -0.0279681 0.02875 821.106
0.263111 -0.0279473 0.02875 815.521
0.26546 -0.0279113 0.02875 806.411
0.26687 -0.0278889 0.02875 800.586
0.26922 -0.0278498 0.02875 791.931
0.27063 -0.0278255 0.02875 785.863
0.272979 -0.0277833 0.02875 777.582
0.274388 -0.027757 0.02875 772.252
0.276737 -0.0277121 0.02875 763.773
0.278146 -0.0276846 0.02875 758.494
0.280495 -0.027638 0.02875 748.289
0.281903 -0.0276093 0.02875 743.186
0.284159 -0.0275623 0.02875 733.728
0.28467 -0.0275514 0.02875 731.418
0.285214 -0.0275398 0.02875 728.921
0.285668 -0.02753 0.02875 726.289
0.288487 -0.0274675 0.02875 713.846
0.288017 -0.0274782 0.02875 716.432
0.288957 -0.0274567 0.02875 712.453
0.289427 -0.0274459 0.02875 710.561
0.292246 -0.0273791 0.02875 697.596
0.291776 -0.0273904 0.02875 700.383
0.292716 -0.0273675 0.02875 695.614
0.293186 -0.0273557 0.02875 694.17
0.296004 -0.0272839 0.02875 681.801
0.295535 -0.027296 0.02875 684.114
0.296474 -0.0272715 0.02875 678.813
0.296944 -0.0272589 0.02875 677.633
0.29976 -0.0271809 0.02875 666.104
0.299291 -0.0271942 0.02875 668.255
0.30023 -0.0271675 0.02875 663.855
0.3007 -0.0271539 0.02875 661.658
0.317638 -0.0265948 0.02875 590.542
0.318093 -0.0265782 0.02875 587.181
0.319972 -0.0265074 0.02875 578.85
0.319502 -0.0265251 0.02875 581.356
0.321382 -0.0264525 0.02875 572.151
0.321852 -0.026434 0.02875 569.736
0.323729 -0.026358 0.02875 560.659
0.323261 -0.0263771 0.02875 562.984
0.325137 -0.0262989 0.02875 553.737
0.325605 -0.026279 0.02875 551.707
0.327476 -0.0261971 0.02875 543.092
0.327012 -0.0262177 0.02875 544.944
0.329385 -0.0261096 0.02875 534.523
0.33125 -0.0260206 0.02875 526.554
0.33078 -0.0260435 0.02875 527.44
0.33266 -0.0259508 0.02875 519.655
0.333129 -0.0259268 0.02875 519.517
0.335004 -0.0258291 0.02875 513.312
0.334536 -0.0258542 0.02875 512.78
0.336408 -0.0257537 0.02875 508.676
0.336872 -0.0257285 0.02875 508.191
0.355686 -0.0245706 0.02875 421.14
0.357092 -0.0244669 0.02875 415.113
0.359339 -0.0242947 0.02875 406.377
0.0436552 -0.0208089 0.02875 2080.86
0.0479081 -0.0213873 0.02875 2028.42
0.0530779 -0.0220098 0.02875 1970.69
0.0526165 -0.0219564 0.02875 1976.35
0.0568423 -0.0224356 0.02875 1930.53
0.0563806 -0.0223841 0.02875 1935.92
0.0544663 -0.0221687 0.02875 1956.4
0.054932 -0.0222215 0.02875 1950.91
0.0582296 -0.0225888 0.02875 1915.93
0.0586964 -0.0226402 0.02875 1910.72
0.0600942 -0.0227928 0.02875 1895.67
0.0666916 -0.0235021 0.02875 1815.45
0.0662308 -0.0234526 0.02875 1822.32
0.0671566 -0.0235519 0.02875 1807.86
0.067624 -0.0236022 0.02875 1799.28
0.0700317 -0.0237833 0.02875 1782.77
0.0714007 -0.0238705 0.02875 1786.31
0.0737325 -0.0240541 0.02875 1766.99
0.0751413 -0.0241687 0.02875 1753.56
0.360854 -0.0241734 0.02875 399.367
0.363198 -0.0239772 0.02875 394.009
0.36457 -0.0238576 0.02875 388.657
0.367432 -0.0235955 0.02875 387.68
0.366963 -0.0236393 0.02875 387.306
0.3679 -0.0235517 0.02875 386.442
0.368367 -0.0235075 0.02875 383.885
0.376362 -0.0227047 0.02875 369.24
0.375909 -0.0227529 0.02875 372.415
0.377763 -0.0225543 0.02875 370.275
0.378225 -0.022504 0.02875 366.112
0.380124 -0.0222933 0.02875 363.805
0.379623 -0.0223494 0.02875 367.951
0.381526 -0.0221335 0.02875 365.071
0.381991 -0.0220801 0.02875 362.345
0.383377 -0.0219175 0.02875 363.102
0.393264 -0.0206505 0.02875 361.055
0.02256 -0.0167628 0.02875 2341.35
0.028665 -0.018172 0.02875 2278.62
0.0305279 -0.0185474 0.02875 2255.91
0.030036 -0.0184499 0.02875 2261.79
0.0319226 -0.0188181 0.02875 2238.21
0.0323862 -0.0189068 0.02875 2232.38
0.0366347 -0.0196849 0.02875 2175.64
0.0361768 -0.0196037 0.02875 2182
0.0356916 -0.0195175 0.02875 2188.19
0.0370902 -0.0197645 0.02875 2168.49
0.0375491 -0.0198428 0.02875 2162.57
0.0399076 -0.0202345 0.02875 2131.03
0.394667 -0.0204536 0.02875 361.849
0.397009 -0.0201141 0.02875 364.718
0.397961 -0.019972 0.02875 359.934
0.398451 -0.0198961 0.02875 365.417
0.40409 -0.0189716 0.02875 402.874
0.404556 -0.0188903 0.02875 410.134
0.405926 -0.0186505 0.02875 420.614
0.406412 -0.0185637 0.02875 428.848
0.407826 -0.0183105 0.02875 440.667
0.408287 -0.0182267 0.02875 447.458
0.415804 -0.0168357 0.02875 526.373
0.0112491 -0.0131533 0.02875 2181.41
0.0141078 -0.0142403 0.02875 2305.38
0.015033 -0.0145618 0.02875 2324.91
0.01693 -0.0151856 0.02875 2348.73
0.0211358 -0.0163946 0.02875 2350.15
0.417239 -0.0165687 0.02875 539.515
0.420062 -0.0160481 0.02875 564.372
0.419597 -0.0161331 0.02875 561.56
0.420519 -0.0159647 0.02875 567.577
0.420973 -0.015882 0.02875 571.648
0.425233 -0.0151248 0.02875 597.718
0.424767 -0.0152061 0.02875 594.801
0.426605 -0.0148907 0.02875 601.236
0.427091 -0.0148081 0.02875 603.013
0.428967 -0.0144927 0.02875 606.795
0.428512 -0.0145692 0.02875 605.103
0.436042 -0.0133105 0.02875 628.667
0.00756061 -0.0113519 0.02875 1758.3
0.00989688 -0.0125694 0.02875 2056.07
0.43837 -0.0129258 0.02875 637.052
0.439791 -0.0126924 0.02875 641.519
0.442611 -0.0122332 0.02875 650.977
0.442151 -0.0123079 0.02875 649.099
0.443068 -0.0121592 0.02875 653.451
0.443528 -0.0120854 0.02875 654.691
0.444013 -0.0120076 0.02875 656.073
0.447791 -0.011408 0.02875 667.241
0.447298 -0.0114851 0.02875 667.339
0.449175 -0.0111916 0.02875 672.345
0.449633 -0.0111207 0.02875 672.593
0.451542 -0.0108274 0.02875 677.619
0.451079 -0.0108978 0.02875 676.759
0.452921 -0.0106184 0.02875 680.952
0.460946 -0.00945289 0.02875 692.307
0.462328 -0.00925971 0.02875 693.437
0.00209808 -0.00670339 0.02875 -1410.28
0.464701 -0.00893224 0.02875 695.919
0.466081 -0.00874478 0.02875 696.862
0.468914 -0.00836523 0.02875 700.703
0.468455 -0.00842617 0.02875 699.158
0.469377 -0.00830442 0.02875 700.195
0.474109 -0.00769239 0.02875 703.109
0.47551 -0.0075159 0.02875 704.154
0.475972 -0.00745806 0.02875 704.224
0.477868 -0.00722361 0.02875 704.97
0.477377 -0.00728393 0.02875 705.485
0.479271 -0.00705269 0.02875 706.127
0.479734 -0.00699685 0.02875 705.86
0.491023 -0.00570719 0.02875 706.774
0.492416 -0.0055566 0.02875 706.971
0.607573 -0.00565636 0.02875 -481.763
0.494783 -0.00530495 0.02875 707.676
0.496187 -0.00515819 0.02875 707.39
0.499028 -0.00486779 0.02875 708.979
0.498482 -0.00492289 0.02875 709.034
0.499482 -0.00482234 0.02875 708.035
0.499951 -0.00477541 0.02875 708.204
0.502664 -0.00450947 0.02875 710.434
0.502257 -0.00454871 0.02875 709.258
0.509351 -0.003897 0.02875 708.619
0.509821 -0.00385636 0.02875 708.47
0.511694 -0.00369806 0.02875 708.006
0.511227 -0.00373701 0.02875 708.481
0.513067 -0.00358549 0.02875 708.157
0.513473 -0.00355295 0.02875 707.301
0.51546 -0.00339736 0.02875 705.369
0.514991 -0.00343333 0.02875 706.56
0.516868 -0.00329104 0.02875 705.416
0.517336 -0.00325686 0.02875 703.794
0.51918 -0.00312484 0.02875 701.709
0.518733 -0.00315594 0.02875 703.564
0.537562 -0.00209002 0.02875 668.302
0.539897 -0.00199373 0.02875 663.965
0.541306 -0.0019401 0.02875 661.534
0.543655 -0.00185769 0.02875 656.918
0.545063 -0.00181305 0.02875 654.647
0.547412 -0.00174717 0.02875 649.374
0.548821 -0.00171289 0.02875 647.891
0.551165 -0.00166719 0.02875 640.686
0.563873 -0.00166789 0.02875 585.978
0.566217 -0.00171487 0.02875 572.983
0.567626 -0.00175107 0.02875 562.756
0.569974 -0.00182188 0.02875 547.988
0.571383 -0.0018724 0.02875 538.746
0.573731 -0.00196874 0.02875 524.648
0.575141 -0.00204034 0.02875 514.537
0.58832 -0.00318562 0.02875 266.023
0.58878 -0.00323432 0.02875 254.203
0.590649 -0.00343039 0.02875 207.552
0.59018 -0.00338222 0.02875 218.464
0.592152 -0.00358343 0.02875 186.747
0.592567 -0.00362705 0.02875 181.665
0.59441 -0.00382584 0.02875 154.583
0.593943 -0.00377343 0.02875 152.708
0.595831 -0.00399442 0.02875 103.454
0.600534 -0.0046241 0.02875 -90.5628
0.600076 -0.004562 0.02875 -70.118
0.599131 -0.00443145 0.02875 -25.5136
0.600995 -0.00468621 0.02875 -106.53
0.601459 -0.00474871 0.02875 -122.626
0.603829 -0.00507992 0.02875 -227.772
0.605217 -0.00528606 0.02875 -308.897
0.554934 -0.00162285 0.02875 628.91
0.556344 -0.0016154 0.02875 624.166
0.558694 -0.00161565 0.02875 614.739
0.560103 -0.00162249 0.02875 605.769
0.562505 -0.00164703 0.02875 595.23
0.601456 0.001473 0.02875 -1215.25
0.604265 0.000940872 0.02875 -1185.98
0.6038 0.00102975 0.02875 -1190.53
0.605663 0.000671921 0.02875 -1174.43
0.604719 0.000853721 0.02875 -1181.94
0.605176 0.000765646 0.02875 -1178.1
0.578876 0.00535873 0.02875 -1554.21
0.581209 0.00498107 0.02875 -1516.55
0.581695 0.00490176 0.02875 -1508.8
0.582188 0.00482137 0.02875 -1501.34
0.582657 0.00474452 0.02875 -1493.22
0.590647 0.00341074 0.02875 -1367.23
0.592029 0.00317713 0.02875 -1347.53
0.592487 0.00309906 0.02875 -1340.06
0.554933 0.00900325 0.02875 -1920.06
0.556314 0.0088059 0.02875 -1900.69
0.559144 0.00839417 0.02875 -1857.96
0.558685 0.00846181 0.02875 -1865.91
0.56055 0.00818627 0.02875 -1837.82
0.559602 0.00832659 0.02875 -1851.15
0.560063 0.00825841 0.02875 -1844.42
0.568082 0.00704347 0.02875 -1721.01
0.567622 0.00711435 0.02875 -1727.98
0.00989089 0.0125669 0.02875 -3603.12
0.524861 0.0128118 0.02875 -2271.84
0.526257 0.0126486 0.02875 -2256.75
0.529087 0.0123146 0.02875 -2227.51
0.528622 0.0123698 0.02875 -2232.46
0.529554 0.0122591 0.02875 -2222.35
0.530019 0.0122035 0.02875 -2217.29
0.539898 0.0109955 0.02875 -2108.17
0.541762 0.0107604 0.02875 -2086.83
0.5413 0.0108192 0.02875 -2092.17
0.0155138 0.0147273 0.02875 -3548.36
0.0150364 0.0145656 0.02875 -3551.51
0.0169259 0.0151867 0.02875 -3549.37
0.0211358 0.0163945 0.02875 -3548.19
0.48869 0.016648 0.02875 -2592.46
0.491015 0.0164248 0.02875 -2575.2
0.492327 0.0162971 0.02875 -2563.91
0.495249 0.0160097 0.02875 -2541.32
0.494782 0.016056 0.02875 -2544.93
0.495715 0.0159634 0.02875 -2537.01
0.496176 0.0159172 0.02875 -2533.25
0.507941 0.014702 0.02875 -2433.19
0.507487 0.0147505 0.02875 -2437.43
0.509343 0.0145519 0.02875 -2421.13
0.509804 0.0145021 0.02875 -2416.65
0.0281758 0.0180691 0.02875 -3567.03
0.028664 0.0181728 0.02875 -3569.61
0.0305261 0.0185479 0.02875 -3577.18
0.030035 0.0184497 0.02875 -3574.39
0.0356915 0.0195174 0.02875 -3603.82
0.0366352 0.0196853 0.02875 -3609.63
0.0361774 0.0196043 0.02875 -3607.05
0.0370898 0.019764 0.02875 -3611.66
0.0375482 0.0198423 0.02875 -3614.25
0.0399077 0.0202347 0.02875 -3627.53
0.0413271 0.0204592 0.02875 -3634.77
0.443561 0.0203865 0.02875 -2896.69
0.445907 0.0202165 0.02875 -2881.63
0.447304 0.0201141 0.02875 -2873.41
0.45014 0.019903 0.02875 -2854.64
0.44967 0.0199383 0.02875 -2857.79
0.45061 0.0198677 0.02875 -2851.53
0.45108 0.0198323 0.02875 -2849.14
0.453861 0.0196206 0.02875 -2830.67
0.453414 0.019655 0.02875 -2834.4
0.454269 0.0195889 0.02875 -2827.97
0.466536 0.0186079 0.02875 -2747.48
0.467997 0.018487 0.02875 -2737.7
0.468467 0.0184479 0.02875 -2734.77
0.470338 0.018291 0.02875 -2722.54
0.469872 0.0183303 0.02875 -2725.49
0.471658 0.0181795 0.02875 -2713.85
0.051665 0.021872 0.02875 -3683.65
0.0530711 0.0220434 0.02875 -3690.28
0.0526122 0.0219883 0.02875 -3688.22
0.0544656 0.0222098 0.02875 -3697.38
0.054931 0.0222641 0.02875 -3699.38
0.0666892 0.0235069 0.02875 -3757.81
0.0662243 0.023463 0.02875 -3756.28
0.0671556 0.0235503 0.02875 -3759.96
0.0676237 0.0235938 0.02875 -3762.32
0.0700807 0.023816 0.02875 -3774.31
0.0713928 0.0239298 0.02875 -3779.63
0.0737322 0.0241265 0.02875 -3790.27
0.382002 0.0241908 0.02875 -3351.01
0.383412 0.0241199 0.02875 -3339.62
0.38576 0.0240003 0.02875 -3320.07
0.387165 0.0239274 0.02875 -3308.05
0.389419 0.0238093 0.02875 -3289.8
0.389933 0.0237821 0.02875 -3285.42
0.390476 0.0237531 0.02875 -3280.59
0.390931 0.0237288 0.02875 -3277.08
0.393749 0.0235763 0.02875 -3254.48
0.39328 0.0236019 0.02875 -3258.22
0.394219 0.0235505 0.02875 -3250.27
0.394688 0.0235246 0.02875 -3246.52
0.397469 0.0233694 0.02875 -3224.67
0.397023 0.0233944 0.02875 -3227.79
0.397875 0.0233465 0.02875 -3221.02
0.415367 0.0222929 0.02875 -3087.12
0.415836 0.0222631 0.02875 -3083.15
0.417715 0.0221429 0.02875 -3069.68
0.417246 0.0221729 0.02875 -3073.07
0.419119 0.0220522 0.02875 -3059.67
0.419586 0.022022 0.02875 -3056.45
0.420901 0.0219364 0.02875 -3046.63
0.0981776 0.0257642 0.02875 -3876.93
0.0977141 0.0257383 0.02875 -3875.39
0.0995816 0.0258412 0.02875 -3881.04
0.10005 0.0258668 0.02875 -3882.79
0.101927 0.0259671 0.02875 -3888.5
0.101457 0.0259421 0.02875 -3886.79
0.103337 0.0260408 0.02875 -3892.73
0.103807 0.0260654 0.02875 -3894.51
0.105276 0.0261403 0.02875 -3898.8
0.127403 0.0271056 0.02875 -3973.71
0.127808 0.0271203 0.02875 -3975.45
0.130597 0.0272169 0.02875 -3984.52
0.130127 0.0272011 0.02875 -3983.29
0.131066 0.0272326 0.02875 -3986.15
0.131535 0.0272482 0.02875 -3987.88
0.134352 0.0273389 0.02875 -3997.4
0.133882 0.0273242 0.02875 -3996.2
0.134821 0.0273534 0.02875 -3998.98
0.135291 0.0273679 0.02875 -4000.64
0.138111 0.0274522 0.02875 -4010.62
0.137641 0.0274384 0.02875 -4008.84
0.138581 0.0274657 0.02875 -4011.89
0.139051 0.027479 0.02875 -4013.54
0.141927 0.0275587 0.02875 -4023.88
0.141385 0.027544 0.02875 -4021.86
0.142845 0.0275831 0.02875 -4026.79
0.145164 0.0276429 0.02875 -4034.81
0.146573 0.0276781 0.02875 -4039.75
0.148921 0.0277344 0.02875 -4047.99
0.15033 0.0277673 0.02875 -4053.22
0.152679 0.0278196 0.02875 -4061.64
0.154088 0.0278499 0.02875 -4067.11
0.156438 0.0278971 0.02875 -4075.14
0.157848 0.0279237 0.02875 -4080.48
0.160197 0.0279653 0.02875 -4088.46
0.161607 0.0279887 0.02875 -4093.45
0.164013 0.0280262 0.02875 -4101.83
0.261701 0.0280047 0.02875 -4253.78
0.263111 0.0279874 0.02875 -4250.3
0.26546 0.0279568 0.02875 -4244.86
0.26687 0.0279374 0.02875 -4240.93
0.26922 0.027903 0.02875 -4234.05
0.27063 0.0278812 0.02875 -4229.74
0.272979 0.0278425 0.02875 -4221.61
0.274389 0.0278178 0.02875 -4216.28
0.276738 0.0277741 0.02875 -4206.57
0.278147 0.0277465 0.02875 -4200.58
0.280496 0.0276979 0.02875 -4189.03
0.281905 0.0276677 0.02875 -4182.68
0.284253 0.0276153 0.02875 -4169.89
0.285656 0.0275828 0.02875 -4162.44
0.288487 0.0275152 0.02875 -4145.48
0.288017 0.0275266 0.02875 -4148.54
0.288957 0.0275038 0.02875 -4142.59
0.289427 0.0274922 0.02875 -4139.71
0.292246 0.0274216 0.02875 -4121.83
0.291776 0.0274336 0.02875 -4124.97
0.292716 0.0274096 0.02875 -4118.78
0.293186 0.0273976 0.02875 -4115.56
0.296005 0.0273245 0.02875 -4096.71
0.295535 0.0273367 0.02875 -4099.89
0.296475 0.0273121 0.02875 -4093.27
0.296945 0.0272997 0.02875 -4090.06
0.299762 0.0272249 0.02875 -4070.3
0.299292 0.0272374 0.02875 -4073.47
0.300231 0.0272124 0.02875 -4066.74
0.300701 0.0271998 0.02875 -4063.42
0.303512 0.0271242 0.02875 -4042.76
0.303048 0.0271367 0.02875 -4046.32
0.303959 0.0271121 0.02875 -4039.3
0.304365 0.0271012 0.02875 -4036.34
0.336904 0.0261193 0.02875 -3764.32
0.338769 0.0260527 0.02875 -3746.77
0.338299 0.0260697 0.02875 -3751.16
0.340179 0.0260016 0.02875 -3733.79
0.340648 0.0259843 0.02875 -3729.33
0.342527 0.0259148 0.02875 -3712.1
0.342058 0.0259324 0.02875 -3716.62
0.343935 0.025862 0.02875 -3699.3
0.344405 0.0258442 0.02875 -3694.95
0.346282 0.0257725 0.02875 -3677.85
0.345812 0.0257905 0.02875 -3682.32
0.347683 0.0257182 0.02875 -3665.19
0.34813 0.0257007 0.02875 -3660.45
0.083615 -0.0248403 0.02875 1671.61
0.0840789 -0.0248749 0.02875 1667.42
0.0873595 -0.0251085 0.02875 1638.24
0.0878284 -0.0251404 0.02875 1634.73
0.346772 -0.0251617 0.02875 463.982
0.347228 -0.0251339 0.02875 461.851
0.350513 -0.024926 0.02875 443.804
0.350981 -0.0248952 0.02875 443.32
0.0460196 -0.0211402 0.02875 2051.12
0.0464814 -0.0212028 0.02875 2045.32
0.388111 -0.021336 0.02875 355.67
0.388583 -0.0212752 0.02875 357.987
0.0122064 -0.0135405 0.02875 2236.82
0.0117233 -0.0133507 0.02875 2206.31
0.0126641 -0.0137112 0.02875 2258.1
0.433223 -0.0137798 0.02875 619
0.433692 -0.0137017 0.02875 620.265
0.00517022 -0.00982323 0.02875 1095.41
0.456232 -0.0101274 0.02875 686.682
0.00424913 -0.00909015 0.02875 604.98
0.485856 -0.00628015 0.02875 706.687
0.486327 -0.00622656 0.02875 706.582
0.61 -0.00592184 0.02875 -2256.55
0.609849 -0.00607166 0.02875 -439.472
0.527618 -0.00258936 0.02875 687.04
0.530968 -0.00240528 0.02875 681.138
0.531438 -0.00238088 0.02875 679.679
0.53472 -0.00221794 0.02875 674.962
0.535188 -0.00219629 0.02875 672.989
0.576657 -0.00212931 0.02875 504.701
0.579842 -0.00236277 0.02875 451.792
0.580311 -0.002401 0.02875 448.101
0.61 -0.00546584 0.02875 -1224.93
0.61 -0.00212006 0.02875 -1331.36
0.598636 0.00199839 0.02875 -1249.97
0.5991 0.00191174 0.02875 -1243.85
0.61 -0.00164928 0.02875 -1327.75
0.576082 0.00580326 0.02875 -1599.17
0.576551 0.00572941 0.02875 -1591.86
0.00473543 0.00950818 0.02875 -3868.99
0.550219 0.00965657 0.02875 -1984.5
0.55397 0.00913892 0.02875 -1933.16
0.553485 0.00920718 0.02875 -1939.81
0.57277 0.00631919 0.02875 -1649.03
0.00516855 0.00982754 0.02875 -3772.82
0.519671 0.0134091 0.02875 -2323.18
0.520161 0.0133532 0.02875 -2318.5
0.523899 0.0129235 0.02875 -2280.85
0.523414 0.0129799 0.02875 -2285.78
0.549734 0.00972199 0.02875 -1990.09
0.0117274 0.013354 0.02875 -3570.78
0.0122102 0.0135387 0.02875 -3563.97
0.0126646 0.0137107 0.02875 -3560.51
0.0234651 0.0169906 0.02875 -3551.72
0.0239523 0.0171093 0.02875 -3552.91
0.485849 0.0169165 0.02875 -2614.17
0.486314 0.0168728 0.02875 -2610.49
0.515933 0.01383 0.02875 -2359.54
0.516402 0.0137775 0.02875 -2355.13
0.0422743 0.0206051 0.02875 -3640.77
0.0427316 0.0206739 0.02875 -3642.19
0.436983 0.0208521 0.02875 -2938.88
0.437453 0.0208194 0.02875 -2936.1
0.440725 0.0205892 0.02875 -2914.66
0.441172 0.0205575 0.02875 -2912.06
0.478351 0.0175986 0.02875 -2668
0.478806 0.0175584 0.02875 -2665.22
0.482052 0.0172665 0.02875 -2641.69
0.482457 0.0172295 0.02875 -2639.13
0.0460202 0.0211416 0.02875 -3657.86
0.0464821 0.0212047 0.02875 -3660.05
0.076124 0.0243188 0.02875 -3800.82
0.0765696 0.0243535 0.02875 -3801.99
0.079841 0.0245998 0.02875 -3815.21
0.0803102 0.0246342 0.02875 -3817.04
0.373073 0.0246236 0.02875 -3430.17
0.373543 0.0246016 0.02875 -3426.53
0.37683 0.0244447 0.02875 -3396.47
0.377298 0.0244221 0.02875 -3392.61
0.429464 0.0213672 0.02875 -2987.65
0.429934 0.0213355 0.02875 -2984.32
0.433217 0.0211122 0.02875 -2963.47
0.433683 0.0210802 0.02875 -2960.14
0.0836081 0.0248662 0.02875 -3828.79
0.0840754 0.0248984 0.02875 -3830.83
0.0873589 0.0251156 0.02875 -3841.62
0.0878137 0.025145 0.02875 -3843.43
0.166309 0.0280594 0.02875 -4109.56
0.166779 0.0280658 0.02875 -4111.17
0.170068 0.0281086 0.02875 -4122.47
0.170538 0.0281143 0.02875 -4123.86
0.173826 0.0281523 0.02875 -4135.31
0.174296 0.0281575 0.02875 -4136.63
0.177586 0.0281917 0.02875 -4147.94
0.178055 0.0281964 0.02875 -4149.41
0.181344 0.0282278 0.02875 -4160.7
0.181814 0.0282322 0.02875 -4162.54
0.185104 0.028261 0.02875 -4173.87
0.185573 0.028265 0.02875 -4175.71
0.188863 0.02829 0.02875 -4186.43
0.189333 0.0282932 0.02875 -4188.25
0.192622 0.0283142 0.02875 -4198.67
0.193092 0.0283169 0.02875 -4200.37
0.196382 0.028334 0.02875 -4210.59
0.196852 0.028336 0.02875 -4211.97
0.200141 0.0283491 0.02875 -4221.89
0.200611 0.0283505 0.02875 -4223.37
0.2039 0.0283593 0.02875 -4232.79
0.20437 0.0283603 0.02875 -4233.95
0.20766 0.0283651 0.02875 -4242.62
0.20813 0.0283655 0.02875 -4243.64
0.211419 0.0283662 0.02875 -4251.82
0.211889 0.0283661 0.02875 -4253.08
0.215179 0.0283625 0.02875 -4260.06
0.215649 0.0283617 0.02875 -4261.41
0.218938 0.0283529 0.02875 -4266.53
0.219408 0.0283513 0.02875 -4267.88
0.222697 0.0283379 0.02875 -4272.26
0.223167 0.0283357 0.02875 -4272.89
0.226457 0.0283181 0.02875 -4276.63
0.226927 0.0283153 0.02875 -4276.94
0.230216 0.028294 0.02875 -4279.57
0.230686 0.0282907 0.02875 -4279.75
0.233976 0.0282667 0.02875 -4281.38
0.234445 0.0282631 0.02875 -4280.84
0.237735 0.0282365 0.02875 -4281.22
0.238205 0.0282326 0.02875 -4280.97
0.241494 0.0282042 0.02875 -4279.9
0.241964 0.0282002 0.02875 -4279.82
0.245253 0.0281707 0.02875 -4277.47
0.245723 0.0281665 0.02875 -4277.34
0.249012 0.0281364 0.02875 -4274.1
0.249482 0.028132 0.02875 -4273.82
0.252771 0.0281008 0.02875 -4269.66
0.253241 0.0280962 0.02875 -4269.02
0.25653 0.0280628 0.02875 -4263.75
0.256999 0.0280578 0.02875 -4262.93
0.361795 0.0251352 0.02875 -3533.18
0.362265 0.0251147 0.02875 -3528.34
0.365553 0.0249689 0.02875 -3498.8
0.366023 0.0249479 0.02875 -3494.1
0.369304 0.0247987 0.02875 -3464.55
0.369768 0.0247774 0.02875 -3460.4
0.0854809 -0.0249768 0.02875 1654.6
0.0859499 -0.0250104 0.02875 1650.71
0.115657 -0.0266311 0.02875 1446.45
0.117442 -0.0267099 0.02875 1434.98
0.116062 -0.0266493 0.02875 1443.82
0.117911 -0.0267303 0.02875 1432.01
0.119317 -0.0267903 0.02875 1422.92
0.121194 -0.0268681 0.02875 1411.11
0.119787 -0.0268101 0.02875 1420.11
0.121664 -0.0268871 0.02875 1408.56
0.123073 -0.0269432 0.02875 1399.67
0.124953 -0.0270155 0.02875 1388.57
0.123543 -0.0269614 0.02875 1397.25
0.125423 -0.027033 0.02875 1386.39
0.126891 -0.0270872 0.02875 1377.34
0.30354 -0.0270686 0.02875 651.69
0.305404 -0.0270099 0.02875 645.132
0.303995 -0.0270546 0.02875 649.239
0.305874 -0.0269949 0.02875 643.423
0.307284 -0.0269494 0.02875 638.333
0.309163 -0.0268881 0.02875 630.397
0.307754 -0.0269342 0.02875 636.31
0.309633 -0.0268725 0.02875 628.537
0.311042 -0.0268256 0.02875 622.244
0.31292 -0.0267621 0.02875 613.34
0.311511 -0.0268099 0.02875 620.142
0.313389 -0.0267459 0.02875 611.314
0.314797 -0.026697 0.02875 604.059
0.316582 -0.0266334 0.02875 595.17
0.315265 -0.0266804 0.02875 602.218
0.328841 -0.026135 0.02875 536.86
0.348637 -0.0250462 0.02875 454.049
0.349107 -0.0250163 0.02875 452.694
0.352378 -0.0248022 0.02875 434.102
0.352824 -0.0247717 0.02875 434.202
0.0610939 -0.0229012 0.02875 1884.43
0.0605977 -0.0228475 0.02875 1890.11
0.0615414 -0.0229496 0.02875 1879.63
0.0629261 -0.0230988 0.02875 1863.78
0.0648483 -0.0233046 0.02875 1841.05
0.0633942 -0.0231489 0.02875 1858.43
0.371209 -0.0232322 0.02875 382.033
0.373066 -0.0230465 0.02875 378.546
0.371663 -0.0231876 0.02875 380.267
0.373531 -0.0229994 0.02875 378.044
0.37536 -0.0228102 0.02875 375.8
0.374841 -0.0228643 0.02875 375.452
0.389972 -0.021095 0.02875 356.627
0.39043 -0.0210343 0.02875 358.183
0.0253435 -0.0174427 0.02875 2315.82
0.0258031 -0.0175474 0.02875 2311.2
0.0347321 -0.019345 0.02875 2201.31
0.0333645 -0.019092 0.02875 2218.92
0.0351999 -0.01943 0.02875 2194.18
0.401269 -0.0194474 0.02875 383.559
0.4036 -0.019056 0.02875 401.323
0.403113 -0.0191386 0.02875 398.581
0.401736 -0.0193705 0.02875 383.447
0.412538 -0.0174442 0.02875 492.464
0.412992 -0.0173596 0.02875 497.53
0.0155071 -0.0147248 0.02875 2332.54
0.0178474 -0.0154705 0.02875 2353.76
0.0182914 -0.0156005 0.02875 2355.03
0.416747 -0.0166603 0.02875 535.428
0.421917 -0.0157113 0.02875 579.729
0.422409 -0.015623 0.02875 581.366
0.423789 -0.0153773 0.02875 591.962
0.435065 -0.0134729 0.02875 625.43
0.00849874 -0.0118728 0.02875 1912.96
0.444504 -0.0119289 0.02875 656.965
0.444972 -0.0118538 0.02875 658.584
0.44635 -0.0116349 0.02875 663.247
0.44681 -0.011562 0.02875 664.39
0.457655 -0.00992126 0.02875 688.273
0.458117 -0.00985485 0.02875 688.493
0.00328401 -0.00821495 0.02875 -423.045
0.00244162 -0.00717465 0.02875 -685.973
0.470821 -0.0081149 0.02875 701.276
0.471286 -0.00805461 0.02875 701.456
0.472672 -0.00787542 0.02875 702.937
0.473132 -0.00781654 0.02875 703.426
0.473618 -0.00775485 0.02875 703.348
0.487725 -0.00607009 0.02875 706.673
0.488186 -0.00601861 0.02875 706.709
0.000906131 -0.0044319 0.02875 -3075.87
0.000735109 -0.00396394 0.02875 -3007.79
0.000555527 -0.00347256 0.02875 -3496.96
0.504651 -0.00432079 0.02875 710.27
0.503181 -0.00446026 0.02875 709.727
0.50512 -0.00427728 0.02875 709.624
0.506521 -0.00414819 0.02875 710.243
0.506982 -0.00410661 0.02875 710.123
0.529088 -0.00250665 0.02875 684.111
0.529558 -0.00248088 0.02875 682.952
0.532844 -0.00230907 0.02875 678.072
0.533313 -0.00228603 0.02875 676.305
0.537019 -0.00211357 0.02875 670.349
0.536505 -0.00213584 0.02875 671.962
0.577973 -0.00221877 0.02875 481.476
0.578439 -0.0022526 0.02875 481.225
0.581704 -0.00252294 0.02875 417.324
0.58225 -0.00257229 0.02875 409.466
0.596783 -0.00411538 0.02875 78.1298
0.598639 -0.00436334 0.02875 1.72095
0.597242 -0.00417601 0.02875 54.279
0.61 -0.00400441 0.02875 -1337.15
0.61 -0.00353329 0.02875 -1333.07
0.552527 -0.00164649 0.02875 639.211
0.606154 0.000578372 0.02875 -1170.97
0.609833 -9.23859e-05 0.02875 -1148.04
0.61 -0.000291981 0.02875 -1373.43
0.608506 0.000143473 0.02875 -1161.14
0.606618 0.000491429 0.02875 -1168.31
0.000588904 0.00352425 0.02875 -7435.06
0.00091348 0.00449902 0.02875 -7474.05
0.000747944 0.00401405 0.02875 -7086.99
0.577928 0.00551035 0.02875 -1569.74
0.578389 0.005437 0.02875 -1562.78
0.587335 0.00396794 0.02875 -1418.17
0.585477 0.00427823 0.02875 -1447.82
0.585936 0.00420188 0.02875 -1440.83
0.587827 0.00388541 0.02875 -1410.78
0.58921 0.00365289 0.02875 -1389
0.589669 0.0035757 0.02875 -1381.98
0.590155 0.00349383 0.02875 -1374.81
0.596745 0.00234756 0.02875 -1276.71
0.5972 0.0022639 0.02875 -1270.04
0.00264901 0.00722354 0.02875 -5457.86
0.00336987 0.00815508 0.02875 -4947.52
0.551643 0.00946269 0.02875 -1965.09
0.552106 0.00939876 0.02875 -1959.2
0.561043 0.00811302 0.02875 -1829.4
0.564796 0.00754727 0.02875 -1772.21
0.563373 0.00776304 0.02875 -1793.7
0.561511 0.00804286 0.02875 -1822.14
0.562888 0.00783642 0.02875 -1801.46
0.565257 0.00747696 0.02875 -1764.74
0.574191 0.00609935 0.02875 -1628.69
0.574647 0.0060283 0.02875 -1621.45
0.00850788 0.0118721 0.02875 -3668.55
0.521565 0.0131929 0.02875 -2304.49
0.52203 0.0131394 0.02875 -2299.89
0.532851 0.0118636 0.02875 -2187.82
0.534702 0.0116384 0.02875 -2167.49
0.533316 0.0118072 0.02875 -2181.89
0.536609 0.0114044 0.02875 -2146.18
0.538462 0.0111751 0.02875 -2125.21
0.537075 0.0113471 0.02875 -2140.86
0.535162 0.0115822 0.02875 -2162.03
0.538922 0.0111178 0.02875 -2120.36
0.539408 0.0110572 0.02875 -2114.02
0.547886 0.00996831 0.02875 -2013.31
0.54835 0.00990699 0.02875 -2008.49
0.0159928 0.0148834 0.02875 -3547.37
0.0164468 0.015031 0.02875 -3547.53
0.0178467 0.0154681 0.02875 -3546.67
0.0182921 0.0156007 0.02875 -3546.83
0.483975 0.0170904 0.02875 -2627.79
0.484445 0.0170469 0.02875 -2624.51
0.488142 0.0167002 0.02875 -2596.3
0.487625 0.0167495 0.02875 -2600.71
0.499012 0.015632 0.02875 -2510.82
0.500873 0.0154418 0.02875 -2495.18
0.49948 0.0155843 0.02875 -2506.42
0.502787 0.0152445 0.02875 -2478.89
0.504646 0.0150506 0.02875 -2462.87
0.503241 0.0151974 0.02875 -2475.11
0.501317 0.0153963 0.02875 -2491.3
0.505111 0.015002 0.02875 -2459.27
0.506421 0.0148637 0.02875 -2446.99
0.517802 0.0136205 0.02875 -2341.67
0.518265 0.0135682 0.02875 -2337.05
0.0253445 0.017442 0.02875 -3556.68
0.0258032 0.0175467 0.02875 -3558.15
0.031013 0.0186434 0.02875 -3578.56
0.0314701 0.0187312 0.02875 -3580.85
0.032877 0.0190004 0.02875 -3588.19
0.0347324 0.0193451 0.02875 -3598.64
0.0333643 0.0190914 0.02875 -3590.68
0.0351996 0.0194293 0.02875 -3600.86
0.0441201 0.0208765 0.02875 -3649.57
0.0446078 0.0209462 0.02875 -3651.48
0.435512 0.0209542 0.02875 -2948.59
0.438861 0.0207208 0.02875 -2926.78
0.439329 0.020688 0.02875 -2924.03
0.45578 0.0194718 0.02875 -2818.19
0.456249 0.0194351 0.02875 -2814.94
0.457658 0.0193244 0.02875 -2805.97
0.45952 0.0191766 0.02875 -2793.81
0.458126 0.0192874 0.02875 -2802.62
0.461434 0.0190235 0.02875 -2781.41
0.463298 0.018873 0.02875 -2769.19
0.461889 0.0189868 0.02875 -2777.77
0.459966 0.0191411 0.02875 -2790.6
0.463766 0.0188349 0.02875 -2765.69
0.465162 0.0187211 0.02875 -2757.27
0.465611 0.0186843 0.02875 -2753.79
0.480214 0.0174325 0.02875 -2654.84
0.48068 0.0173906 0.02875 -2651.9
0.047908 0.0213941 0.02875 -3666.29
0.0572968 0.022535 0.02875 -3711.04
0.0577605 0.022587 0.02875 -3713.57
0.059162 0.0227414 0.02875 -3720.42
0.0596247 0.0227915 0.02875 -3722.86
0.0610718 0.0229459 0.02875 -3730
0.0615276 0.0229936 0.02875 -3732.41
0.0629248 0.0231379 0.02875 -3739.32
0.0633933 0.0231851 0.02875 -3741.78
0.0779648 0.0244604 0.02875 -3808.1
0.0784326 0.0244958 0.02875 -3809.56
0.371135 0.0247142 0.02875 -3448.14
0.371679 0.024689 0.02875 -3443.2
0.374953 0.0245347 0.02875 -3413.27
0.375423 0.0245123 0.02875 -3409.4
0.378704 0.0243538 0.02875 -3379.83
0.379168 0.024331 0.02875 -3375.96
0.399389 0.0232603 0.02875 -3209.46
0.399858 0.0232333 0.02875 -3205.25
0.401269 0.0231517 0.02875 -3194.51
0.403145 0.0230418 0.02875 -3179.79
0.401738 0.0231244 0.02875 -3190.77
0.406924 0.0228163 0.02875 -3150.5
0.403613 0.0230143 0.02875 -3176.39
0.405012 0.0229312 0.02875 -3165.35
0.405461 0.0229045 0.02875 -3162.28
0.407378 0.022789 0.02875 -3147.46
0.408787 0.0227031 0.02875 -3135.95
0.410665 0.0225876 0.02875 -3121.71
0.409257 0.0226743 0.02875 -3132.91
0.411133 0.0225586 0.02875 -3118.56
0.412536 0.0224712 0.02875 -3107.62
0.412999 0.0224422 0.02875 -3104.21
0.431343 0.0212399 0.02875 -2975.49
0.431812 0.021208 0.02875 -2972.04
0.434997 0.0209896 0.02875 -2951.58
0.0813106 0.0247057 0.02875 -3820.28
0.0818266 0.0247425 0.02875 -3822.52
0.0822328 0.0247712 0.02875 -3824.23
0.0854801 0.0249925 0.02875 -3835.16
0.0859497 0.0250237 0.02875 -3837.11
0.106195 0.0261869 0.02875 -3902.17
0.106642 0.0262091 0.02875 -3903.41
0.108041 0.0262782 0.02875 -3908.21
0.109917 0.0263691 0.02875 -3914.35
0.10851 0.0263012 0.02875 -3909.42
0.110386 0.0263915 0.02875 -3915.65
0.111795 0.0264577 0.02875 -3920.55
0.113675 0.0265443 0.02875 -3926.83
0.112265 0.0264796 0.02875 -3922.01
0.114144 0.0265657 0.02875 -3928.58
0.115657 0.0266332 0.02875 -3933.51
0.117442 0.0267112 0.02875 -3939.57
0.116062 0.0266512 0.02875 -3935.13
0.11791 0.0267314 0.02875 -3941.52
0.119317 0.0267908 0.02875 -3945.92
0.121194 0.0268682 0.02875 -3952.23
0.119787 0.0268106 0.02875 -3947.78
0.121664 0.0268873 0.02875 -3954.16
0.123073 0.0269431 0.02875 -3958.72
0.124953 0.0270154 0.02875 -3965.16
0.123543 0.0269614 0.02875 -3960.48
0.125423 0.0270331 0.02875 -3966.99
0.126891 0.0270871 0.02875 -3971.71
0.164523 0.0280338 0.02875 -4103.39
0.164928 0.0280397 0.02875 -4104.8
0.168188 0.0280847 0.02875 -4116.03
0.168658 0.0280908 0.02875 -4117.55
0.171947 0.0281311 0.02875 -4128.83
0.172417 0.0281364 0.02875 -4130.19
0.175706 0.0281725 0.02875 -4141.57
0.176176 0.0281774 0.02875 -4142.99
0.179465 0.0282101 0.02875 -4154.31
0.179935 0.0282147 0.02875 -4155.97
0.183224 0.0282449 0.02875 -4167.36
0.183694 0.0282491 0.02875 -4169.08
0.186983 0.028276 0.02875 -4180.21
0.187453 0.0282796 0.02875 -4181.78
0.190743 0.0283027 0.02875 -4192.63
0.191212 0.0283057 0.02875 -4194.36
0.194502 0.0283247 0.02875 -4204.78
0.194972 0.0283271 0.02875 -4206.16
0.198261 0.0283421 0.02875 -4216.37
0.198731 0.0283439 0.02875 -4217.61
0.202021 0.0283547 0.02875 -4227.46
0.202491 0.028356 0.02875 -4228.69
0.20578 0.0283629 0.02875 -4237.82
0.20625 0.0283636 0.02875 -4238.93
0.209539 0.0283663 0.02875 -4247.25
0.210009 0.0283664 0.02875 -4248.46
0.213299 0.028365 0.02875 -4255.9
0.213769 0.0283646 0.02875 -4257.3
0.217058 0.0283584 0.02875 -4263.45
0.217528 0.0283572 0.02875 -4264.65
0.220818 0.0283461 0.02875 -4269.8
0.221288 0.0283441 0.02875 -4270.21
0.224577 0.0283286 0.02875 -4274.65
0.225047 0.028326 0.02875 -4275.12
0.228336 0.0283066 0.02875 -4278.27
0.228806 0.0283036 0.02875 -4278.46
0.232096 0.0282808 0.02875 -4280.39
0.232566 0.0282773 0.02875 -4280.69
0.235855 0.0282519 0.02875 -4281.39
0.236325 0.0282481 0.02875 -4281.25
0.239614 0.0282207 0.02875 -4280.86
0.240084 0.0282166 0.02875 -4280.6
0.243373 0.0281876 0.02875 -4278.84
0.243843 0.0281834 0.02875 -4278.54
0.247132 0.0281537 0.02875 -4275.94
0.247602 0.0281494 0.02875 -4275.79
0.250891 0.0281189 0.02875 -4271.99
0.251361 0.0281144 0.02875 -4271.71
0.25465 0.0280822 0.02875 -4266.89
0.25512 0.0280774 0.02875 -4266.15
0.258403 0.0280426 0.02875 -4260.34
0.25885 0.0280376 0.02875 -4259.14
0.30542 0.0270727 0.02875 -4028.58
0.305875 0.0270603 0.02875 -4025.31
0.307284 0.0270221 0.02875 -4014.91
0.309163 0.0269708 0.02875 -4000.93
0.307754 0.0270093 0.02875 -4011.36
0.309633 0.0269579 0.02875 -3997.4
0.311043 0.0269191 0.02875 -3986.67
0.312923 0.0268669 0.02875 -3972.45
0.311513 0.0269062 0.02875 -3983.56
0.313393 0.0268538 0.02875 -3968.96
0.314801 0.026814 0.02875 -3957.84
0.316679 0.0267607 0.02875 -3943.11
0.315271 0.0268008 0.02875 -3954.38
0.317149 0.0267472 0.02875 -3939.34
0.318557 0.0267064 0.02875 -3928.01
0.32043 0.0266516 0.02875 -3912.66
0.319027 0.0266928 0.02875 -3924.16
0.322336 0.0265948 0.02875 -3896.46
0.324201 0.0265382 0.02875 -3880.23
0.322791 0.026581 0.02875 -3892.44
0.320877 0.0266383 0.02875 -3908.52
0.324671 0.0265237 0.02875 -3876.19
0.326081 0.0264801 0.02875 -3864.01
0.32796 0.0264206 0.02875 -3847.3
0.326551 0.0264653 0.02875 -3859.67
0.32843 0.0264055 0.02875 -3842.92
0.329839 0.0263601 0.02875 -3830.73
0.331716 0.0262982 0.02875 -3813.57
0.330308 0.0263447 0.02875 -3825.9
0.332186 0.0262824 0.02875 -3808.8
0.333594 0.0262348 0.02875 -3796.45
0.335443 0.0261709 0.02875 -3778.33
0.334063 0.0262187 0.02875 -3791.36
0.335848 0.0261567 0.02875 -3774.62
0.33636 0.0261386 0.02875 -3769.63
0.360326 0.0251989 0.02875 -3546.74
0.363675 0.0250526 0.02875 -3516.03
0.364145 0.0250318 0.02875 -3511.09
0.36743 0.0248843 0.02875 -3481.61
0.367898 0.024863 0.02875 -3477.19
0.0831634 -0.0248066 0.02875 1675.35
0.0845455 -0.0249095 0.02875 1662.73
0.0868894 -0.0250765 0.02875 1641.34
0.0882807 -0.0251712 0.02875 1630.96
0.091125 -0.0253527 0.02875 1608.44
0.0906579 -0.0253242 0.02875 1611.63
0.0915929 -0.0253809 0.02875 1605.98
0.0920611 -0.025409 0.02875 1603.08
0.0948782 -0.0255736 0.02875 1583.9
0.0944082 -0.0255467 0.02875 1587.51
0.0953475 -0.0256003 0.02875 1581.17
0.0958017 -0.025626 0.02875 1578.35
0.339239 -0.0255985 0.02875 499.069
0.338785 -0.0256236 0.02875 501.424
0.339708 -0.0255725 0.02875 497.446
0.340178 -0.0255462 0.02875 495.188
0.342994 -0.0253861 0.02875 483.15
0.342526 -0.0254132 0.02875 484.248
0.343462 -0.025359 0.02875 481.032
0.34393 -0.0253318 0.02875 478.652
0.346228 -0.025195 0.02875 466.945
0.347697 -0.025105 0.02875 459.429
0.350045 -0.0249566 0.02875 447.11
0.351448 -0.0248643 0.02875 441.422
0.0455616 -0.0210781 0.02875 2056.16
0.0469452 -0.0212644 0.02875 2038.34
0.0497752 -0.021619 0.02875 2007.27
0.0493134 -0.021563 0.02875 2011.63
0.05024 -0.0216753 0.02875 2002.33
0.0507063 -0.0217317 0.02875 1996.91
0.384354 -0.0218011 0.02875 359.005
0.383864 -0.0218599 0.02875 361.572
0.384824 -0.0217442 0.02875 360.833
0.385289 -0.0216878 0.02875 361.175
0.389048 -0.0212152 0.02875 359.724
0.0244391 -0.017227 0.02875 2325.41
0.0272291 -0.0178674 0.02875 2295.01
0.0267748 -0.0177668 0.02875 2300.78
0.0262911 -0.0176576 0.02875 2306.24
0.0276868 -0.0179655 0.02875 2289.73
0.0281759 -0.0180687 0.02875 2284.48
0.0413279 -0.02046 0.02875 2110.68
0.410638 -0.0177961 0.02875 473.264
0.410184 -0.0178799 0.02875 467.123
0.411583 -0.0176219 0.02875 482.468
0.411096 -0.0177117 0.02875 477.864
0.0131395 -0.0138886 0.02875 2275.58
0.430403 -0.0142517 0.02875 610.239
0.432731 -0.0138621 0.02875 617.982
0.43415 -0.0136251 0.02875 621.872
0.00562655 -0.0101378 0.02875 1272.95
0.455748 -0.0101985 0.02875 685.587
0.455288 -0.0102658 0.02875 686.142
0.456722 -0.0100557 0.02875 687.149
0.459037 -0.00972296 0.02875 690.806
0.00374497 -0.00866218 0.02875 322.577
0.482099 -0.00671476 0.02875 705.995
0.481629 -0.00677035 0.02875 706.409
0.482565 -0.00665981 0.02875 706.98
0.483032 -0.00660529 0.02875 707.631
0.485366 -0.006336 0.02875 707.546
0.486793 -0.00617402 0.02875 707.722
0.489082 -0.0059197 0.02875 706.996
0.609474 -0.00600108 0.02875 -941.781
0.000237277 -0.00209813 0.02875 -4376.62
0.000322596 -0.00254743 0.02875 -4537.7
0.520103 -0.00306074 0.02875 700.284
0.520646 -0.00302368 0.02875 700.705
0.523448 -0.00284078 0.02875 694.119
0.522979 -0.00287054 0.02875 695.624
0.523917 -0.00281106 0.02875 693.33
0.524385 -0.00278169 0.02875 693.425
0.527105 -0.00261896 0.02875 688.088
0.526699 -0.00264234 0.02875 689.963
0.528163 -0.00255795 0.02875 685.758
0.530498 -0.00242986 0.02875 682.616
0.531907 -0.00235649 0.02875 678.828
0.534251 -0.00224013 0.02875 675.005
0.535652 -0.00217482 0.02875 671.891
0.577063 -0.0021569 0.02875 495.105
0.579374 -0.00232585 0.02875 459.131
0.580781 -0.0024415 0.02875 439.218
0.58362 -0.00270249 0.02875 378.495
0.583175 -0.00265977 0.02875 388.958
0.584081 -0.00274694 0.02875 369.087
0.584546 -0.00279318 0.02875 362.531
0.61 -0.00494985 0.02875 -1370.87
0.61 -0.00259111 0.02875 -1332.97
0.000147001 -0.00162274 0.02875 -4824.14
8.00703e-05 -0.00115918 0.02875 -6068.57
0.000163047 0.00163984 0.02875 -6862.78
8.68731e-05 0.00116793 0.02875 -7908.9
0.598145 0.00208957 0.02875 -1257.09
0.599555 0.00182667 0.02875 -1237.75
0.603309 0.00112343 0.02875 -1195.17
0.61 -0.00118045 0.02875 -1321.16
0.000237503 0.0021011 0.02875 -6653.62
0.000312643 0.00256034 0.02875 -7052.76
0.577012 0.00565612 0.02875 -1583.87
0.594845 0.00268913 0.02875 -1304.76
0.594391 0.00276963 0.02875 -1312
0.595787 0.00252109 0.02875 -1291.58
0.595302 0.00260765 0.02875 -1297.98
0.00381566 0.0086212 0.02875 -4401.06
0.550709 0.00959054 0.02875 -1979.36
0.553025 0.0092717 0.02875 -1946.85
0.569483 0.00682725 0.02875 -1698.94
0.572283 0.00639455 0.02875 -1656.46
0.571823 0.00646577 0.02875 -1663.36
0.573262 0.00624307 0.02875 -1641.65
0.00561551 0.0101453 0.02875 -3723.77
0.520633 0.0132996 0.02875 -2314.16
0.522952 0.0130332 0.02875 -2291.38
0.527663 0.0124832 0.02875 -2242.04
0.545978 0.0102187 0.02875 -2036.85
0.54552 0.0102784 0.02875 -2042.2
0.546926 0.0100951 0.02875 -2025.81
0.54644 0.0101587 0.02875 -2032.02
0.549272 0.00978423 0.02875 -1996.38
0.0230123 0.0168789 0.02875 -3551.34
0.482974 0.0171825 0.02875 -2636.33
0.485383 0.0169601 0.02875 -2618.09
0.486775 0.0168295 0.02875 -2607.58
0.512172 0.0142451 0.02875 -2395.11
0.511707 0.0142959 0.02875 -2399.3
0.51264 0.0141939 0.02875 -2391.04
0.513108 0.0141427 0.02875 -2387.11
0.515436 0.0138853 0.02875 -2364.51
0.516869 0.0137253 0.02875 -2351.27
0.519186 0.0134642 0.02875 -2328.71
0.0244412 0.0172284 0.02875 -3554.94
0.0272282 0.0178668 0.02875 -3563.04
0.0262921 0.0176584 0.02875 -3560.38
0.0267756 0.0177678 0.02875 -3562.29
0.0276857 0.0179644 0.02875 -3564.76
0.0418138 0.0205342 0.02875 -3637.55
0.0431923 0.0207413 0.02875 -3644.25
0.436513 0.0208847 0.02875 -2941.62
0.437923 0.0207866 0.02875 -2932.48
0.440263 0.0206219 0.02875 -2917.4
0.441581 0.0205285 0.02875 -2909.44
0.442096 0.0204917 0.02875 -2905.85
0.44867 0.0200127 0.02875 -2863.94
0.474576 0.0179293 0.02875 -2694.11
0.474106 0.0179698 0.02875 -2697.21
0.475044 0.0178888 0.02875 -2691.6
0.47551 0.0178483 0.02875 -2688.08
0.479275 0.0175167 0.02875 -2662.47
0.481607 0.0173071 0.02875 -2645.32
0.0455611 0.0210784 0.02875 -3655.38
0.0469453 0.0212668 0.02875 -3661.67
0.0497734 0.0216352 0.02875 -3674.8
0.0493114 0.0215761 0.02875 -3672.5
0.0502378 0.0216945 0.02875 -3677.57
0.0507027 0.0217529 0.02875 -3679.11
0.075718 0.0242865 0.02875 -3798.59
0.0752022 0.0242455 0.02875 -3796.07
0.0770317 0.024389 0.02875 -3803.83
0.0793708 0.0245651 0.02875 -3813.01
0.0807644 0.0246668 0.02875 -3818.28
0.372603 0.0246457 0.02875 -3434.45
0.374013 0.0245794 0.02875 -3421.62
0.37636 0.0244673 0.02875 -3400.62
0.377767 0.0243994 0.02875 -3388.48
0.380023 0.024289 0.02875 -3368.18
0.42196 0.0218671 0.02875 -3039.14
0.421414 0.0219028 0.02875 -3043.53
0.422415 0.0218371 0.02875 -3035.93
0.422885 0.0218062 0.02875 -3032.62
0.4257 0.0216198 0.02875 -3013.15
0.425233 0.021651 0.02875 -3016.69
0.426168 0.0215886 0.02875 -3009.93
0.426635 0.0215573 0.02875 -3006.5
0.429011 0.0213978 0.02875 -2990.63
0.430404 0.0213036 0.02875 -2981.3
0.432749 0.0211441 0.02875 -2966.09
0.434146 0.0210483 0.02875 -2956.8
0.0831414 0.0248341 0.02875 -3826.96
0.0845431 0.0249301 0.02875 -3831.93
0.0868896 0.0250852 0.02875 -3839.87
0.0883597 0.02518 0.02875 -3844.94
0.0911247 0.0253527 0.02875 -3854.06
0.090657 0.0253239 0.02875 -3852.53
0.0915928 0.0253813 0.02875 -3855.75
0.092061 0.02541 0.02875 -3857.64
0.0948783 0.0255768 0.02875 -3866.23
0.0944082 0.0255495 0.02875 -3864.8
0.0953476 0.0256039 0.02875 -3867.85
0.0958028 0.0256302 0.02875 -3869.54
0.16584 0.0280528 0.02875 -4108.29
0.167249 0.0280722 0.02875 -4112.65
0.169598 0.0281027 0.02875 -4120.86
0.171008 0.0281199 0.02875 -4125.44
0.173357 0.028147 0.02875 -4133.43
0.174766 0.0281625 0.02875 -4138.18
0.177116 0.028187 0.02875 -4146.06
0.178525 0.028201 0.02875 -4151.03
0.180875 0.0282234 0.02875 -4158.96
0.182284 0.0282365 0.02875 -4163.98
0.184634 0.0282571 0.02875 -4172.19
0.186043 0.0282687 0.02875 -4177.09
0.188393 0.0282866 0.02875 -4184.99
0.189803 0.0282966 0.02875 -4190.1
0.192152 0.0283115 0.02875 -4197.37
0.193562 0.0283197 0.02875 -4201.95
0.195912 0.0283318 0.02875 -4209.45
0.197321 0.0283381 0.02875 -4213.5
0.199671 0.0283474 0.02875 -4220.79
0.201081 0.028352 0.02875 -4224.48
0.20343 0.0283583 0.02875 -4231.15
0.20484 0.0283612 0.02875 -4234.9
0.20719 0.0283647 0.02875 -4241.2
0.2086 0.0283658 0.02875 -4244.73
0.210949 0.0283663 0.02875 -4250.35
0.212359 0.0283658 0.02875 -4253.71
0.214709 0.0283633 0.02875 -4258.81
0.216118 0.0283607 0.02875 -4261.94
0.218468 0.0283545 0.02875 -4265.87
0.219878 0.0283497 0.02875 -4268.48
0.222227 0.0283401 0.02875 -4271.65
0.223637 0.0283334 0.02875 -4273.72
0.225987 0.0283208 0.02875 -4276.22
0.227397 0.0283124 0.02875 -4277.47
0.229746 0.0282973 0.02875 -4279.2
0.231156 0.0282874 0.02875 -4279.87
0.233506 0.0282702 0.02875 -4280.87
0.234915 0.0282594 0.02875 -4281.05
0.237265 0.0282404 0.02875 -4281.26
0.238674 0.0282287 0.02875 -4280.91
0.241024 0.0282084 0.02875 -4280.01
0.242434 0.028196 0.02875 -4279.42
0.244783 0.028175 0.02875 -4278.03
0.246193 0.0281622 0.02875 -4276.82
0.248542 0.0281407 0.02875 -4274.76
0.249952 0.0281277 0.02875 -4273.25
0.252301 0.0281054 0.02875 -4270.34
0.25371 0.0280916 0.02875 -4268.52
0.25606 0.0280677 0.02875 -4264.75
0.257469 0.0280528 0.02875 -4262.27
0.28702 0.0275506 0.02875 -4154.43
0.350517 0.0256063 0.02875 -3638.27
0.350047 0.025625 0.02875 -3642.86
0.350987 0.0255875 0.02875 -3633.89
0.351457 0.0255687 0.02875 -3630.01
0.354276 0.025454 0.02875 -3603.21
0.353806 0.0254733 0.02875 -3607.94
0.354746 0.0254346 0.02875 -3598.75
0.355214 0.0254152 0.02875 -3594.59
0.358028 0.0252973 0.02875 -3568.29
0.357559 0.0253172 0.02875 -3573.12
0.358497 0.0252773 0.02875 -3563.68
0.358961 0.0252574 0.02875 -3559.18
0.361326 0.0251556 0.02875 -3537.67
0.362735 0.025094 0.02875 -3524.02
0.365084 0.0249899 0.02875 -3502.64
0.366492 0.0249267 0.02875 -3489.72
0.368836 0.0248202 0.02875 -3468.59
0.370215 0.0247569 0.02875 -3456.05
0.0827471 -0.0247754 0.02875 1678.87
0.0850128 -0.0249434 0.02875 1658.02
0.0864195 -0.0250438 0.02875 1646.45
0.0888179 -0.0252067 0.02875 1625.22
0.0893301 -0.0252397 0.02875 1622.03
0.0897434 -0.0252662 0.02875 1619.4
0.0901939 -0.0252951 0.02875 1616.04
0.0929988 -0.0254646 0.02875 1596.29
0.0925298 -0.025437 0.02875 1599.66
0.0934683 -0.025492 0.02875 1593.62
0.0939382 -0.0255193 0.02875 1590.68
0.0963456 -0.0256568 0.02875 1574.71
0.105276 -0.0261338 0.02875 1514.8
0.116974 -0.0266896 0.02875 1437.58
0.116509 -0.0266692 0.02875 1440.62
0.11838 -0.0267507 0.02875 1428.87
0.118849 -0.0267707 0.02875 1425.41
0.120724 -0.0268491 0.02875 1413.5
0.120256 -0.0268297 0.02875 1417.2
0.122133 -0.0269061 0.02875 1405.68
0.122603 -0.0269248 0.02875 1402.31
0.124483 -0.0269978 0.02875 1391.46
0.124013 -0.0269796 0.02875 1394.61
0.125892 -0.0270505 0.02875 1383.76
0.126348 -0.0270675 0.02875 1381.08
0.302996 -0.0270854 0.02875 654.074
0.304934 -0.0270249 0.02875 646.35
0.304464 -0.0270399 0.02875 646.614
0.306344 -0.0269798 0.02875 641.347
0.306814 -0.0269646 0.02875 639.618
0.308694 -0.0269035 0.02875 632.276
0.308224 -0.0269189 0.02875 634.111
0.310103 -0.0268571 0.02875 626.406
0.310573 -0.0268414 0.02875 623.739
0.31245 -0.0267782 0.02875 615.11
0.311981 -0.0267941 0.02875 617.865
0.313858 -0.0267298 0.02875 609.215
0.314327 -0.0267135 0.02875 605.928
0.316177 -0.026648 0.02875 597.562
0.315729 -0.026664 0.02875 600.095
0.33824 -0.0256537 0.02875 503.757
0.341118 -0.0254933 0.02875 491.768
0.340648 -0.0255198 0.02875 493.293
0.341588 -0.0254667 0.02875 489.612
0.342057 -0.02544 0.02875 487.046
0.344861 -0.0252768 0.02875 473.933
0.344398 -0.0253043 0.02875 474.888
0.345307 -0.0252502 0.02875 472.526
0.345714 -0.025226 0.02875 470.064
0.348167 -0.0250759 0.02875 456.21
0.349577 -0.0249865 0.02875 450.711
0.351915 -0.0248334 0.02875 438.858
0.35323 -0.0247437 0.02875 432.951
0.0451011 -0.0210156 0.02875 2060.71
0.047416 -0.0213248 0.02875 2033.09
0.0483942 -0.0214489 0.02875 2023.01
0.0488551 -0.0215068 0.02875 2017
0.051642 -0.0218421 0.02875 1986.8
0.0511719 -0.0217869 0.02875 1991.25
0.052132 -0.0218996 0.02875 1981.72
0.0619975 -0.0229987 0.02875 1874.56
0.0624602 -0.0230487 0.02875 1869.3
0.0643254 -0.0232486 0.02875 1847.49
0.063863 -0.0231991 0.02875 1853.05
0.370661 -0.0232862 0.02875 382.397
0.3726 -0.0230937 0.02875 378.216
0.372131 -0.023141 0.02875 377.687
0.373991 -0.0229525 0.02875 375.411
0.374435 -0.0229066 0.02875 374.241
0.386215 -0.0215743 0.02875 356.978
0.385753 -0.0216313 0.02875 360.415
0.386674 -0.0215169 0.02875 359.936
0.387135 -0.0214592 0.02875 360.617
0.389512 -0.0211553 0.02875 359.665
0.39089 -0.0209729 0.02875 359.814
0.0248944 -0.0173369 0.02875 2320.88
0.0342747 -0.0192604 0.02875 2207.6
0.0338218 -0.0191766 0.02875 2213.48
0.400777 -0.0195274 0.02875 380.502
0.402653 -0.0192164 0.02875 394.421
0.402196 -0.0192935 0.02875 387.151
0.408774 -0.018138 0.02875 453.891
0.409263 -0.018049 0.02875 458.079
0.409727 -0.0179641 0.02875 461.266
0.412073 -0.0175307 0.02875 486.928
0.413452 -0.0172742 0.02875 502.258
0.0136228 -0.0140674 0.02875 2290.47
0.0174076 -0.015337 0.02875 2351.62
0.0187735 -0.0157416 0.02875 2355.86
0.422875 -0.0155396 0.02875 584.132
0.42333 -0.0154584 0.02875 588.501
0.429911 -0.0143343 0.02875 609.529
0.431331 -0.0140961 0.02875 613.236
0.430872 -0.0141731 0.02875 611.286
0.431787 -0.0140199 0.02875 614.98
0.432245 -0.0139433 0.02875 616.057
0.434606 -0.0135492 0.02875 624.025
0.00803837 -0.0116264 0.02875 1810.58
0.00612679 -0.0104827 0.02875 1362.87
0.445434 -0.0117803 0.02875 660.843
0.445893 -0.0117074 0.02875 661.73
0.4539 -0.0104718 0.02875 682.252
0.453409 -0.0105451 0.02875 682.606
0.454369 -0.0104019 0.02875 682.694
0.45483 -0.0103333 0.02875 684.351
0.457192 -0.00998783 0.02875 688.541
0.458576 -0.00978891 0.02875 689.479
0.470352 -0.0081762 0.02875 700.522
0.469863 -0.00824056 0.02875 700.391
0.471751 -0.0079944 0.02875 701.685
0.472214 -0.00793455 0.02875 701.958
0.48114 -0.0068283 0.02875 707.317
0.48396 -0.0064975 0.02875 706.775
0.483497 -0.00655125 0.02875 706.93
0.484419 -0.00644419 0.02875 707.27
0.48488 -0.00639118 0.02875 708.15
0.48726 -0.00612195 0.02875 707.135
0.488639 -0.00596835 0.02875 707.27
0.609016 -0.00591504 0.02875 -627.664
0.000412265 -0.00298923 0.02875 -4893.03
0.504182 -0.00436492 0.02875 708.944
0.503727 -0.0044082 0.02875 709.065
0.505589 -0.00423398 0.02875 709.136
0.506056 -0.00419082 0.02875 709.216
0.507836 -0.00403013 0.02875 709.27
0.507427 -0.00406672 0.02875 709.378
0.521569 -0.0029624 0.02875 697.024
0.5211 -0.00299355 0.02875 698.208
0.522039 -0.0029312 0.02875 696.586
0.522509 -0.00290051 0.02875 696.997
0.525321 -0.00272473 0.02875 691.023
0.524853 -0.00275303 0.02875 692.798
0.525788 -0.00269647 0.02875 690.086
0.526252 -0.00266858 0.02875 689.682
0.528619 -0.00253238 0.02875 686.137
0.530028 -0.00245512 0.02875 682.256
0.532376 -0.00233244 0.02875 678.868
0.533782 -0.002263 0.02875 675.305
0.536099 -0.00215414 0.02875 671.391
0.57751 -0.00218727 0.02875 487.306
0.578906 -0.00228899 0.02875 469.838
0.58125 -0.0024829 0.02875 426.389
0.582767 -0.00262063 0.02875 400.184
0.585481 -0.00288858 0.02875 335.218
0.585013 -0.00284079 0.02875 347.702
0.586952 -0.00304123 0.02875 299.927
0.58595 -0.00293642 0.02875 324.393
0.586405 -0.00298348 0.02875 316.188
0.596319 -0.00405478 0.02875 101.21
0.598168 -0.00429895 0.02875 21.155
0.597704 -0.004237 0.02875 35.8682
0.61 -0.00447584 0.02875 -1328.01
0.61 -0.00306219 0.02875 -1334.59
4.72657e-05 -0.00023506 0.02875 -5734.46
5.55288e-05 -0.000705619 0.02875 -6289.99
3.89517e-05 0.000238389 0.02875 -5919.78
4.15542e-05 0.000702694 0.02875 -6855.92
0.600015 0.00174061 0.02875 -1231.91
0.61 -0.000704426 0.02875 -1322.48
0.609433 -2.1228e-05 0.02875 -1165.27
0.608971 6.0846e-05 0.02875 -1157.62
0.607072 0.000406772 0.02875 -1165.72
0.60753 0.000321392 0.02875 -1163.33
0.000432165 0.00304155 0.02875 -8614.41
0.577472 0.00558295 0.02875 -1576.63
0.584517 0.00443771 0.02875 -1463.43
0.585009 0.00435606 0.02875 -1455.21
0.586849 0.0040494 0.02875 -1425.98
0.586391 0.00412604 0.02875 -1433.61
0.588296 0.00380679 0.02875 -1403.5
0.588755 0.00372957 0.02875 -1396.07
0.592972 0.00301528 0.02875 -1332.67
0.593465 0.00293024 0.02875 -1325.48
0.593934 0.0028495 0.02875 -1319.49
0.596279 0.00243268 0.02875 -1284.13
0.597658 0.00217949 0.02875 -1263.68
0.00232903 0.00677906 0.02875 -5966.76
0.551178 0.00952662 0.02875 -1971.67
0.552567 0.00933522 0.02875 -1954.39
0.564334 0.00761758 0.02875 -1779.72
0.563864 0.00768867 0.02875 -1786.37
0.561972 0.00797392 0.02875 -1815.43
0.562429 0.0079055 0.02875 -1809.23
0.565714 0.00740705 0.02875 -1757.71
0.566175 0.00733653 0.02875 -1750.75
0.570442 0.00667905 0.02875 -1684.3
0.569974 0.00675147 0.02875 -1691.46
0.570905 0.00660759 0.02875 -1677.29
0.571365 0.00653641 0.02875 -1670.31
0.57373 0.00617059 0.02875 -1634.9
0.575106 0.00595642 0.02875 -1613.85
0.00609749 0.0104798 0.02875 -3681.08
0.00755818 0.0113573 0.02875 -3740.25
0.00804679 0.0116312 0.02875 -3702.8
0.0112509 0.0131593 0.02875 -3581.25
0.521099 0.0132464 0.02875 -2309.63
0.522493 0.0130861 0.02875 -2295.52
0.531888 0.0119795 0.02875 -2197.21
0.53238 0.0119203 0.02875 -2192.32
0.534243 0.0116942 0.02875 -2172
0.53378 0.0117506 0.02875 -2176.86
0.535648 0.0115227 0.02875 -2156.09
0.536139 0.0114623 0.02875 -2150.85
0.538004 0.011232 0.02875 -2130.09
0.53754 0.0112894 0.02875 -2135.15
0.544129 0.0104583 0.02875 -2058.93
0.543658 0.0105188 0.02875 -2064.47
0.543167 0.0105818 0.02875 -2070.38
0.544593 0.0103985 0.02875 -2054.37
0.545058 0.0103385 0.02875 -2048.04
0.547416 0.0100304 0.02875 -2018.99
0.548812 0.0098457 0.02875 -2003.2
0.0141067 0.0142381 0.02875 -3552
0.013619 0.0140661 0.02875 -3554.17
0.0174034 0.015336 0.02875 -3546.78
0.0187738 0.0157439 0.02875 -3548.58
0.0225617 0.0167643 0.02875 -3550.91
0.48352 0.0171324 0.02875 -2631.61
0.484915 0.0170035 0.02875 -2621.71
0.48722 0.0167878 0.02875 -2604.62
0.497552 0.0157795 0.02875 -2522.19
0.498091 0.015725 0.02875 -2517.47
0.498543 0.0156793 0.02875 -2514.05
0.500413 0.015489 0.02875 -2498.55
0.499948 0.0155365 0.02875 -2502.27
0.504179 0.0150994 0.02875 -2466.44
0.50371 0.0151484 0.02875 -2470.43
0.501723 0.0153545 0.02875 -2487.43
0.502239 0.0153011 0.02875 -2482.94
0.50557 0.0149535 0.02875 -2454.42
0.506015 0.0149066 0.02875 -2450.46
0.511196 0.0143515 0.02875 -2404.51
0.514035 0.0140403 0.02875 -2377.66
0.513573 0.0140915 0.02875 -2381.99
0.514493 0.0139898 0.02875 -2373.67
0.514949 0.0139394 0.02875 -2369.91
0.517336 0.013673 0.02875 -2346.36
0.518725 0.0135164 0.02875 -2333.41
0.0248972 0.017338 0.02875 -3556.14
0.0319225 0.0188181 0.02875 -3583.12
0.0323857 0.0189072 0.02875 -3586.15
0.034275 0.0192609 0.02875 -3596.28
0.0338219 0.0191766 0.02875 -3593.28
0.0436544 0.0208086 0.02875 -3646.63
0.436058 0.0209164 0.02875 -2944.53
0.438391 0.0207537 0.02875 -2929.35
0.439796 0.0206549 0.02875 -2920.61
0.455326 0.0195071 0.02875 -2822.03
0.454784 0.0195491 0.02875 -2824.99
0.456719 0.0193982 0.02875 -2812.05
0.457189 0.0193614 0.02875 -2809.6
0.459058 0.0192133 0.02875 -2796.84
0.458593 0.0192503 0.02875 -2799.68
0.462828 0.0189109 0.02875 -2771.8
0.462358 0.0189489 0.02875 -2774.76
0.460372 0.0191086 0.02875 -2787.82
0.460888 0.0190673 0.02875 -2784.88
0.464232 0.0187969 0.02875 -2762.59
0.464699 0.0187588 0.02875 -2759.6
0.466022 0.0186504 0.02875 -2750.65
0.472714 0.0180893 0.02875 -2706.69
0.472173 0.0181356 0.02875 -2710.25
0.473167 0.0180507 0.02875 -2704.44
0.473636 0.0180104 0.02875 -2700.47
0.476437 0.0177673 0.02875 -2681.4
0.475976 0.0178077 0.02875 -2684.49
0.476882 0.0177284 0.02875 -2678.91
0.477288 0.0176929 0.02875 -2676.39
0.479745 0.0174747 0.02875 -2658.42
0.481146 0.0173487 0.02875 -2649.69
0.0450967 0.0210144 0.02875 -3653.23
0.0474158 0.021329 0.02875 -3663.82
0.0483936 0.021458 0.02875 -3668.81
0.0488535 0.0215176 0.02875 -3670.41
0.0511735 0.0218112 0.02875 -3681.3
0.0568368 0.0224834 0.02875 -3708.73
0.0563751 0.0224312 0.02875 -3706.91
0.0582267 0.0226392 0.02875 -3716.36
0.0586945 0.0226907 0.02875 -3718.06
0.0601308 0.0228464 0.02875 -3725.99
0.0606269 0.0228993 0.02875 -3727.81
0.0619905 0.0230421 0.02875 -3735.17
0.0624567 0.0230903 0.02875 -3737.3
0.0643961 0.0232855 0.02875 -3746.92
0.063848 0.0232309 0.02875 -3744.4
0.0774978 0.0244247 0.02875 -3805.74
0.0789013 0.0245305 0.02875 -3811.16
0.372134 0.0246677 0.02875 -3438.63
0.374483 0.024557 0.02875 -3417.51
0.375892 0.0244899 0.02875 -3405.13
0.378235 0.0243766 0.02875 -3384.18
0.379616 0.0243092 0.02875 -3372.28
0.398934 0.0232861 0.02875 -3212.79
0.398389 0.0233172 0.02875 -3216.75
0.400329 0.0232062 0.02875 -3201.43
0.400799 0.0231789 0.02875 -3197.87
0.402676 0.0230693 0.02875 -3183.25
0.402208 0.0230969 0.02875 -3186.64
0.406382 0.022849 0.02875 -3154.76
0.404081 0.0229866 0.02875 -3172.4
0.404549 0.0229588 0.02875 -3168.77
0.405869 0.02288 0.02875 -3158.53
0.407847 0.0227604 0.02875 -3143.26
0.408317 0.0227317 0.02875 -3139.41
0.410197 0.0226166 0.02875 -3125.33
0.409727 0.0226456 0.02875 -3129.27
0.411601 0.0225296 0.02875 -3115.26
0.412069 0.0225004 0.02875 -3111.14
0.413852 0.0223887 0.02875 -3097.79
0.413446 0.0224143 0.02875 -3101.13
0.423825 0.0217443 0.02875 -3026.16
0.423355 0.0217754 0.02875 -3029.8
0.424295 0.0217132 0.02875 -3022.79
0.424764 0.0216821 0.02875 -3019.57
0.427545 0.0214964 0.02875 -3000.68
0.427098 0.0215263 0.02875 -3003.62
0.428468 0.0214344 0.02875 -2994.29
0.427953 0.021469 0.02875 -2997.46
0.430874 0.0212717 0.02875 -2978.16
0.432281 0.021176 0.02875 -2969.03
0.434592 0.0210176 0.02875 -2953.98
0.0826787 0.0248023 0.02875 -3825.35
0.0850113 0.0249613 0.02875 -3833.46
0.0864196 0.0250547 0.02875 -3838.4
0.0892806 0.025238 0.02875 -3847.99
0.0888745 0.0252125 0.02875 -3846.55
0.0897268 0.0252661 0.02875 -3849.66
0.0901899 0.0252951 0.02875 -3851.29
0.0929987 0.0254662 0.02875 -3860.17
0.0925296 0.0254383 0.02875 -3858.69
0.0934683 0.0254941 0.02875 -3861.74
0.0939382 0.025522 0.02875 -3863.6
0.0963482 0.0256614 0.02875 -3870.95
0.105789 0.0261664 0.02875 -3900.8
0.107106 0.026232 0.02875 -3904.86
0.107573 0.0262551 0.02875 -3906.51
0.109447 0.0263464 0.02875 -3912.52
0.108979 0.0263238 0.02875 -3910.91
0.110855 0.0264135 0.02875 -3917.1
0.111325 0.0264356 0.02875 -3918.72
0.113205 0.0265228 0.02875 -3924.99
0.112735 0.0265013 0.02875 -3923.38
0.1146 0.0265861 0.02875 -3929.82
0.115144 0.0266104 0.02875 -3931.5
0.116973 0.0266909 0.02875 -3937.87
0.116509 0.0266708 0.02875 -3936.32
0.118379 0.0267515 0.02875 -3942.73
0.118848 0.0267712 0.02875 -3944.24
0.120724 0.0268491 0.02875 -3950.66
0.120255 0.02683 0.02875 -3949.19
0.122134 0.0269062 0.02875 -3955.88
0.122603 0.0269248 0.02875 -3957.04
0.124483 0.0269977 0.02875 -3963.57
0.124013 0.0269798 0.02875 -3962.38
0.125892 0.0270507 0.02875 -3969
0.126348 0.0270675 0.02875 -3970.17
0.165375 0.0280461 0.02875 -4106.25
0.167719 0.0280785 0.02875 -4114.6
0.169128 0.0280967 0.02875 -4118.97
0.171477 0.0281255 0.02875 -4127.17
0.172887 0.0281418 0.02875 -4131.75
0.175236 0.0281675 0.02875 -4139.81
0.176646 0.0281822 0.02875 -4144.59
0.178995 0.0282055 0.02875 -4152.48
0.180405 0.028219 0.02875 -4157.29
0.182754 0.0282407 0.02875 -4165.63
0.184164 0.0282531 0.02875 -4170.5
0.186513 0.0282724 0.02875 -4178.58
0.187923 0.0282832 0.02875 -4183.67
0.190273 0.0282997 0.02875 -4191.15
0.191682 0.0283087 0.02875 -4196.02
0.194032 0.0283222 0.02875 -4203.42
0.195442 0.0283295 0.02875 -4207.85
0.197791 0.0283402 0.02875 -4215.14
0.199201 0.0283456 0.02875 -4219.02
0.201551 0.0283534 0.02875 -4226
0.20296 0.0283571 0.02875 -4229.66
0.20531 0.028362 0.02875 -4236.24
0.20672 0.0283642 0.02875 -4239.89
0.20907 0.0283661 0.02875 -4245.9
0.210479 0.0283665 0.02875 -4249.39
0.212829 0.0283654 0.02875 -4254.56
0.214239 0.0283641 0.02875 -4258.11
0.216588 0.0283596 0.02875 -4262.39
0.217998 0.0283559 0.02875 -4265.71
0.220348 0.028348 0.02875 -4269.02
0.221757 0.0283422 0.02875 -4271.58
0.224107 0.0283311 0.02875 -4274.32
0.225517 0.0283235 0.02875 -4275.65
0.227867 0.0283096 0.02875 -4278.07
0.229276 0.0283004 0.02875 -4278.8
0.231626 0.0282842 0.02875 -4280.24
0.233036 0.0282738 0.02875 -4280.43
0.235385 0.0282557 0.02875 -4281.26
0.236795 0.0282442 0.02875 -4280.99
0.239144 0.0282247 0.02875 -4280.97
0.240554 0.0282125 0.02875 -4280.45
0.242903 0.0281918 0.02875 -4279.14
0.244313 0.0281792 0.02875 -4278.28
0.246663 0.028158 0.02875 -4276.34
0.248072 0.0281451 0.02875 -4275.08
0.250421 0.0281233 0.02875 -4272.76
0.251831 0.0281099 0.02875 -4271.12
0.25418 0.0280869 0.02875 -4267.76
0.25559 0.0280726 0.02875 -4265.57
0.257938 0.0280477 0.02875 -4261.4
0.259254 0.0280331 0.02875 -4258.78
0.304877 0.0270873 0.02875 -4033.03
0.306344 0.0270476 0.02875 -4021.72
0.306814 0.0270348 0.02875 -4018.02
0.308694 0.0269837 0.02875 -4004.29
0.308224 0.0269965 0.02875 -4007.93
0.310103 0.026945 0.02875 -3993.9
0.310573 0.0269321 0.02875 -3990.33
0.312453 0.02688 0.02875 -3976.19
0.311983 0.0268931 0.02875 -3979.9
0.313862 0.0268406 0.02875 -3965.42
0.314332 0.0268273 0.02875 -3961.47
0.31621 0.0267741 0.02875 -3946.93
0.31574 0.0267875 0.02875 -3950.84
0.317619 0.0267337 0.02875 -3935.76
0.318088 0.0267201 0.02875 -3931.93
0.319965 0.0266653 0.02875 -3916.63
0.319496 0.026679 0.02875 -3920.66
0.323731 0.0265525 0.02875 -3884.75
0.323261 0.0265668 0.02875 -3888.68
0.321282 0.0266263 0.02875 -3905.42
0.321793 0.0266111 0.02875 -3901.81
0.325141 0.0265092 0.02875 -3872.3
0.325611 0.0264948 0.02875 -3868.67
0.327491 0.0264356 0.02875 -3851.76
0.327021 0.0264504 0.02875 -3855.73
0.3289 0.0263904 0.02875 -3838.82
0.329369 0.0263753 0.02875 -3834.76
0.331248 0.0263137 0.02875 -3817.53
0.330778 0.0263292 0.02875 -3821.62
0.332656 0.0262665 0.02875 -3804.21
0.333125 0.0262507 0.02875 -3799.97
0.334996 0.0261864 0.02875 -3782.4
0.334532 0.0262025 0.02875 -3786.89
0.349048 0.0256646 0.02875 -3652.46
0.349593 0.0256431 0.02875 -3647.45
0.352397 0.0255307 0.02875 -3620.8
0.351927 0.0255498 0.02875 -3625.37
0.352866 0.0255116 0.02875 -3616.23
0.353336 0.0254924 0.02875 -3612.26
0.356152 0.0253761 0.02875 -3585.51
0.355683 0.0253958 0.02875 -3590.45
0.356622 0.0253565 0.02875 -3581.07
0.35709 0.0253368 0.02875 -3577
0.359813 0.025221 0.02875 -3551.49
0.359407 0.0252384 0.02875 -3554.91
0.360871 0.0251754 0.02875 -3541.36
0.363205 0.0250734 0.02875 -3519.95
0.364615 0.0250109 0.02875 -3506.98
0.366961 0.0249055 0.02875 -3485.58
0.368368 0.0248416 0.02875 -3472.96
0.370621 0.024738 0.02875 -3452.22
