<?xml version="1.0" encoding="UTF-8" standalone="no"?>
<!-- Created with Inkscape (http://www.inkscape.org/) -->

<svg
   width="150"
   height="150"
   viewBox="0 0 39.687499 39.687501"
   version="1.1"
   id="svg5"
   inkscape:version="1.1.1 (3bf5ae0d25, 2021-09-20, custom)"
   sodipodi:docname="logo.svg"
   xmlns:inkscape="http://www.inkscape.org/namespaces/inkscape"
   xmlns:sodipodi="http://sodipodi.sourceforge.net/DTD/sodipodi-0.dtd"
   xmlns:xlink="http://www.w3.org/1999/xlink"
   xmlns="http://www.w3.org/2000/svg"
   xmlns:svg="http://www.w3.org/2000/svg">
  <sodipodi:namedview
     id="namedview7"
     pagecolor="#ffffff"
     bordercolor="#666666"
     borderopacity="1.0"
     inkscape:pageshadow="2"
     inkscape:pageopacity="0.0"
     inkscape:pagecheckerboard="0"
     inkscape:document-units="px"
     showgrid="false"
     units="px"
     showguides="true"
     inkscape:guide-bbox="true"
     inkscape:zoom="2.8284271"
     inkscape:cx="77.428193"
     inkscape:cy="76.897863"
     inkscape:window-width="1366"
     inkscape:window-height="709"
     inkscape:window-x="0"
     inkscape:window-y="27"
     inkscape:window-maximized="1"
     inkscape:current-layer="layer1">
    <sodipodi:guide
       position="-50.782914,36.099856"
       orientation="1,0"
       id="guide24961" />
  </sodipodi:namedview>
  <defs
     id="defs2">
    <linearGradient
       inkscape:collect="always"
       id="linearGradient31697">
      <stop
         style="stop-color:#447a93;stop-opacity:1"
         offset="0"
         id="stop31693" />
      <stop
         style="stop-color:#afdae3;stop-opacity:1"
         offset="1"
         id="stop31695" />
    </linearGradient>
    <linearGradient
       inkscape:collect="always"
       xlink:href="#linearGradient31697"
       id="linearGradient31699"
       x1="0.53413066"
       y1="19.918048"
       x2="39.254048"
       y2="19.918048"
       gradientUnits="userSpaceOnUse" />
  </defs>
  <g
     inkscape:label="Layer 1"
     inkscape:groupmode="layer"
     id="layer1">
    <path
       id="path28347"
       style="fill:none;stroke:url(#linearGradient31699);stroke-width:4.67452;stroke-linejoin:round;stroke-miterlimit:4;stroke-dasharray:none;paint-order:stroke fill markers"
       d="m 17.410691,22.401571 c -0.962922,0.965438 -1.963606,1.968201 -2.510131,2.514728 -1.37761,1.37761 -3.183357,2.066503 -4.9889343,2.066503 -1.8055782,0 -3.6109056,-0.688893 -4.9885164,-2.066503 -2.755221,-2.75522 -2.755221,-7.222231 0,-9.977453 2.7552209,-2.75522 7.2222297,-2.75522 9.9774507,0 1.485092,1.485094 4.993529,4.971808 4.993529,4.971808 m 2.483398,-2.490499 c 0.962923,-0.965437 1.963604,-1.968619 2.510131,-2.515143 2.75522,-2.75522 7.222231,-2.75522 9.977452,0 2.75522,2.755219 2.75522,7.222229 0,9.977451 -2.755221,2.755221 -7.222232,2.755221 -9.977452,0 -1.485094,-1.485094 -4.993529,-4.971809 -4.993529,-4.971809"
       sodipodi:nodetypes="cssssscccsssc" />
  </g>
</svg>
