{
  "Version": "2012-10-17",
  "Statement": [
    {
      "Effect": "Allow",
      "Action": ["ec2:*"],
      "Resource": ["*"]
    },
    {
      "Effect": "Allow",
      "Action": ["elasticloadbalancing:*"],
      "Resource": ["*"]
    }
  ]
}
