<svg width="30" height="23" viewBox="0 0 30 23" fill="none" xmlns="http://www.w3.org/2000/svg">
<path d="M10.9 0.6C12.2 0.2 13.5 0 14.8 0C16.1 0 17.4 0.2 18.7 0.5C20 0.9 21.2 1.4 22.3 2C23.4 2.6 24.4 3.3 25.3 4.1C26.3 4.9 27.1 5.7 27.7 6.5C28.4 7.3 28.9 8.1 29.2 8.9C29.6 9.7 29.8 10.4 29.8 11C29.8 11.6 29.6 12.3 29.3 13.1C28.9 13.9 28.4 14.7 27.8 15.5C27.2 16.3 26.4 17.2 25.4 18C24.5 18.8 23.5 19.5 22.4 20.2C21.3 20.8 20.2 21.3 18.9 21.7C17.6 22.1 16.3 22.3 15 22.3C13.7 22.3 12.4 22.1 11.1 21.8C9.8 21.5 8.6 21 7.6 20.4C6.5 19.8 5.5 19.1 4.6 18.3C3.6 17.5 2.8 16.7 2.2 15.9C1.5 15 1 14.2 0.6 13.4C0.2 12.6 0 11.9 0 11.3C0 10.7 0.2 10 0.5 9.2C0.9 8.4 1.4 7.6 2 6.8C2.6 6 3.4 5.1 4.4 4.3C5.3 3.5 6.3 2.8 7.4 2.1C8.5 1.5 9.7 1 10.9 0.6ZM11.7 19.2C12.8 19.5 13.9 19.7 15 19.7C16.1 19.7 17.2 19.5 18.3 19.2C19.4 18.9 20.4 18.4 21.2 17.9C22.1 17.4 22.9 16.7 23.6 16.1C24.4 15.4 25 14.8 25.5 14.1C26 13.5 26.4 12.9 26.7 12.3C27 11.8 27.1 11.4 27.1 11.1C27.1 10.8 26.9 10.4 26.7 9.9C26.4 9.4 26 8.8 25.5 8.2C25 7.6 24.3 6.9 23.6 6.3C22.8 5.6 22 5 21.1 4.4C20.2 3.9 19.2 3.4 18.1 3.1C17 2.8 15.9 2.6 14.8 2.6C13.7 2.6 12.6 2.8 11.5 3.1C10.5 3.6 9.5 4 8.6 4.5C7.7 5.1 6.9 5.7 6.2 6.4C5.4 7 4.8 7.7 4.3 8.3C3.8 8.9 3.4 9.5 3.1 10.1C2.8 10.6 2.7 11 2.7 11.3C2.7 11.6 2.9 12 3.1 12.5C3.4 13 3.8 13.6 4.3 14.2C4.8 14.8 5.5 15.5 6.2 16.1C7 16.8 7.9 17.4 8.7 18C9.6 18.5 10.6 18.9 11.7 19.2ZM18.2 9.5L20.6 8.3C21.1 9.2 21.3 10.2 21.3 11.2C21.3 13 20.7 14.5 19.5 15.7C18.3 16.9 16.8 17.6 15 17.6C13.2 17.6 11.7 17 10.5 15.8C9.2 14.6 8.6 13.1 8.6 11.3C8.6 9.5 9.2 8 10.4 6.8C11.6 5.5 13.1 4.9 14.9 4.9V7.6C13.9 7.6 13 8 12.3 8.7C11.6 9.4 11.2 10.3 11.2 11.3C11.2 12.3 11.6 13.2 12.3 13.9C13 14.6 13.9 15 14.9 15C15.9 15 16.8 14.6 17.5 13.9C18.2 13.2 18.6 12.3 18.6 11.3C18.7 10.6 18.5 10 18.2 9.5Z" fill="#828282"/>
</svg>
