@startuml
| CFN |
start
:cfn-pivot;
note right
  This captures
  DeployChannel
end note
:scale up masters;
:generate bootstrap token;
:scale up workers;
:create Okta\nOIDC cluster-admin;
:write out helmfile0\nstatic pod;
floating note right
    propagates
    DeployChannel
end note

| Helmfile0 |
:fetch helmfile.yaml;
note right
all of
these steps
run on master0
end note
:helmfile sync;
partition "helmfile sync" {
:storage class;
:cert manager;
:ingress controller;
:ODB;
:Kafka;
:cluster upgrade;
floating note left
    propagates
    DeployChannel
end note
}
| Cluster Upgrade Pod |
:fetch;
note right
relevant environment:
$OPENRAVEN_UPGRADES_NAME="openraven-deploy"
$OPENRAVEN_UPGRADES_KEY="charts/helmfile.yaml"
end note
end
@enduml
