{
  "@graph" : [ {
    "@id" : "_:b0",
    "@type" : "PATO:0000117",
    "unit" : "unitLength:um",
    "value" : {
      "@type" : "xsd:float",
      "@value" : "100000.0"
    }
  }, {
    "@id" : "_:b1",
    "@type" : "ome:StructuredAnnotations",
    "annotation" : [ "tagAnnotation:tagAnnotation3", "tagAnnotation:tagAnnotation2", "tagAnnotation:tagAnnotation1" ]
  }, {
    "@id" : "dimensionOrder:xyczt",
    "@type" : "ome:DimensionOrder"
  }, {
    "@id" : "pixelType:uint8",
    "@type" : "ome:PixelType"
  }, {
    "@id" : "unitLength:um",
    "@type" : "rdfs:Class"
  }, {
    "@id" : "bindata:bindata1",
    "@type" : "ome:BinData",
    "ome:bigEndian" : false,
    "data" : "/wCrzur//wB5oMPi/wBIbJO3AP8ePGCF",
    "length" : "32"
  }, {
    "@id" : "image:image0",
    "@type" : "ome:Image",
    "identifier" : "Image:0",
    "acquisitionDate" : "2010-02-23T12:51:30",
    "annotation" : "tagAnnotation:tagAnnotation3",
    "ome:pixels" : {
      "@id" : "pixels:pixels0.0"
    },
    "label" : {
      "@language" : "en",
      "@value" : "6x6x1x8-swatch.tif"
    }
  }, {
    "@id" : "pixels:pixels0.0",
    "@type" : "ome:Pixels",
    "identifier" : "Pixels:0.0",
    "binData" : "bindata:bindata1",
    "ome:dimensionOrder" : {
      "@id" : "dimensionOrder:xyczt"
    },
    "physicalSizeX" : "_:b0",
    "physicalSizeY" : "_:b0",
    "ome:pixelType" : {
      "@id" : "pixelType:uint8"
    },
    "sizeC" : "1",
    "sizeT" : "1",
    "sizeX" : "6",
    "sizeY" : "4",
    "sizeZ" : "1"
  }, {
    "@id" : "tagAnnotation:tagAnnotation1",
    "@type" : [ "ome:TagAnnotation", "ome:Annotation" ],
    "identifier" : "Annotation:1",
    "value" : "SampleTagA",
    "comment" : {
      "@language" : "en",
      "@value" : "This is the description of the sample tag A"
    }
  }, {
    "@id" : "tagAnnotation:tagAnnotation2",
    "@type" : [ "ome:TagAnnotation", "ome:Annotation" ],
    "identifier" : "Annotation:2",
    "value" : "SampleTagB",
    "comment" : {
      "@language" : "en",
      "@value" : "This is the description of the sample tag B"
    }
  }, {
    "@id" : "tagAnnotation:tagAnnotation3",
    "@type" : [ "ome:TagAnnotation", "ome:Annotation" ],
    "identifier" : "Annotation:3",
    "annotation" : [ "tagAnnotation:tagAnnotation2", "tagAnnotation:tagAnnotation1" ],
    "namespace" : "\"openmicroscopy.org/omero/insight/tagset\"",
    "value" : "SimpleTagset",
    "comment" : {
      "@language" : "en",
      "@value" : "This is the description of the sample tagse"
    }
  } ],
  "@context" : {
    "length" : {
      "@id" : "http://www.openmicroscopy.org/rdf/2016-06/ome_core/length",
      "@type" : "http://www.w3.org/2001/XMLSchema#nonNegativeLong"
    },
    "data" : {
      "@id" : "http://www.openmicroscopy.org/rdf/2016-06/ome_core/data",
      "@type" : "http://www.w3.org/2001/XMLSchema#base64Binary"
    },
    "bigEndian" : {
      "@id" : "http://www.openmicroscopy.org/rdf/2016-06/ome_core/bigEndian",
      "@type" : "http://www.w3.org/2001/XMLSchema#boolean"
    },
    "value" : {
      "@id" : "http://www.w3.org/1999/02/22-rdf-syntax-ns#value"
    },
    "comment" : {
      "@id" : "http://www.w3.org/2000/01/rdf-schema#comment"
    },
    "identifier" : {
      "@id" : "http://purl.org/dc/terms/identifier"
    },
    "sizeY" : {
      "@id" : "http://www.openmicroscopy.org/rdf/2016-06/ome_core/sizeY",
      "@type" : "http://www.w3.org/2001/XMLSchema#positiveInteger"
    },
    "physicalSizeY" : {
      "@id" : "http://www.openmicroscopy.org/rdf/2016-06/ome_core/physicalSizeY",
      "@type" : "@id"
    },
    "sizeX" : {
      "@id" : "http://www.openmicroscopy.org/rdf/2016-06/ome_core/sizeX",
      "@type" : "http://www.w3.org/2001/XMLSchema#positiveInteger"
    },
    "sizeZ" : {
      "@id" : "http://www.openmicroscopy.org/rdf/2016-06/ome_core/sizeZ",
      "@type" : "http://www.w3.org/2001/XMLSchema#positiveInteger"
    },
    "binData" : {
      "@id" : "http://www.openmicroscopy.org/rdf/2016-06/ome_core/binData",
      "@type" : "@id"
    },
    "sizeC" : {
      "@id" : "http://www.openmicroscopy.org/rdf/2016-06/ome_core/sizeC",
      "@type" : "http://www.w3.org/2001/XMLSchema#positiveInteger"
    },
    "physicalSizeX" : {
      "@id" : "http://www.openmicroscopy.org/rdf/2016-06/ome_core/physicalSizeX",
      "@type" : "@id"
    },
    "pixelType" : "http://www.openmicroscopy.org/rdf/2016-06/ome_core/PixelType#",
    "sizeT" : {
      "@id" : "http://www.openmicroscopy.org/rdf/2016-06/ome_core/sizeT",
      "@type" : "http://www.w3.org/2001/XMLSchema#positiveInteger"
    },
    "dimensionOrder" : "http://www.openmicroscopy.org/rdf/2016-06/ome_core/DimensionOrder#",
    "unit" : {
      "@id" : "http://qudt.org/schema/qudt/unit",
      "@type" : "@id"
    },
    "annotation" : {
      "@id" : "http://www.openmicroscopy.org/rdf/2016-06/ome_core/annotation",
      "@type" : "@id"
    },
    "namespace" : {
      "@id" : "http://www.openmicroscopy.org/rdf/2016-06/ome_core/namespace"
    },
    "acquisitionDate" : {
      "@id" : "http://www.openmicroscopy.org/rdf/2016-06/ome_core/acquisitionDate"
    },
    "pixels" : "http://www.openmicroscopy.org/rdf/2016-06/ome_core/samples/tagannotation/pixels/",
    "label" : {
      "@id" : "http://www.w3.org/2000/01/rdf-schema#label"
    },
    "qudt" : "http://qudt.org/schema/qudt/",
    "image" : "http://www.openmicroscopy.org/rdf/2016-06/ome_core/samples/tagannotation/image/",
    "owl" : "http://www.w3.org/2002/07/owl#",
    "ome" : "http://www.openmicroscopy.org/rdf/2016-06/ome_core/",
    "xsd" : "http://www.w3.org/2001/XMLSchema#",
    "PATO" : "http://purl.obolibrary.org/obo/PATO_",
    "rdfs" : "http://www.w3.org/2000/01/rdf-schema#",
    "unitLength" : "http://www.openmicroscopy.org/rdf/2016-06/ome_core/Unit/UnitLength#",
    "rdf" : "http://www.w3.org/1999/02/22-rdf-syntax-ns#",
    "xml" : "http://www.w3.org/XML/1998/namespace",
    "dcterms" : "http://purl.org/dc/terms/",
    "UO" : "http://purl.obolibrary.org/obo/uo#",
    "bindata" : "http://www.openmicroscopy.org/rdf/2016-06/ome_core/samples/tagannotation/bindata/",
    "tagAnnotation" : "http://www.openmicroscopy.org/rdf/2016-06/ome_core/samples/tagannotation/tagAnnotation/"
  }
}
