{
  "@graph" : [ {
    "@id" : "_:b0",
    "@type" : "PATO:0000117",
    "unit" : "unitLength:nm",
    "rdf:value" : {
      "@type" : "xsd:float",
      "@value" : "100000.0"
    }
  }, {
    "@id" : "_:b1",
    "@type" : "ome:StructuredAnnotations",
    "annotation" : [ "mapAnnotation:mapAnnotation2", "mapAnnotation:mapAnnotation1" ]
  }, {
    "@id" : "dimensionOrder:xyczt",
    "@type" : "ome:DimensionOrder"
  }, {
    "@id" : "pixelType:uint8",
    "@type" : "ome:PixelType"
  }, {
    "@id" : "unitLength:nm",
    "@type" : "rdfs:Class"
  }, {
    "@id" : "bindata:bindata0",
    "@type" : "ome:BinData",
    "ome:bigEndian" : false,
    "data" : "/wCrzur//wB5oMPi/wBIbJO3AP8ePGCF",
    "length" : "32"
  }, {
    "@id" : "image:image0",
    "@type" : "ome:Image",
    "identifier" : "Image:0",
    "acquisitionDate" : "2010-02-23T12:51:30",
    "annotation" : [ "mapAnnotation:mapAnnotation2", "mapAnnotation:mapAnnotation1" ],
    "ome:pixels" : {
      "@id" : "pixels:pixels0.0"
    },
    "label" : {
      "@language" : "en",
      "@value" : "6x6x1x8-swatch.tif"
    }
  }, {
    "@id" : "map:map1",
    "@type" : "ome:Map",
    "key" : "SampleKeyA",
    "ome:value" : "SampleValueA"
  }, {
    "@id" : "map:map2.1",
    "@type" : "ome:Map",
    "key" : "SampleKeyB-1",
    "ome:value" : "SampleValueB-1"
  }, {
    "@id" : "map:map2.2",
    "@type" : "ome:Map",
    "key" : "SampleKeyB-2",
    "ome:value" : "SampleValueB-2"
  }, {
    "@id" : "mapAnnotation:mapAnnotation1",
    "@type" : [ "ome:MapAnnotation", "ome:Annotation" ],
    "identifier" : "Annotation:1",
    "value" : "map:map1",
    "comment" : {
      "@language" : "en",
      "@value" : "This is the description of the sample map A"
    }
  }, {
    "@id" : "mapAnnotation:mapAnnotation2",
    "@type" : [ "ome:MapAnnotation", "ome:Annotation" ],
    "identifier" : "Annotation:2",
    "value" : [ "map:map2.2", "map:map2.1" ],
    "comment" : {
      "@language" : "en",
      "@value" : "This is the description of the sample map B"
    }
  }, {
    "@id" : "pixels:pixels0.0",
    "@type" : "ome:Pixels",
    "identifier" : "Pixels:0.0",
    "binData" : "bindata:bindata0",
    "ome:dimensionOrder" : {
      "@id" : "dimensionOrder:xyczt"
    },
    "physicalSizeX" : "_:b0",
    "physicalSizeY" : "_:b0",
    "pixcelType" : "pixelType:uint8",
    "sizeC" : "1",
    "sizeT" : "1",
    "sizeX" : "6",
    "sizeY" : "4",
    "sizeZ" : "1"
  } ],
  "@context" : {
    "value" : {
      "@id" : "http://www.w3.org/1999/02/22-rdf-syntax-ns#value",
      "@type" : "@id"
    },
    "comment" : {
      "@id" : "http://www.w3.org/2000/01/rdf-schema#comment"
    },
    "identifier" : {
      "@id" : "http://purl.org/dc/terms/identifier"
    },
    "key" : {
      "@id" : "http://www.openmicroscopy.org/rdf/2016-06/ome_core/key"
    },
    "annotation" : {
      "@id" : "http://www.openmicroscopy.org/rdf/2016-06/ome_core/annotation",
      "@type" : "@id"
    },
    "acquisitionDate" : {
      "@id" : "http://www.openmicroscopy.org/rdf/2016-06/ome_core/acquisitionDate"
    },
    "pixels" : "http://www.openmicroscopy.org/rdf/2016-06/ome_core/samples/mapannotation/pixels/",
    "label" : {
      "@id" : "http://www.w3.org/2000/01/rdf-schema#label"
    },
    "sizeY" : {
      "@id" : "http://www.openmicroscopy.org/rdf/2016-06/ome_core/sizeY",
      "@type" : "http://www.w3.org/2001/XMLSchema#positiveInteger"
    },
    "binData" : {
      "@id" : "http://www.openmicroscopy.org/rdf/2016-06/ome_core/binData",
      "@type" : "@id"
    },
    "sizeX" : {
      "@id" : "http://www.openmicroscopy.org/rdf/2016-06/ome_core/sizeX",
      "@type" : "http://www.w3.org/2001/XMLSchema#positiveInteger"
    },
    "sizeZ" : {
      "@id" : "http://www.openmicroscopy.org/rdf/2016-06/ome_core/sizeZ",
      "@type" : "http://www.w3.org/2001/XMLSchema#positiveInteger"
    },
    "sizeC" : {
      "@id" : "http://www.openmicroscopy.org/rdf/2016-06/ome_core/sizeC",
      "@type" : "http://www.w3.org/2001/XMLSchema#positiveInteger"
    },
    "sizeT" : {
      "@id" : "http://www.openmicroscopy.org/rdf/2016-06/ome_core/sizeT",
      "@type" : "http://www.w3.org/2001/XMLSchema#positiveInteger"
    },
    "pixcelType" : {
      "@id" : "http://www.openmicroscopy.org/rdf/2016-06/ome_core/pixcelType",
      "@type" : "@id"
    },
    "dimensionOrder" : "http://www.openmicroscopy.org/rdf/2016-06/ome_core/DimensionOrder#",
    "physicalSizeX" : {
      "@id" : "http://www.openmicroscopy.org/rdf/2016-06/ome_core/physicalSizeX",
      "@type" : "@id"
    },
    "physicalSizeY" : {
      "@id" : "http://www.openmicroscopy.org/rdf/2016-06/ome_core/physicalSizeY",
      "@type" : "@id"
    },
    "unit" : {
      "@id" : "http://qudt.org/schema/qudt/unit",
      "@type" : "@id"
    },
    "length" : {
      "@id" : "http://www.openmicroscopy.org/rdf/2016-06/ome_core/length",
      "@type" : "http://www.w3.org/2001/XMLSchema#nonNegativeLong"
    },
    "data" : {
      "@id" : "http://www.openmicroscopy.org/rdf/2016-06/ome_core/data",
      "@type" : "http://www.w3.org/2001/XMLSchema#base64Binary"
    },
    "bigEndian" : {
      "@id" : "http://www.openmicroscopy.org/rdf/2016-06/ome_core/bigEndian",
      "@type" : "http://www.w3.org/2001/XMLSchema#boolean"
    },
    "qudt" : "http://qudt.org/schema/qudt/",
    "image" : "http://www.openmicroscopy.org/rdf/2016-06/ome_core/samples/mapannotation/image/",
    "mapAnnotation" : "http://www.openmicroscopy.org/rdf/2016-06/ome_core/samples/mapannotation/mapAnnotation/",
    "owl" : "http://www.w3.org/2002/07/owl#",
    "ome" : "http://www.openmicroscopy.org/rdf/2016-06/ome_core/",
    "xsd" : "http://www.w3.org/2001/XMLSchema#",
    "PATO" : "http://purl.obolibrary.org/obo/PATO_",
    "rdfs" : "http://www.w3.org/2000/01/rdf-schema#",
    "pixelType" : "http://www.openmicroscopy.org/rdf/2016-06/ome_core/PixelType#",
    "unitLength" : "http://www.openmicroscopy.org/rdf/2016-06/ome_core/Unit/UnitLength#",
    "rdf" : "http://www.w3.org/1999/02/22-rdf-syntax-ns#",
    "xml" : "http://www.w3.org/XML/1998/namespace",
    "dcterms" : "http://purl.org/dc/terms/",
    "UO" : "http://purl.obolibrary.org/obo/uo#",
    "bindata" : "http://www.openmicroscopy.org/rdf/2016-06/ome_core/samples/mapannotation/bindata/",
    "map" : "http://www.openmicroscopy.org/rdf/2016-06/ome_core/samples/mapannotation/map/"
  }
}
