{
 "url": "s3://minio.openmicroscopy.org/idr/idr0018-neff-histopathology/20160503-neff-disk/RawDataTCP-linesWP6final/BAZLA-TCP/Bazla-14-100-skin%20-%202015-06-20%2001.24.39.ndpi", 
 "readers": [
  "loci.formats.in.NDPIReader"
 ]
}