{
 "url": "s3://minio.openmicroscopy.org/idr/idr0018-neff-histopathology/20160503-neff-disk/RawDataTCP-linesWP6final/BAZLA-TCP/Bazla-14-99-LN%20-%202015-06-19%2022.56.04.ndpi", 
 "readers": [
  "loci.formats.in.NDPIReader"
 ]
}