0,hello, world, of, csv,678678,467457,201,w34235,end
1,201,w34235,13241235,2341235,678679,467458,202,w34236,13241236
2,202,w34236,13241236,2341236,678680,467459,203,w34237,13241237
3,203,w34237,13241237,2341237,678681,467460,204,w34238,13241238
4,204,w34238,13241238,2341238,678682,467461,205,w34239,13241239
5,205,w34239,13241239,2341239,678683,467462,206,w34240,13241240
6,206,w34240,13241240,2341240,678684,467463,207,w34241,13241241
7,207,w34241,13241241,2341241,678685,467464,208,w34242,13241242
8,208,w34242,13241242,2341242,678686,467465,209,w34243,13241243
9,209,w34243,13241243,2341243,678687,467466,210,w34244,13241244
10,first,second,third,fourth,fifth,sixth,seventh,eighth,ninth
