{
	"address": {
		"x": 2.5,
		"y": 5.8,
		"width": 10,
		"height": 5.0,
		"fontSize": 10
	},
	"info": {
		"x": 14.7,
		"y": 5.3,
		"width": 5.5,
		"height": 5.0,
		"fontSize": 6,
		"text": ["Dornheimer Weg 24", "64293 Darmstadt", "Telefon  06151 701-xxxx", "Telefax  06151 701-xxxx", "vorname.nachname@e-netz-suedhessen.de", "Ihr Zeichen: <t:customerReference>", "Unser Zeichen: <t:id>", "", "" ,"Datum <t:b-currentDate>" ]
	},
	"contentP1": {
		"x": 2.5,
		"y": 11.4,
		"width": 13.0,
		"height": 14.0,
		"fontSize": 10,
		"text": ["Sehr geehrte(r) <t:c-salutation> <t:c-title> <t:c-firstName> <t:c-lastName>,\n\n vielen Dank für Ihre Anfrage.\n\n\n"]
	},
	"contentP2": {
		"x": 2.5,
		"y": 5.3,
		"width": 13.0,
		"height": 20.0,
		"fontSize": 10
	},
	"closing": {
		"salutation": [
			"",
			"",
			"",
			"Mit freundlichen Grüßen",
			"Ihre e-netz Südhessen AG"
		],
		"signatures": [
			{
				"xoffset": 0,
				"yoffset": 2,
				"width": 5,
				"lines": [
					"Hans Huber",
					"Geschäftsführer"
				]
			},
			{
				"xoffset": 7.8,
				"yoffset": 2,
				"width": 5,
				"lines": [
					"i.A. Sepp Meier",
					"Netzbetrieb"
				]
			}
			
		]
	}
}