SDO_X1;SDO_Y1;G3E_FID;STATIONS_NR;STATIONS_NAME;;;;;;;;;;;;
452111,51;5496666,85;5711305;111001;Test Polygon;;;;;;;;;;;;
482901,924;5564437,514;94460420;338497;Mellingburgredder 34;;;;;;;;;;;;
482992,254;5564716,094;95284956;338682;Ruschestrasse 1;;;;;;;;;;;;
483175,184;5564662,994;95097550;338640;Lange Strasse 1a T1;;;;;;;;;;;;
483189,174;5564660,324;94459620;338494;Lange Strasse 1a U1;;;;;;;;;;;;
483190,244;5564654,934;94459518;338490;Lange Strasse 1;;;;;;;;;;;;
483236,854;5563978,764;94877073;338503;Ollenhauer Str 4;;;;;;;;;;;;
483363,594;5564877,854;94459918;338507;Buelowstrasse Str 8a;;;;;;;;;;;;
483364,124;5566014,354;94573536;338532;Ziegelstr 4;;;;;;;;;;;;
483368,504;5563987,524;94463703;338511;Hedemannstasse 8;;;;;;;;;;;;
483406,124;5565130,564;94462127;338491;Buelowstrasse Str 17;;;;;;;;;;;;
