SDO_X1;SDO_Y1;G3E_FID;PLZ;ORT;ORTSTEIL;STRASSE;HAUSNUMMER;;;;;;;;
472794,38;5549942,18;74312595;12345;Testort;Testortsteil;Marseiller Strasse;29;;;;;;;;
472812,16;5549956,67;74400207;12345;Testort;Testortsteil;Marseiller Strasse;27;;;;;;;;
472828,04;5549967,84;74347053;12345;Testort;Testortsteil;Marseiller Strasse;25;;;;;;;;
472831,27;5549946,20;74369636;12345;Testort;Testortsteil;Marseiller Strasse;28;;;;;;;;
472844,51;5549953,15;74366344;12345;Testort;Testortsteil;Marseiller Strasse;26;;;;;;;;
472846,19;5549983,97;74373227;12345;Testort;Testortsteil;Marseiller Strasse;23;;;;;;;;
472857,19;5549991,14;74384596;12345;Testort;Testortsteil;Marseiller Strasse;21;;;;;;;;
472862,02;5549966,60;74394370;12345;Testort;Testortsteil;Marseiller Strasse;24;;;;;;;;
472863,77;5549920,01;74359865;12345;Testort;Testortsteil;Ringstr.;24;;;;;;;;
472873,15;5550031,07;74285591;12345;Testort;Testortsteil;Marseiller Strasse;17a;;;;;;;;
472877,65;5549977,14;74286982;12345;Testort;Testortsteil;Marseiller Strasse;22;;;;;;;;
472879,05;5550002,10;74321992;12345;Testort;Testortsteil;Marseiller Strasse;19;;;;;;;;
472884,29;5549899,34;74399517;12345;Testort;Testortsteil;Ringstr.;22;;;;;;;;
472890,11;5550013,82;74308743;12345;Testort;Testortsteil;Marseiller Strasse;17;;;;;;;;
472891,20;5550044,72;74285517;12345;Testort;Testortsteil;Marseiller Strasse;15a;;;;;;;;
472891,31;5549924,70;74384438;12345;Testort;Testortsteil;Ringstr.;17;;;;;;;;
472894,03;5549988,20;74404604;12345;Testort;Testortsteil;Marseiller Strasse;20a;;;;;;;;
472899,23;5549883,06;74393913;12345;Testort;Testortsteil;Ringstr.;20;;;;;;;;
472902,80;5550494,55;74322099;12345;Testort;Testortsteil;Schillerstrasse;30;;;;;;;;
472906,81;5550023,24;74308710;12345;Testort;Testortsteil;Marseiller Strasse;15;;;;;;;;
472908,95;5549894,58;74315109;12345;Testort;Testortsteil;Ringstr.;15;;;;;;;;
472908,99;5549872,80;74345136;12345;Testort;Testortsteil;Ringstr.;18;;;;;;;;
472909,28;5549944,94;74401854;12345;Testort;Testortsteil;Ringstr.;19;;;;;;;;
472910,76;5549999,24;74303274;12345;Testort;Testortsteil;Marseiller Strasse;18;;;;;;;;
472917,37;5549855,91;74317806;12345;Testort;Testortsteil;Ringstr.;16;;;;;;;;
