{
    "Servers": {
      "1": {
        "Name": "Openkonsequenz Server",
        "Group": "Servers",
        "Host": "postgres",
        "Port": 5432,
        "MaintenanceDB": "postgres",
        "Username": "postgres",
        "SSLMode": "prefer",
        "PassFile": "/var/lib/pgadmin/pgpass"
      }
    }
  }
