SDO_X1;SDO_Y1;G3E_FID;PLZ;ORT;ORTSTEIL;STRASSE;HAUS_NR;STATIONS_NR;;;;;;;;
453187,81;5498536,6;5000001;11111;Test Polygon;Test Polygon;Test-Strasse;18;111001;;;;;;;;
452111,51;5496666,85;5000002;11111;Test Polygon;Test Polygon;Test-Strasse;19;111001;;;;;;;;
455163,19;5496826,26;5000003;11111;Test Polygon;Test Polygon;Test-Strasse;20;111001;;;;;;;;
454660,45;5498987,63;5000004;11111;Test Polygon;Test Polygon;Test-Strasse;21;111001;;;;;;;;
453187,81;5498536,6;5000005;11111;Test Polygon;Test Polygon;Test-Strasse;22;111001;;;;;;;;
472794,384;5549942,184;94521725;22222;Testort2;Testortsteil2;Ringstr.;30;338497;;;;;;;;
472806,334;5549936,504;94519844;;;;;;338497;;;;;;;;
472833,894;5550095,374;94519885;;;;;;338682;;;;;;;;
472840,784;5550115,394;94522009;;;;;;338682;;;;;;;;
472856,694;5549993,684;94522270;;;;;;338497;;;;;;;;
472857,374;5550083,754;94519883;;;;;;338682;;;;;;;;
472862,794;5550118,584;94519304;;;;;;338682;;;;;;;;
472868,824;5550142,964;94522268;;;;;;338682;;;;;;;;
472875,104;5550149,144;94521559;;;;;;338682;;;;;;;;
472893,604;5550143,444;94519892;;;;;;338682;;;;;;;;
472894,514;5550077,074;94522180;;;;;;338497;;;;;;;;
472900,794;5550153,574;94519891;;;;;;338682;;;;;;;;
472900,994;5550081,244;94522037;;;;;;338497;;;;;;;;
472902,634;5550097,924;94519886;;;;;;338497;;;;;;;;
472914,054;5550001,164;94519845;;;;;;338497;;;;;;;;
472915,184;5550182,284;94519287;;;;;;338682;;;;;;;;
472915,784;5550222,454;94519305;;;;;;338682;;;;;;;;
472919,664;5550068,924;94521635;;;;;;338497;;;;;;;;
472923,034;5550190,764;94522102;;;;;;338682;;;;;;;;
472924,284;5550191,884;94519307;22222;Testort2;Testortsteil2;Seestr.;4 bei 1;338682;;;;;;;;
472929,464;5550197,434;94519306;;;;;;338682;;;;;;;;
472935,304;5550201,934;94519888;;;;;;338682;;;;;;;;
472936,224;5550214,054;94522251;;;;;;338682;;;;;;;;
472940,934;5550072,254;94519889;;;;;;338497;;;;;;;;
472944,004;5550238,454;94521873;;;;;;338682;;;;;;;;
472948,954;5550030,894;94519846;;;;;;338497;;;;;;;;
472956,414;5550227,664;94521682;;;;;;338682;;;;;;;;
486201,754;5553563,844;5052564;77777;Testort5;Testortsteil1;Heinrich-Frey-Str.;22a;338640;;;;;;;;
486202,044;5553603,494;5105926;77777;Testort5;Testortsteil1;Theodor-Heuß-Str.;25b;338640;;;;;;;;
486203,924;5553338,354;5088239;77777;Testort5;Testortsteil1;Landhausstraße;26a;338640;;;;;;;;
486204,224;5553999,854;5372481;77777;Testort5;Testortsteil1;Kirchenallee;33;338490;;;;;;;;
486204,974;5553562,004;5106942;77777;Testort5;Testortsteil1;Heinrich-Frey-Str.;22;338640;;;;;;;;
486205,084;5554221,904;5462574;77777;Testort5;Testortsteil1;Lichtenbergstr.;18;338494;;;;;;;;
486205,344;5553362,654;5074215;77777;Testort5;Testortsteil1;Siegfriedstr.;5;338640;;;;;;;;
486206,064;5554385,674;5124580;77777;Testort5;Testortsteil1;Jägersburger Str.;29;338494;;;;;;;;
486206,104;5554268,564;5369520;77777;Testort5;Testortsteil1;Schaarsteinweg;26;338494;;;;;;;;
486206,184;5553600,134;5120915;77777;Testort5;Testortsteil1;Theodor-Heuß-Str.;25a;338640;;;;;;;;
486207,314;5553372,324;5098856;77777;Testort5;Testortsteil1;Kriemhildenstr.;4;338640;;;;;;;;
486207,894;5554022,824;87622730;77777;Testort5;Testortsteil1;Hermannstrasse;31;338490;;;;;;;;
496208,694;5553337,854;5077925;88888;Testort6;Testortsteil1;Siegfriedstr.;26;338640;;;;;;;;
496209,664;5554213,074;5430026;88888;Testort6;Testortsteil1;Lichtenbergstr.;16;338494;;;;;;;;