{
  "enabled": true,
  "realm": "Elogbook",
  "roles": {
    "realm": [
      {
        "name": "kon-access",
        "composite": false,
        "clientRole": false
      },
      {
        "name": "kon-admin",
        "composite": false,
        "clientRole": false
      },
      {
        "name": "kon-writer",
        "composite": false,
        "clientRole": false
      },
      {
        "name": "kon-reader",
        "composite": false,
        "clientRole": false
      },
      {
        "name": "grid-failure-access",
        "composite": false,
        "clientRole": false
      },
      {
        "name": "grid-failure-admin",
        "composite": false,
        "clientRole": false
      },
      {
        "name": "grid-failure-creator",
        "composite": false,
        "clientRole": false
      },
      {
        "name": "grid-failure-qualifier",
        "composite": false,
        "clientRole": false
      },
      {
        "name": "grid-failure-publisher",
        "composite": false,
        "clientRole": false
      },
      {
        "name": "grid-failure-reader",
        "composite": false,
        "clientRole": false
      },
      {
        "name": "elogbook-access",
        "composite": false,
        "clientRole": false
      },
      {
        "name": "elogbook-superuser",
        "composite": false,
        "clientRole": false
      },
      {
        "name": "elogbook-normaluser",
        "composite": false,
        "clientRole": false
      },
      {
        "name": "spa_access",
        "composite": false,
        "clientRole": false
      },
      {
        "name": "spa_official_in_charge",
        "composite": false,
        "clientRole": false
      },
      {
        "name": "spa_approver",
        "composite": false,
        "clientRole": false
      },
      {
        "name": "spa_division_member",
        "composite": false,
        "clientRole": false
      },
      {
        "name": "spa_customer",
        "composite": false,
        "clientRole": false
      },
      {
        "name": "spa_admin",
        "composite": false,
        "clientRole": false
      },
      {
        "name": "planning-access",
        "composite": false,
        "clientRole": false
      },
      {
        "name": "BP_Admin",
        "composite": false,
        "clientRole": false
      },
      {
        "name": "BP_Gruppenleiter",
        "composite": false,
        "clientRole": false
      },
      {
        "name": "BP_Leseberechtigte",
        "composite": false,
        "clientRole": false
      },
      {
        "name": "BP_Sachbearbeiter",
        "composite": false,
        "clientRole": false
      },
      {
        "name": "view-realm-users",
        "composite": true,
        "composites": {
          "client": {
            "realm-management": [
              "view-users"
            ]
          }
        },
        "clientRole": false
      }
    ],
    "client": {
      "elogbook-backend": []
    }
  },
  "clients": [
    {
      "clientId": "elogbook-backend",
      "name": "elogbook-backend",
      "description": "Elogbook-Backend",
      "enabled": true,
      "clientAuthenticatorType": "client-secret",
      "redirectUris": ["*"],
      "webOrigins": ["*"],
      "publicClient": true,
      "standardFlowEnabled": true,
      "directAccessGrantsEnabled": true,
      "attributes": {
        "backchannel.logout.session.required": "true"
      }
    }
  ],
  "users": [
    {
      "username": "admin",
      "email": "admin@mail.local",
      "enabled": true,
      "firstName": "Admin",
      "lastName": "Istrator",
      "realmRoles": [
        "kon-access",
        "kon-admin",
        "grid-failure-admin",
        "grid-failure-access",
        "view-realm-users",
        "elogbook-access",
        "elogbook-superuser",
        "spa_access",
        "spa_approver",
        "spa_division_member",
        "spa_official_in_charge",
        "spa_admin",
        "planning-access",
        "BP_Admin",
        "BP_Gruppenleiter",
        "BP_Leseberechtigte",
        "BP_Sachbearbeiter"
      ],
      "credentials": [
        {
          "type": "password",
          "value": "$(KEYCLOAK_PASSWORD_TECHUSER)"
        }
      ]
    },
    {
      "username": "hugo",
      "email": "hugo@mail.local",
      "enabled": true,
      "firstName": "Hugo",
      "lastName": "Haferkamp",
      "realmRoles": [
        "spa_access",
        "spa_approver",
        "planning-access",
        "BP_Sachbearbeiter",
        "grid-failure-access",
        "grid-failure-qualifier"
      ],
      "credentials": [
        {
          "type": "password",
          "value": "hugo"
        }
      ]
    },
    {
      "username": "otto",
      "email": "otto@mail.local",
      "enabled": true,
      "firstName": "Otto",
      "lastName": "Corum",
      "realmRoles": [
        "kon-access",
        "kon-writer",
        "elogbook-access",
        "elogbook-normaluser",
        "spa_access",
        "spa_official_in_charge",
        "planning-access",
        "BP_Gruppenleiter",
        "grid-failure-access",
        "grid-failure-qualifier"
      ],
      "credentials": [
        {
          "type": "password",
          "value": "otto"
        }
      ]
    },
    {
      "username": "uwe",
      "email": "uwe@mail.local",
      "enabled": true,
      "firstName": "Uwe",
      "lastName": "Urban",
      "realmRoles": [
        "kon-access",
        "kon-reader",
        "grid-failure-access",
        "grid-failure-reader",
        "elogbook-access",
        "elogbook-normaluser",
        "spa_access",
        "spa_customer",
        "planning-access",
        "BP_Leseberechtigte",
        "grid-failure-access",
        "grid-failure-reader"
      ],
      "credentials": [
        {
          "type": "password",
          "value": "uwe"
        }
      ]
    },
    {
      "username": "chef",
      "email": "chef@mail.local",
      "enabled": true,
      "firstName": "Kurt",
      "lastName": "Knusper",
      "realmRoles": [
        "kon-access",
        "kon-admin",
        "elogbook-access",
        "elogbook-superuser",
        "spa_access",
        "spa_division_member",
        "spa_official_in_charge",
        "spa_approver",
        "planning-access",
        "BP_Admin",
        "grid-failure-access",
        "grid-failure-admin"
      ],
      "credentials": [
        {
          "type": "password",
          "value": "chef"
        }
      ]
    },
    {
      "username": "bruno",
      "email": "bruno@mail.local",
      "enabled": true,
      "firstName": "Bruno",
      "lastName": "Fachbereichsarbeiter",
      "realmRoles": [
        "spa_access",
        "spa_division_member",
        "grid-failure-access",
        "grid-failure-creator"
      ],
      "credentials": [
        {
          "type": "password",
          "value": "bruno"
        }
      ]
    },
    {
      "username": "dagmar",
      "email": "dagmar@mail.local",
      "enabled": true,
      "firstName": "Dagmar",
      "lastName": "Multi-Role",
      "realmRoles": [
        "kon-access",
        "kon-admin",
        "spa_access",
        "spa_division_member",
        "spa_official_in_charge",
        "spa_approver"
      ],
      "credentials": [
        {
          "type": "password",
          "value": "dagmar"
        }
      ]
    },
    {
      "username": "spa_admin",
      "email": "spa_admin@mail.local",
      "enabled": true,
      "firstName": "Spa",
      "lastName": "Admin",
      "realmRoles": [
        "kon-access",
        "kon-admin",
        "spa_access",
        "spa_admin"
      ],
      "credentials": [
        {
          "type": "password",
          "value": "spa_admin"
        }
      ]
    },
    {
      "username": "spa_oic",
      "email": "spa_oic@mail.local",
      "enabled": true,
      "firstName": "Test",
      "lastName": "Sachbearbeiter",
      "realmRoles": [
        "kon-access",
        "kon-admin",
        "spa_access",
        "spa_official_in_charge"
      ],
      "credentials": [
        {
          "type": "password",
          "value": "spa_oic"
        }
      ]
    },
    {
      "username": "spa_approver",
      "email": "spa_approver@mail.local",
      "enabled": true,
      "firstName": "Test",
      "lastName": "Genehmiger",
      "realmRoles": [
        "kon-access",
        "kon-admin",
        "spa_access",
        "spa_approver"
      ],
      "credentials": [
        {
          "type": "password",
          "value": "spa_approver"
        }
      ]
    },
    {
      "username": "spa_division_member",
      "email": "spa_division_member@mail.local",
      "enabled": true,
      "firstName": "Test",
      "lastName": "Fachbereichsarbeiter",
      "realmRoles": [
        "kon-access",
        "kon-admin",
        "spa_access",
        "spa_division_member"
      ],
      "credentials": [
        {
          "type": "password",
          "value": "spa_division_member"
        }
      ]
    },
    {
      "username": "spa_customer",
      "email": "spa_customer@mail.local",
      "enabled": true,
      "firstName": "Test",
      "lastName": "Kunde",
      "realmRoles": [
        "kon-access",
        "kon-admin",
        "spa_access",
        "spa_customer"
      ],
      "credentials": [
        {
          "type": "password",
          "value": "spa_customer"
        }
      ]
    },
    {
      "username": "spa_multi",
      "email": "spa_multi@mail.local",
      "enabled": true,
      "firstName": "Test",
      "lastName": "Mitarbeiter",
      "realmRoles": [
        "kon-access",
        "kon-admin",
        "spa_access",
        "spa_official_in_charge",
        "spa_approver",
        "spa_division_member"
      ],
      "credentials": [
        {
          "type": "password",
          "value": "spa_multi"
        }
      ]
    }
  ]
}