SDO_X1;SDO_Y1;G3E_FID;PLZ;ORT;ORTSTEIL;STRASSE;HAUS_NR;GRUPPE;;;;;;;;
472794,384;5549942,184;11155484;12345;Testort;Testortsteil;Ringstr.;20;Niederdruck 90 mbar (AN);;;;;;;;
472804,144;5549931,924;11155483;12345;Testort;Testortsteil;Ringstr.;18;Niederdruck 90 mbar (AN);;;;;;;;
472817,424;5549938,484;11155485;12345;Testort;Testortsteil;Ringstr.;13;Niederdruck 90 mbar (AN);;;;;;;;
472831,514;5549923,964;87679049;12345;Testort;Testortsteil;Ringstr.;11;Niederdruck 90 mbar (AN);;;;;;;;
472835,534;5549982,684;80462538;12345;Testort;Testortsteil;Siegfriedstr.;16;Niederdruck 90 mbar (AN);;;;;;;;
472854,314;5550457,494;94865532;12345;Testort;Testortsteil;Schleegasse;33;Niederdruck 90 mbar (AN);;;;;;;;
472865,394;5550432,794;95506604;12345;Testort;Testortsteil;Schleegasse;29;Niederdruck 90 mbar (AN);;;;;;;;
472871,624;5550420,624;11074672;12345;Testort;Testortsteil;Schleegasse;22;Niederdruck 90 mbar (AN);;;;;;;;
472880,124;5550424,474;87579407;12345;Testort;Testortsteil;Schleegasse;25;Niederdruck 90 mbar (AN);;;;;;;;
472895,964;5550423,824;95536761;12345;Testort;Testortsteil;Schleegasse;23;Niederdruck 90 mbar (AN);;;;;;;;
472897,004;5550415,024;11074674;12345;Testort;Testortsteil;Schleegasse;21;Niederdruck 90 mbar (AN);;;;;;;;
472902,994;5549836,964;87510604;12345;Testort;Testortsteil;Ringstr.;4;Niederdruck 90 mbar (AN);;;;;;;;
472904,704;5550410,924;11074676;12345;Testort;Testortsteil;Schleegasse;19;Niederdruck 90 mbar (AN);;;;;;;;
472917,344;5549822,274;11155480;12345;Testort;Testortsteil;Ringstr.;2;Niederdruck 90 mbar (AN);;;;;;;;
472924,634;5550415,134;11074675;12345;Testort;Testortsteil;Schleegasse;17;Niederdruck 90 mbar (AN);;;;;;;;
472925,804;5550390,284;11074673;12345;Testort;Testortsteil;Schleegasse;14;Niederdruck 90 mbar (AN);;;;;;;;
472943,754;5549913,814;80462341;12345;Testort;Testortsteil;Siegfriedstr.;3;Niederdruck 90 mbar (AN);;;;;;;;
472968,864;5549870,434;95270612;12345;Testort;Testortsteil;Nibelungenstr.;7;Niederdruck 90 mbar (AN);;;;;;;;
472985,444;5550185,474;11142690;12345;Testort;Testortsteil;Altrheinstr.;2;Niederdruck 90 mbar (AN);;;;;;;;
472987,544;5550340,154;95620223;12345;Testort;Testortsteil;Schleegasse;6;Niederdruck 90 mbar (AN);;;;;;;;
472991,194;5550231,644;11074677;12345;Testort;Testortsteil;Kantstrasse;30;Niederdruck 90 mbar (AN);;;;;;;;
472998,994;5550258,434;11074682;12345;Testort;Testortsteil;Kantstrasse;21;Niederdruck 90 mbar (AN);;;;;;;;
473001,324;5550413,784;11142708;12345;Testort;Testortsteil;Enggasse;1;Niederdruck 90 mbar (AN);;;;;;;;
473001,614;5550128,834;87565673;12345;Testort;Testortsteil;Kantstrasse;29;Niederdruck 90 mbar (AN);;;;;;;;
473005,814;5550118,274;11142688;12345;Testort;Testortsteil;Kantstrasse;31;Niederdruck 90 mbar (AN);;;;;;;;
473006,754;5550253,204;11074683;12345;Testort;Testortsteil;Kantstrasse;26;Niederdruck 90 mbar (AN);;;;;;;;
473012,774;5550280,704;11074678;12345;Testort;Testortsteil;Kantstrasse;15;Niederdruck 90 mbar (AN);;;;;;;;
473015,734;5550266,174;87179352;12345;Testort;Testortsteil;Kantstrasse;26;Niederdruck 90 mbar (AN);;;;;;;;
473016,074;5550317,584;87225597;12345;Testort;Testortsteil;Schleegasse;2a;Niederdruck 90 mbar (AN);;;;;;;;
473016,874;5550127,654;11142689;12345;Testort;Testortsteil;Kantstrasse;31;Niederdruck 90 mbar (AN);;;;;;;;
473018,064;5550125,134;11142687;12345;Testort;Testortsteil;Kantstrasse;31;Niederdruck 90 mbar (AN);;;;;;;;
473018,544;5550420,614;11142709;12345;Testort;Testortsteil;Enggasse;2;Niederdruck 90 mbar (AN);;;;;;;;
