[
  {
    "name": "Kontaktstammdaten",
    "cols": 1,
    "rows": 1,
    "color": "#ffffff",
    "link": "http://cbd.localhost/",
    "pictureLink": "assets/img/kontaktstammdaten_kachel.jpg",
    "requiredRole": "kon-access"
  },
  {
    "name": "Störungsinformationstool",
    "cols": 1,
    "rows": 1,
    "color": "#ffffff",
    "link": "http://main.gfi.localhost/",
    "pictureLink": "assets/img/stoerungsinformation_kachel.jpg",
    "requiredRole": "grid-failure-access"
  },
  {
    "name": "SIT Web Component",
    "cols": 1,
    "rows": 1,
    "color": "#ffffff",
    "link": "http://webcomp.gfi.localhost/",
    "pictureLink": "assets/img/stoerungsinformation_kachel.jpg",
    "requiredRole": "grid-failure-access"
  },
  {
    "name": "SIT Web Component Map",
    "cols": 1,
    "rows": 1,
    "color": "#ffffff",
    "link": "http://mapapp.gfi.localhost/",
    "pictureLink": "assets/img/stoerungsinformation_kachel.jpg",
    "requiredRole": "grid-failure-access"
  },
  {
    "name": "SIT Web Component Table",
    "cols": 1,
    "rows": 1,
    "color": "#ffffff",
    "link": "http://tableapp.gfi.localhost/",
    "pictureLink": "assets/img/stoerungsinformation_kachel.jpg",
    "requiredRole": "grid-failure-access"
  }
]
