{
  "portalBaseURL" : "http://localhost:8080/portal/rest/beservice",
  "contactBaseDataApiUrl" : "http://localhost:9155",
  "fileRowToRead": "9",
  "importFilesFolderPath": "C:/FilesToImport",
  "activePersistencyUnit": "betriebstagebuch",
  "applicationAccessRole": "elogbook-access"
}
