{
  "gis": {
    "urlTemplate": "http://Horst",
    "projectionFrom": "EPSG:4326",
    "projectionTo": "EPSG:25832"
  },
  "leaflet": {
    "urlTemplate": "https://spa.pta.ok-cloud-test.tk/openStreetMap/tile/{z}/{x}/{y}.png",
    "attribution": "&copy; <a href=\"https://www.openstreetmap.org/copyright\">OpenStreetMap</a> contributors",
    "lat": 49.87282103349044,
    "lng": 8.651196956634523,
    "zoom": 12
  },
  "nominatim": {
    "url": "https://spa.pta.ok-cloud-test.tk/nominatim",
    "searchQueryPrefix": "Germany"
  },
  "routes": {
    "spaBackend": "/Fury",
    "portal": "/Batman",
    "contactDataBase": "/Alf",
    "userDocu": "./Lassy"
  },
  "dashboard": {
    "timeToShowWarningBeforeDueTimeInDays": 5,
    "timeToShowWarningBeforeDepartmentsDueTimeInDays": 5
  },
  "claimDetails": {
    "displayClaimDetails": true,
    "pollClaimDetails": true,
    "pollingIntervalInSeconds": 5,
    "thresholdToShowWarningInMinutes": 3
  }
}
