{
  "exportChannels": ["Mail", "Störungsauskunft.de"],
  "overviewMapInitialZoom": "10",
  "detailMapInitialZoom": "10",
  "overviewMapInitialLatitude": "49.656634",
  "overviewMapInitialLongitude": "8.423207"
}
