SDO_X1;SDO_Y1;G3E_FID;PLZ;ORT;ORTSTEIL;STRASSE;HAUS_NR;STATIONS_NR;;;;;;;;
472794,384;5549942,184;94521725;22222;Testort2;Testortsteil2;Ringstr.;30;338497;;;;;;;;
472806,334;5549936,504;94519844;;;;;;338497;;;;;;;;
472833,894;5550095,374;94519885;;;;;;338682;;;;;;;;
472840,784;5550115,394;94522009;;;;;;338682;;;;;;;;
472856,694;5549993,684;94522270;;;;;;338497;;;;;;;;
472857,374;5550083,754;94519883;;;;;;338682;;;;;;;;
472862,794;5550118,584;94519304;;;;;;338682;;;;;;;;
472868,824;5550142,964;94522268;;;;;;338682;;;;;;;;
472875,104;5550149,144;94521559;;;;;;338682;;;;;;;;
472893,604;5550143,444;94519892;;;;;;338682;;;;;;;;
472894,514;5550077,074;94522180;;;;;;338497;;;;;;;;
