{
  "failureClassification": "$Klassifikation$",
  "responsibility": "$Zuständigkeit$",
  "statusIntern": "$Status_intern$",
  "statusExtern": "$Status_extern$",
  "publicationStatus": "$Veröffentlichungsstatus$",
  "branch": "$Sparte$",
  "voltageLevel": "$Spannungsebene$",
  "pressureLevel": "$Druckstufe$",
  "failureBegin": "$Störungsbeginn_gemeldet$",
  "failureEndPlanned": "$Störungsende_geplant$",
  "failureEndResupplied": "$Störungsende_wiederversorgt$",
  "expectedReason": "$Voraussichtlicher_Grund$",
  "description": "$Beschreibung$",
  "postcode": "$Postleitzahl$",
  "city": "$Ort$",
  "district": "$Ortsteil$",
  "street": "$Straße$",
  "housenumber": "$Hausnummer$",
  "stationDescription": "$Station_Bezeichnung$",
  "stationShortDescription": "$Station_Short_Bezeichnung$",
  "radius": "$Radius$",
  "internalRemark": "$Interne_Bemerkungen$",
  "directFailureLink": "$Direkter_Link_zur_Störung$"

}
