<?xml version="1.0" encoding="UTF-8" standalone="no"?>
<svg
   xmlns:dc="http://purl.org/dc/elements/1.1/"
   xmlns:cc="http://creativecommons.org/ns#"
   xmlns:rdf="http://www.w3.org/1999/02/22-rdf-syntax-ns#"
   xmlns:svg="http://www.w3.org/2000/svg"
   xmlns="http://www.w3.org/2000/svg"
   xmlns:sodipodi="http://sodipodi.sourceforge.net/DTD/sodipodi-0.dtd"
   xmlns:inkscape="http://www.inkscape.org/namespaces/inkscape"
   width="60"
   height="60"
   version="1.1"
   viewBox="0 0 15.874857 15.874857"
   id="svg14"
   sodipodi:docname="prio-important-icon-web.svg"
   inkscape:version="1.0.1 (3bc2e813f5, 2020-09-07)">
  <defs
     id="defs18" />
  <sodipodi:namedview
     pagecolor="#ffffff"
     bordercolor="#666666"
     borderopacity="1"
     objecttolerance="10"
     gridtolerance="10"
     guidetolerance="10"
     inkscape:pageopacity="0"
     inkscape:pageshadow="2"
     inkscape:window-width="2560"
     inkscape:window-height="1377"
     id="namedview16"
     showgrid="true"
     inkscape:zoom="12"
     inkscape:cx="23.72977"
     inkscape:cy="23.144116"
     inkscape:window-x="-8"
     inkscape:window-y="-8"
     inkscape:window-maximized="1"
     inkscape:current-layer="g10"
     inkscape:document-rotation="0"
     fit-margin-top="0"
     fit-margin-left="0"
     fit-margin-right="0"
     fit-margin-bottom="0">
    <inkscape:grid
       type="xygrid"
       id="grid10"
       originx="4.6186399e-06"
       originy="-3.5725197e-07" />
  </sodipodi:namedview>
  <metadata
     id="metadata2">
    <rdf:RDF>
      <cc:Work
         rdf:about="">
        <dc:format>image/svg+xml</dc:format>
        <dc:type
           rdf:resource="http://purl.org/dc/dcmitype/StillImage" />
        <dc:title></dc:title>
      </cc:Work>
    </rdf:RDF>
  </metadata>
  <g
     transform="translate(-101.4242,-161.14419)"
     id="g10">
    <g
       id="g15"
       transform="matrix(3.0000108,0,0,3.0000108,-202.8495,-322.29012)">
      <path
         id="circle4"
         style="fill:#ff0000;paint-order:stroke fill markers"
         d="m 106.7158,163.78999 a 2.6458001,2.6458001 0 0 1 -2.6458,2.6458 2.6458001,2.6458001 0 0 1 -2.6458,-2.6458 2.6458001,2.6458001 0 0 1 2.6458,-2.6458 2.6458001,2.6458001 0 0 1 2.6458,2.6458 z" />
      <g
         transform="matrix(0.5996,0,0,0.5996,185.26,183.24)"
         fill="#ffffff"
         style="white-space:pre;shape-inside:url(#rect857-5)"
         aria-label="!"
         id="g8">
        <path
           d="m -135.87,-32.036 -0.1323,-1.9802 q -0.0372,-0.57878 -0.0372,-0.83096 0,-0.34313 0.17776,-0.5333 0.18191,-0.1943 0.47543,-0.1943 0.35553,0 0.47542,0.24805 0.11989,0.24391 0.11989,0.70693 0,0.27285 -0.0289,0.55397 l -0.17777,2.0381 q -0.0289,0.3638 -0.12402,0.55811 -0.0951,0.1943 -0.31419,0.1943 -0.22324,0 -0.31006,-0.18604 -0.0868,-0.19017 -0.12402,-0.57464 z m 0.45888,2.7202 q -0.25218,0 -0.44235,-0.16123 -0.18603,-0.16536 -0.18603,-0.45889 0,-0.25632 0.17776,-0.43408 0.18191,-0.1819 0.44235,-0.1819 0.26045,0 0.44235,0.1819 0.18604,0.17777 0.18604,0.43408 0,0.28939 -0.18604,0.45475 -0.18603,0.16536 -0.43408,0.16536 z"
           fill="#ffffff"
           id="path6" />
      </g>
    </g>
  </g>
</svg>
