<?xml version="1.0" encoding="UTF-8" standalone="no"?>
<svg
   xmlns:dc="http://purl.org/dc/elements/1.1/"
   xmlns:cc="http://creativecommons.org/ns#"
   xmlns:rdf="http://www.w3.org/1999/02/22-rdf-syntax-ns#"
   xmlns:svg="http://www.w3.org/2000/svg"
   xmlns="http://www.w3.org/2000/svg"
   xmlns:sodipodi="http://sodipodi.sourceforge.net/DTD/sodipodi-0.dtd"
   xmlns:inkscape="http://www.inkscape.org/namespaces/inkscape"
   width="60"
   height="60"
   version="1.1"
   viewBox="0 0 15.874857 15.874857"
   id="svg20"
   sodipodi:docname="prio-info-icon-web.svg"
   inkscape:version="1.0.1 (3bc2e813f5, 2020-09-07)">
  <defs
     id="defs24" />
  <sodipodi:namedview
     pagecolor="#ffffff"
     bordercolor="#666666"
     borderopacity="1"
     objecttolerance="10"
     gridtolerance="10"
     guidetolerance="10"
     inkscape:pageopacity="0"
     inkscape:pageshadow="2"
     inkscape:window-width="2560"
     inkscape:window-height="1377"
     id="namedview22"
     showgrid="false"
     inkscape:zoom="12"
     inkscape:cx="-20.847125"
     inkscape:cy="26.99095"
     inkscape:window-x="-8"
     inkscape:window-y="-8"
     inkscape:window-maximized="1"
     inkscape:current-layer="g18"
     inkscape:document-rotation="0"
     fit-margin-top="0"
     fit-margin-left="0"
     fit-margin-right="0"
     fit-margin-bottom="0" />
  <metadata
     id="metadata2">
    <rdf:RDF>
      <cc:Work
         rdf:about="">
        <dc:format>image/svg+xml</dc:format>
        <dc:type
           rdf:resource="http://purl.org/dc/dcmitype/StillImage" />
        <dc:title></dc:title>
      </cc:Work>
    </rdf:RDF>
  </metadata>
  <g
     transform="translate(-93.993195,-121.2042)"
     id="g18">
    <path
       id="circle4"
       style="fill:#337ab7;stroke-width:3.00001;paint-order:stroke fill markers"
       d="m 109.86805,129.14163 a 7.9374289,7.9374289 0 0 1 -7.93743,7.93743 7.9374289,7.9374289 0 0 1 -7.937425,-7.93743 7.9374289,7.9374289 0 0 1 7.937425,-7.93743 7.9374289,7.9374289 0 0 1 7.93743,7.93743 z" />
    <g
       transform="matrix(1.7988065,0,0,1.7988065,346.00043,187.45314)"
       fill="#ffffff"
       style="white-space:pre;shape-inside:url(#rect857)"
       aria-label="i"
       id="g8">
      <path
         d="m -135.12,-33.256 v 3.2618 q 0,0.339 -0.16123,0.51263 -0.16123,0.17363 -0.40928,0.17363 -0.24805,0 -0.40514,-0.17777 -0.15296,-0.17777 -0.15296,-0.5085 v -3.2287 q 0,-0.33486 0.15296,-0.50436 0.15709,-0.1695 0.40514,-0.1695 0.24805,0 0.40928,0.1695 0.16123,0.1695 0.16123,0.47129 z m -0.55811,-1.1658 q -0.23564,0 -0.40514,-0.14469 -0.16536,-0.14469 -0.16536,-0.40928 0,-0.23978 0.16949,-0.39274 0.17364,-0.1571 0.40101,-0.1571 0.21911,0 0.38861,0.14056 0.1695,0.14056 0.1695,0.40928 0,0.26045 -0.16537,0.40928 -0.16536,0.14469 -0.39274,0.14469 z"
         fill="#ffffff"
         id="path6" />
    </g>
    <text
       fill="#000000"
       font-size="20px"
       letter-spacing="0px"
       word-spacing="0px"
       style="line-height:125%"
       xml:space="preserve"
       id="text16"><tspan
         x="0"
         y="0"
         fill="#ffffff"
         font-family="'Arial Rounded MT Bold'"
         font-size="8.4667px"
         font-weight="bold"
         style="line-height:1.25;white-space:pre;shape-inside:url(#rect857)"
         xml:space="preserve"
         id="tspan14"><tspan
           xml:space="preserve"
           id="tspan12"><tspan
             fill="#ffffff"
             font-family="'Arial Rounded MT Bold'"
             font-size="8.4667px"
             font-weight="bold"
             xml:space="preserve"
             id="tspan10">i</tspan></tspan></tspan></text>
  </g>
</svg>
