{
  "portalBaseURL" : "http://entopkon:8880/portal/rest/beservice",
  "contactBaseDataApiUrl" : "http://localhost:9155",
  "elogbookModuleName" : "Betriebstagebuch",

  "fileRowToRead": "9",
  "importFilesFolderPath": "/opt/opkon/btb_filesToImport",

  "activePersistencyUnit": "betriebstagebuch",
  "applicationAccessRole": "elogbook-access",

  "emailSmtpHost": "entdockergss",
  "emailSmtpPort": "1025",
  "emailSender": "testSender@test.de",
  "isHtmlEmail": true,
  "isUseHtmlEmailTemplate": true,
  "emailPresenceCheckRecipient": "testerRecipient33@test.de",
  "emailPresenceCheckSubject": "openKONSEQUENZ Betriebstagebuch Türkontaktmeldung/Anlagenbegehung Erinnerung",
  "isOnlySendSameDayReminderEmail": true,

  "_cronEmailPresenceCheck": "30 0 16 * * ?",
  "cronEmailPresenceCheck": "0 0/1 * * * ?",
  "enableEmailPresenceCheckJob": true,

  "_cronSyncContacts": "0 0 1 * * ?",
  "cronSyncContacts": "0 0/1 * * * ?",
  "enableContactSyncJob": true,
  "contactServiceTechUser": "admin",
  "contactServiceTechUserPwd": "admin"
}
