{
  "enabled": true,
  "realm": "Elogbook{{ .Values.shortNameEnv | title }}",
  "roles": {
    "realm": [
      {
        "name": "kon-admin",
        "composite": false,
        "clientRole": false
      },
      {
        "name": "kon-access",
        "composite": false,
        "clientRole": false
      },
      {
        "name": "grid-failure-admin",
        "composite": false,
        "clientRole": false
      },
      {
        "name": "grid-failure-access",
        "composite": false,
        "clientRole": false
      },
      {
        "name": "elogbook-access",
        "composite": false,
        "clientRole": false
      },
      {
        "name": "elogbook-superuser",
        "composite": false,
        "clientRole": false
      },
      {
        "name": "elogbook-normaluser",
        "composite": false,
        "clientRole": false
      },
      {
        "name": "spa_access",
        "composite": false,
        "clientRole": false
      },
      {
        "name": "spa_official_in_charge",
        "composite": false,
        "clientRole": false
      },
      {
        "name": "spa_approver",
        "composite": false,
        "clientRole": false
      },
      {
        "name": "spa_division_member",
        "composite": false,
        "clientRole": false
      },
      {
        "name": "spa_customer",
        "composite": false,
        "clientRole": false
      },
      {
        "name": "spa_admin",
        "composite": false,
        "clientRole": false
      },
      {
        "name": "planning-access",
        "composite": false,
        "clientRole": false
      },
      {
        "name": "BP_Admin",
        "composite": false,
        "clientRole": false
      },
      {
        "name": "BP_Gruppenleiter",
        "composite": false,
        "clientRole": false
      },
      {
        "name": "BP_Leseberechtigte",
        "composite": false,
        "clientRole": false
      },
      {
        "name": "BP_Sachbearbeiter",
        "composite": false,
        "clientRole": false
      },
      {
        "name": "view-realm-users",
        "composite": true,
        "composites": {
          "client": {
            "realm-management": [
              "view-users"
            ]
          }
        },
        "clientRole": false
      }
    ],
    "client": {
      "elogbook-backend": []
    }
  },
  "clients": [
    {
      "clientId": "elogbook-backend",
      "name": "elogbook-backend",
      "description": "Elogbook-Backend",
      "enabled": true,
      "clientAuthenticatorType": "client-secret",
      "redirectUris": [
        "*"
      ],
      "webOrigins": [
        "*"
      ],
      "publicClient": true,
      "standardFlowEnabled": true,
      "directAccessGrantsEnabled": true,
      "attributes": {
        "backchannel.logout.session.required": "true"
      }
    }
  ],
  "users": [
    {
      "username": "admin",
      "email": "admin@mail.de",
      "enabled": true,
      "firstName": "Admin",
      "lastName": "Istrator",
      "realmRoles": [
        "kon-access",
        "kon-admin",
        "grid-failure-admin",
        "grid-failure-access",
        "view-realm-users",
        "elogbook-access",
        "elogbook-superuser",
        "spa_access",
        "spa_approver",
        "spa_division_member",
        "spa_official_in_charge",
        "spa_admin",
        "planning-access",
        "BP_Admin",
        "BP_Gruppenleiter",
        "BP_Leseberechtigte",
        "BP_Sachbearbeiter"
      ],
      "credentials": [
        {
          "type": "password",
          "value": "admin"
        }
      ]
    }
  ]
}