{
  "api": {
    "baseUrl": "/contactdatabase/api"
  },

  "paths": {
    "imagesRoot": "/assets/images/",
    "userImageFolder": "/assets/images/users/",
    "portalLoginUrl": "http://169.50.13.154/portalFE/#/login"
  },

  "localization": {
    "languages": [
      {"code": "de", "name": "DE", "culture": "de-DE"},
      {"code": "en", "name": "EN", "culture": "en-EN"}
    ],
    "defaultLanguage": "de"
  },

  "notifications": {
    "options": {
      "timeOut": 5000,
      "showProgressBar": true,
      "pauseOnHover": true,
      "position": ["top", "right"],
      "theClass": "sy-notification"
    },
    "unauthorizedEndpoints": [],
    "notFoundEndpoints": []
  },

  "debugging": false
}
