[
  {
    "name": "Kontaktstammdaten",
    "cols": 1,
    "rows": 1,
    "color": "#ffffff",
    "link": "https://{{ .Values.branchSubdomain }}cbd.{{ .Values.rootEnvironment }}.{{ .Values.ingressDomain }}/",
    "pictureLink": "assets/img/kontaktstammdaten_kachel.jpg",
    "requiredRole": "kon-access"
  },
  {
    "name": "Störungsinformationstool",
    "cols": 1,
    "rows": 1,
    "color": "#ffffff",
    "link": "https://{{ .Values.branchSubdomain }}gfi.{{ .Values.rootEnvironment }}.{{ .Values.ingressDomain }}/",
    "pictureLink": "assets/img/stoerungsinformation_kachel.jpg",
    "requiredRole": "grid-failure-access"
  },
  {
    "name": "SIT Web Component",
    "cols": 1,
    "rows": 1,
    "color": "#ffffff",
    "link": "https://{{ .Values.branchSubdomain }}web-comp.{{ .Values.rootEnvironment }}.{{ .Values.ingressDomain }}/",
    "pictureLink": "assets/img/stoerungsinformation_kachel.jpg",
    "requiredRole": "grid-failure-access"
  },
  {
    "name": "Betriebstagebuch",
    "cols": 1,
    "rows": 1,
    "color": "#ffffff",
    "link": "https://{{ .Values.branchSubdomain }}btb.{{ .Values.rootEnvironment }}.{{ .Values.ingressDomain }}/elogBookFE",
    "pictureLink": "assets/img/bebtriebstagebuch_kachel.jpg",
    "requiredRole": "elogbook-access"
  },
  {
    "name": "Stellungnahmen",
    "cols": 1,
    "rows": 1,
    "color": "#ffffff",
    "link": "https://{{ .Values.branchSubdomain }}spa.{{ .Values.rootEnvironment }}.{{ .Values.ingressDomain }}/statementpaFE",
    "pictureLink": "https://www.openkonsequenz.de/medien/cache/main_image/m_ok-modul-stellungnahme-depositphotos-99769074.jpg",
    "requiredRole": "spa_access"
  },
  {
    "name": "Bereitschaftsplanung",
    "cols": 1,
    "rows": 1,
    "color": "#ffffff",
    "link": "https://{{ .Values.branchSubdomain }}ber.{{ .Values.rootEnvironment }}.{{ .Values.ingressDomain }}/spfe",
    "pictureLink": "https://www.openkonsequenz.de/medien/cache/main_image/l_bereitschaftsplan_57882047.jpg",
    "requiredRole": "planning-access"
  }
]
