{
  "internalSessionLengthMillis": 3600000,
  "reloadUsersInSec": 300,
  "authServerUrl": "http://172.25.0.66:8888/",
  "keycloakRealm": "portaldocker",
  "keycloakClient": "portal-docker",
  "keycloakAdmin": "admin",
  "keycloakPW": "admin",
  "maxLoadUsers": 1000
}