(kicad_sch
	(version 20231120)
	(generator "eeschema")
	(generator_version "8.0")
	(uuid "a81b22cf-c48b-4661-a323-6568ecad807f")
	(paper "A4")
	(title_block
		(title "RaspberryPi")
		(rev "3")
	)
	(lib_symbols
		(symbol "Connector:Raspberry_Pi_2_3"
			(exclude_from_sim no)
			(in_bom yes)
			(on_board yes)
			(property "Reference" "J"
				(at -17.78 31.75 0)
				(effects
					(font
						(size 1.27 1.27)
					)
					(justify left bottom)
				)
			)
			(property "Value" "Raspberry_Pi_2_3"
				(at 10.16 -31.75 0)
				(effects
					(font
						(size 1.27 1.27)
					)
					(justify left top)
				)
			)
			(property "Footprint" ""
				(at 0 0 0)
				(effects
					(font
						(size 1.27 1.27)
					)
					(hide yes)
				)
			)
			(property "Datasheet" "https://www.raspberrypi.org/documentation/hardware/raspberrypi/schematics/rpi_SCH_3bplus_1p0_reduced.pdf"
				(at 60.96 -44.45 0)
				(effects
					(font
						(size 1.27 1.27)
					)
					(hide yes)
				)
			)
			(property "Description" "expansion header for Raspberry Pi 2 & 3"
				(at 0 0 0)
				(effects
					(font
						(size 1.27 1.27)
					)
					(hide yes)
				)
			)
			(property "ki_keywords" "raspberrypi gpio"
				(at 0 0 0)
				(effects
					(font
						(size 1.27 1.27)
					)
					(hide yes)
				)
			)
			(property "ki_fp_filters" "PinHeader*2x20*P2.54mm*Vertical* PinSocket*2x20*P2.54mm*Vertical*"
				(at 0 0 0)
				(effects
					(font
						(size 1.27 1.27)
					)
					(hide yes)
				)
			)
			(symbol "Raspberry_Pi_2_3_0_1"
				(rectangle
					(start -17.78 30.48)
					(end 17.78 -30.48)
					(stroke
						(width 0.254)
						(type default)
					)
					(fill
						(type background)
					)
				)
			)
			(symbol "Raspberry_Pi_2_3_1_1"
				(pin power_in line
					(at 5.08 33.02 270)
					(length 2.54)
					(name "3V3"
						(effects
							(font
								(size 1.27 1.27)
							)
						)
					)
					(number "1"
						(effects
							(font
								(size 1.27 1.27)
							)
						)
					)
				)
				(pin bidirectional line
					(at -20.32 20.32 0)
					(length 2.54)
					(name "GPIO15/RXD"
						(effects
							(font
								(size 1.27 1.27)
							)
						)
					)
					(number "10"
						(effects
							(font
								(size 1.27 1.27)
							)
						)
					)
				)
				(pin bidirectional line
					(at -20.32 12.7 0)
					(length 2.54)
					(name "GPIO17"
						(effects
							(font
								(size 1.27 1.27)
							)
						)
					)
					(number "11"
						(effects
							(font
								(size 1.27 1.27)
							)
						)
					)
				)
				(pin bidirectional line
					(at -20.32 10.16 0)
					(length 2.54)
					(name "GPIO18/PWM0"
						(effects
							(font
								(size 1.27 1.27)
							)
						)
					)
					(number "12"
						(effects
							(font
								(size 1.27 1.27)
							)
						)
					)
				)
				(pin bidirectional line
					(at -20.32 -17.78 0)
					(length 2.54)
					(name "GPIO27"
						(effects
							(font
								(size 1.27 1.27)
							)
						)
					)
					(number "13"
						(effects
							(font
								(size 1.27 1.27)
							)
						)
					)
				)
				(pin passive line
					(at 0 -33.02 90)
					(length 2.54) hide
					(name "GND"
						(effects
							(font
								(size 1.27 1.27)
							)
						)
					)
					(number "14"
						(effects
							(font
								(size 1.27 1.27)
							)
						)
					)
				)
				(pin bidirectional line
					(at -20.32 -5.08 0)
					(length 2.54)
					(name "GPIO22"
						(effects
							(font
								(size 1.27 1.27)
							)
						)
					)
					(number "15"
						(effects
							(font
								(size 1.27 1.27)
							)
						)
					)
				)
				(pin bidirectional line
					(at -20.32 -7.62 0)
					(length 2.54)
					(name "GPIO23"
						(effects
							(font
								(size 1.27 1.27)
							)
						)
					)
					(number "16"
						(effects
							(font
								(size 1.27 1.27)
							)
						)
					)
				)
				(pin passive line
					(at 5.08 33.02 270)
					(length 2.54) hide
					(name "3V3"
						(effects
							(font
								(size 1.27 1.27)
							)
						)
					)
					(number "17"
						(effects
							(font
								(size 1.27 1.27)
							)
						)
					)
				)
				(pin bidirectional line
					(at -20.32 -10.16 0)
					(length 2.54)
					(name "GPIO24"
						(effects
							(font
								(size 1.27 1.27)
							)
						)
					)
					(number "18"
						(effects
							(font
								(size 1.27 1.27)
							)
						)
					)
				)
				(pin bidirectional line
					(at 20.32 -10.16 180)
					(length 2.54)
					(name "MOSI0/GPIO10"
						(effects
							(font
								(size 1.27 1.27)
							)
						)
					)
					(number "19"
						(effects
							(font
								(size 1.27 1.27)
							)
						)
					)
				)
				(pin power_in line
					(at -5.08 33.02 270)
					(length 2.54)
					(name "5V"
						(effects
							(font
								(size 1.27 1.27)
							)
						)
					)
					(number "2"
						(effects
							(font
								(size 1.27 1.27)
							)
						)
					)
				)
				(pin passive line
					(at 0 -33.02 90)
					(length 2.54) hide
					(name "GND"
						(effects
							(font
								(size 1.27 1.27)
							)
						)
					)
					(number "20"
						(effects
							(font
								(size 1.27 1.27)
							)
						)
					)
				)
				(pin bidirectional line
					(at 20.32 -7.62 180)
					(length 2.54)
					(name "MISO0/GPIO9"
						(effects
							(font
								(size 1.27 1.27)
							)
						)
					)
					(number "21"
						(effects
							(font
								(size 1.27 1.27)
							)
						)
					)
				)
				(pin bidirectional line
					(at -20.32 -12.7 0)
					(length 2.54)
					(name "GPIO25"
						(effects
							(font
								(size 1.27 1.27)
							)
						)
					)
					(number "22"
						(effects
							(font
								(size 1.27 1.27)
							)
						)
					)
				)
				(pin bidirectional line
					(at 20.32 -12.7 180)
					(length 2.54)
					(name "SCLK0/GPIO11"
						(effects
							(font
								(size 1.27 1.27)
							)
						)
					)
					(number "23"
						(effects
							(font
								(size 1.27 1.27)
							)
						)
					)
				)
				(pin bidirectional line
					(at 20.32 -5.08 180)
					(length 2.54)
					(name "~{CE0}/GPIO8"
						(effects
							(font
								(size 1.27 1.27)
							)
						)
					)
					(number "24"
						(effects
							(font
								(size 1.27 1.27)
							)
						)
					)
				)
				(pin passive line
					(at 0 -33.02 90)
					(length 2.54) hide
					(name "GND"
						(effects
							(font
								(size 1.27 1.27)
							)
						)
					)
					(number "25"
						(effects
							(font
								(size 1.27 1.27)
							)
						)
					)
				)
				(pin bidirectional line
					(at 20.32 -2.54 180)
					(length 2.54)
					(name "~{CE1}/GPIO7"
						(effects
							(font
								(size 1.27 1.27)
							)
						)
					)
					(number "26"
						(effects
							(font
								(size 1.27 1.27)
							)
						)
					)
				)
				(pin bidirectional line
					(at 20.32 22.86 180)
					(length 2.54)
					(name "ID_SD/GPIO0"
						(effects
							(font
								(size 1.27 1.27)
							)
						)
					)
					(number "27"
						(effects
							(font
								(size 1.27 1.27)
							)
						)
					)
				)
				(pin bidirectional line
					(at 20.32 20.32 180)
					(length 2.54)
					(name "ID_SC/GPIO1"
						(effects
							(font
								(size 1.27 1.27)
							)
						)
					)
					(number "28"
						(effects
							(font
								(size 1.27 1.27)
							)
						)
					)
				)
				(pin bidirectional line
					(at 20.32 5.08 180)
					(length 2.54)
					(name "GCLK1/GPIO5"
						(effects
							(font
								(size 1.27 1.27)
							)
						)
					)
					(number "29"
						(effects
							(font
								(size 1.27 1.27)
							)
						)
					)
				)
				(pin bidirectional line
					(at 20.32 15.24 180)
					(length 2.54)
					(name "SDA/GPIO2"
						(effects
							(font
								(size 1.27 1.27)
							)
						)
					)
					(number "3"
						(effects
							(font
								(size 1.27 1.27)
							)
						)
					)
				)
				(pin passive line
					(at 0 -33.02 90)
					(length 2.54) hide
					(name "GND"
						(effects
							(font
								(size 1.27 1.27)
							)
						)
					)
					(number "30"
						(effects
							(font
								(size 1.27 1.27)
							)
						)
					)
				)
				(pin bidirectional line
					(at 20.32 2.54 180)
					(length 2.54)
					(name "GCLK2/GPIO6"
						(effects
							(font
								(size 1.27 1.27)
							)
						)
					)
					(number "31"
						(effects
							(font
								(size 1.27 1.27)
							)
						)
					)
				)
				(pin bidirectional line
					(at 20.32 -17.78 180)
					(length 2.54)
					(name "PWM0/GPIO12"
						(effects
							(font
								(size 1.27 1.27)
							)
						)
					)
					(number "32"
						(effects
							(font
								(size 1.27 1.27)
							)
						)
					)
				)
				(pin bidirectional line
					(at 20.32 -20.32 180)
					(length 2.54)
					(name "PWM1/GPIO13"
						(effects
							(font
								(size 1.27 1.27)
							)
						)
					)
					(number "33"
						(effects
							(font
								(size 1.27 1.27)
							)
						)
					)
				)
				(pin passive line
					(at 0 -33.02 90)
					(length 2.54) hide
					(name "GND"
						(effects
							(font
								(size 1.27 1.27)
							)
						)
					)
					(number "34"
						(effects
							(font
								(size 1.27 1.27)
							)
						)
					)
				)
				(pin bidirectional line
					(at -20.32 5.08 0)
					(length 2.54)
					(name "GPIO19/MISO1"
						(effects
							(font
								(size 1.27 1.27)
							)
						)
					)
					(number "35"
						(effects
							(font
								(size 1.27 1.27)
							)
						)
					)
				)
				(pin bidirectional line
					(at -20.32 15.24 0)
					(length 2.54)
					(name "GPIO16"
						(effects
							(font
								(size 1.27 1.27)
							)
						)
					)
					(number "36"
						(effects
							(font
								(size 1.27 1.27)
							)
						)
					)
				)
				(pin bidirectional line
					(at -20.32 -15.24 0)
					(length 2.54)
					(name "GPIO26"
						(effects
							(font
								(size 1.27 1.27)
							)
						)
					)
					(number "37"
						(effects
							(font
								(size 1.27 1.27)
							)
						)
					)
				)
				(pin bidirectional line
					(at -20.32 2.54 0)
					(length 2.54)
					(name "GPIO20/MOSI1"
						(effects
							(font
								(size 1.27 1.27)
							)
						)
					)
					(number "38"
						(effects
							(font
								(size 1.27 1.27)
							)
						)
					)
				)
				(pin passive line
					(at 0 -33.02 90)
					(length 2.54) hide
					(name "GND"
						(effects
							(font
								(size 1.27 1.27)
							)
						)
					)
					(number "39"
						(effects
							(font
								(size 1.27 1.27)
							)
						)
					)
				)
				(pin passive line
					(at -5.08 33.02 270)
					(length 2.54) hide
					(name "5V"
						(effects
							(font
								(size 1.27 1.27)
							)
						)
					)
					(number "4"
						(effects
							(font
								(size 1.27 1.27)
							)
						)
					)
				)
				(pin bidirectional line
					(at -20.32 0 0)
					(length 2.54)
					(name "GPIO21/SCLK1"
						(effects
							(font
								(size 1.27 1.27)
							)
						)
					)
					(number "40"
						(effects
							(font
								(size 1.27 1.27)
							)
						)
					)
				)
				(pin bidirectional line
					(at 20.32 12.7 180)
					(length 2.54)
					(name "SCL/GPIO3"
						(effects
							(font
								(size 1.27 1.27)
							)
						)
					)
					(number "5"
						(effects
							(font
								(size 1.27 1.27)
							)
						)
					)
				)
				(pin power_in line
					(at 0 -33.02 90)
					(length 2.54)
					(name "GND"
						(effects
							(font
								(size 1.27 1.27)
							)
						)
					)
					(number "6"
						(effects
							(font
								(size 1.27 1.27)
							)
						)
					)
				)
				(pin bidirectional line
					(at 20.32 7.62 180)
					(length 2.54)
					(name "GCLK0/GPIO4"
						(effects
							(font
								(size 1.27 1.27)
							)
						)
					)
					(number "7"
						(effects
							(font
								(size 1.27 1.27)
							)
						)
					)
				)
				(pin bidirectional line
					(at -20.32 22.86 0)
					(length 2.54)
					(name "GPIO14/TXD"
						(effects
							(font
								(size 1.27 1.27)
							)
						)
					)
					(number "8"
						(effects
							(font
								(size 1.27 1.27)
							)
						)
					)
				)
				(pin passive line
					(at 0 -33.02 90)
					(length 2.54) hide
					(name "GND"
						(effects
							(font
								(size 1.27 1.27)
							)
						)
					)
					(number "9"
						(effects
							(font
								(size 1.27 1.27)
							)
						)
					)
				)
			)
		)
		(symbol "Connector:TestPoint"
			(pin_numbers hide)
			(pin_names
				(offset 0.762) hide)
			(exclude_from_sim no)
			(in_bom yes)
			(on_board yes)
			(property "Reference" "TP"
				(at 0 6.858 0)
				(effects
					(font
						(size 1.27 1.27)
					)
				)
			)
			(property "Value" "TestPoint"
				(at 0 5.08 0)
				(effects
					(font
						(size 1.27 1.27)
					)
				)
			)
			(property "Footprint" ""
				(at 5.08 0 0)
				(effects
					(font
						(size 1.27 1.27)
					)
					(hide yes)
				)
			)
			(property "Datasheet" "~"
				(at 5.08 0 0)
				(effects
					(font
						(size 1.27 1.27)
					)
					(hide yes)
				)
			)
			(property "Description" "test point"
				(at 0 0 0)
				(effects
					(font
						(size 1.27 1.27)
					)
					(hide yes)
				)
			)
			(property "ki_keywords" "test point tp"
				(at 0 0 0)
				(effects
					(font
						(size 1.27 1.27)
					)
					(hide yes)
				)
			)
			(property "ki_fp_filters" "Pin* Test*"
				(at 0 0 0)
				(effects
					(font
						(size 1.27 1.27)
					)
					(hide yes)
				)
			)
			(symbol "TestPoint_0_1"
				(circle
					(center 0 3.302)
					(radius 0.762)
					(stroke
						(width 0)
						(type default)
					)
					(fill
						(type none)
					)
				)
			)
			(symbol "TestPoint_1_1"
				(pin passive line
					(at 0 0 90)
					(length 2.54)
					(name "1"
						(effects
							(font
								(size 1.27 1.27)
							)
						)
					)
					(number "1"
						(effects
							(font
								(size 1.27 1.27)
							)
						)
					)
				)
			)
		)
		(symbol "Device:C_Small"
			(pin_numbers hide)
			(pin_names
				(offset 0.254) hide)
			(exclude_from_sim no)
			(in_bom yes)
			(on_board yes)
			(property "Reference" "C"
				(at 0.254 1.778 0)
				(effects
					(font
						(size 1.27 1.27)
					)
					(justify left)
				)
			)
			(property "Value" "C_Small"
				(at 0.254 -2.032 0)
				(effects
					(font
						(size 1.27 1.27)
					)
					(justify left)
				)
			)
			(property "Footprint" ""
				(at 0 0 0)
				(effects
					(font
						(size 1.27 1.27)
					)
					(hide yes)
				)
			)
			(property "Datasheet" "~"
				(at 0 0 0)
				(effects
					(font
						(size 1.27 1.27)
					)
					(hide yes)
				)
			)
			(property "Description" "Unpolarized capacitor, small symbol"
				(at 0 0 0)
				(effects
					(font
						(size 1.27 1.27)
					)
					(hide yes)
				)
			)
			(property "ki_keywords" "capacitor cap"
				(at 0 0 0)
				(effects
					(font
						(size 1.27 1.27)
					)
					(hide yes)
				)
			)
			(property "ki_fp_filters" "C_*"
				(at 0 0 0)
				(effects
					(font
						(size 1.27 1.27)
					)
					(hide yes)
				)
			)
			(symbol "C_Small_0_1"
				(polyline
					(pts
						(xy -1.524 -0.508) (xy 1.524 -0.508)
					)
					(stroke
						(width 0.3302)
						(type default)
					)
					(fill
						(type none)
					)
				)
				(polyline
					(pts
						(xy -1.524 0.508) (xy 1.524 0.508)
					)
					(stroke
						(width 0.3048)
						(type default)
					)
					(fill
						(type none)
					)
				)
			)
			(symbol "C_Small_1_1"
				(pin passive line
					(at 0 2.54 270)
					(length 2.032)
					(name "~"
						(effects
							(font
								(size 1.27 1.27)
							)
						)
					)
					(number "1"
						(effects
							(font
								(size 1.27 1.27)
							)
						)
					)
				)
				(pin passive line
					(at 0 -2.54 90)
					(length 2.032)
					(name "~"
						(effects
							(font
								(size 1.27 1.27)
							)
						)
					)
					(number "2"
						(effects
							(font
								(size 1.27 1.27)
							)
						)
					)
				)
			)
		)
		(symbol "Device:Crystal_GND24_Small"
			(pin_names
				(offset 1.016) hide)
			(exclude_from_sim no)
			(in_bom yes)
			(on_board yes)
			(property "Reference" "Y"
				(at 1.27 4.445 0)
				(effects
					(font
						(size 1.27 1.27)
					)
					(justify left)
				)
			)
			(property "Value" "Crystal_GND24_Small"
				(at 1.27 2.54 0)
				(effects
					(font
						(size 1.27 1.27)
					)
					(justify left)
				)
			)
			(property "Footprint" ""
				(at 0 0 0)
				(effects
					(font
						(size 1.27 1.27)
					)
					(hide yes)
				)
			)
			(property "Datasheet" "~"
				(at 0 0 0)
				(effects
					(font
						(size 1.27 1.27)
					)
					(hide yes)
				)
			)
			(property "Description" "Four pin crystal, GND on pins 2 and 4, small symbol"
				(at 0 0 0)
				(effects
					(font
						(size 1.27 1.27)
					)
					(hide yes)
				)
			)
			(property "ki_keywords" "quartz ceramic resonator oscillator"
				(at 0 0 0)
				(effects
					(font
						(size 1.27 1.27)
					)
					(hide yes)
				)
			)
			(property "ki_fp_filters" "Crystal*"
				(at 0 0 0)
				(effects
					(font
						(size 1.27 1.27)
					)
					(hide yes)
				)
			)
			(symbol "Crystal_GND24_Small_0_1"
				(rectangle
					(start -0.762 -1.524)
					(end 0.762 1.524)
					(stroke
						(width 0)
						(type default)
					)
					(fill
						(type none)
					)
				)
				(polyline
					(pts
						(xy -1.27 -0.762) (xy -1.27 0.762)
					)
					(stroke
						(width 0.381)
						(type default)
					)
					(fill
						(type none)
					)
				)
				(polyline
					(pts
						(xy 1.27 -0.762) (xy 1.27 0.762)
					)
					(stroke
						(width 0.381)
						(type default)
					)
					(fill
						(type none)
					)
				)
				(polyline
					(pts
						(xy -1.27 -1.27) (xy -1.27 -1.905) (xy 1.27 -1.905) (xy 1.27 -1.27)
					)
					(stroke
						(width 0)
						(type default)
					)
					(fill
						(type none)
					)
				)
				(polyline
					(pts
						(xy -1.27 1.27) (xy -1.27 1.905) (xy 1.27 1.905) (xy 1.27 1.27)
					)
					(stroke
						(width 0)
						(type default)
					)
					(fill
						(type none)
					)
				)
			)
			(symbol "Crystal_GND24_Small_1_1"
				(pin passive line
					(at -2.54 0 0)
					(length 1.27)
					(name "1"
						(effects
							(font
								(size 1.27 1.27)
							)
						)
					)
					(number "1"
						(effects
							(font
								(size 0.762 0.762)
							)
						)
					)
				)
				(pin passive line
					(at 0 -2.54 90)
					(length 0.635)
					(name "2"
						(effects
							(font
								(size 1.27 1.27)
							)
						)
					)
					(number "2"
						(effects
							(font
								(size 0.762 0.762)
							)
						)
					)
				)
				(pin passive line
					(at 2.54 0 180)
					(length 1.27)
					(name "3"
						(effects
							(font
								(size 1.27 1.27)
							)
						)
					)
					(number "3"
						(effects
							(font
								(size 0.762 0.762)
							)
						)
					)
				)
				(pin passive line
					(at 0 2.54 270)
					(length 0.635)
					(name "4"
						(effects
							(font
								(size 1.27 1.27)
							)
						)
					)
					(number "4"
						(effects
							(font
								(size 0.762 0.762)
							)
						)
					)
				)
			)
		)
		(symbol "Device:R_Small"
			(pin_numbers hide)
			(pin_names
				(offset 0.254) hide)
			(exclude_from_sim no)
			(in_bom yes)
			(on_board yes)
			(property "Reference" "R"
				(at 0.762 0.508 0)
				(effects
					(font
						(size 1.27 1.27)
					)
					(justify left)
				)
			)
			(property "Value" "R_Small"
				(at 0.762 -1.016 0)
				(effects
					(font
						(size 1.27 1.27)
					)
					(justify left)
				)
			)
			(property "Footprint" ""
				(at 0 0 0)
				(effects
					(font
						(size 1.27 1.27)
					)
					(hide yes)
				)
			)
			(property "Datasheet" "~"
				(at 0 0 0)
				(effects
					(font
						(size 1.27 1.27)
					)
					(hide yes)
				)
			)
			(property "Description" "Resistor, small symbol"
				(at 0 0 0)
				(effects
					(font
						(size 1.27 1.27)
					)
					(hide yes)
				)
			)
			(property "ki_keywords" "R resistor"
				(at 0 0 0)
				(effects
					(font
						(size 1.27 1.27)
					)
					(hide yes)
				)
			)
			(property "ki_fp_filters" "R_*"
				(at 0 0 0)
				(effects
					(font
						(size 1.27 1.27)
					)
					(hide yes)
				)
			)
			(symbol "R_Small_0_1"
				(rectangle
					(start -0.762 1.778)
					(end 0.762 -1.778)
					(stroke
						(width 0.2032)
						(type default)
					)
					(fill
						(type none)
					)
				)
			)
			(symbol "R_Small_1_1"
				(pin passive line
					(at 0 2.54 270)
					(length 0.762)
					(name "~"
						(effects
							(font
								(size 1.27 1.27)
							)
						)
					)
					(number "1"
						(effects
							(font
								(size 1.27 1.27)
							)
						)
					)
				)
				(pin passive line
					(at 0 -2.54 90)
					(length 0.762)
					(name "~"
						(effects
							(font
								(size 1.27 1.27)
							)
						)
					)
					(number "2"
						(effects
							(font
								(size 1.27 1.27)
							)
						)
					)
				)
			)
		)
		(symbol "Interface_CAN_LIN:MCP2518FD-xQBB"
			(exclude_from_sim no)
			(in_bom yes)
			(on_board yes)
			(property "Reference" "U"
				(at 8.89 13.97 0)
				(effects
					(font
						(size 1.27 1.27)
					)
					(justify right)
				)
			)
			(property "Value" "MCP2518FD-xQBB"
				(at -3.81 13.97 0)
				(effects
					(font
						(size 1.27 1.27)
					)
					(justify right)
				)
			)
			(property "Footprint" "Package_DFN_QFN:DFN-14-1EP_3x4.5mm_P0.65mm_EP1.65x4.25mm"
				(at 1.27 -13.97 0)
				(effects
					(font
						(size 1.27 1.27)
					)
					(justify left)
					(hide yes)
				)
			)
			(property "Datasheet" "https://ww1.microchip.com/downloads/aemDocuments/documents/OTH/ProductDocuments/DataSheets/External-CAN-FD-Controller-with-SPI-Interface-DS20006027B.pdf"
				(at 1.27 -16.51 0)
				(effects
					(font
						(size 1.27 1.27)
					)
					(justify left)
					(hide yes)
				)
			)
			(property "Description" "CAN FD Controller with SPI Interface, up to 8 Mbps, Vdd 2.7..5.5V,  functional safety ready, VDFN-14"
				(at 0 0 0)
				(effects
					(font
						(size 1.27 1.27)
					)
					(hide yes)
				)
			)
			(property "ki_keywords" "microchip"
				(at 0 0 0)
				(effects
					(font
						(size 1.27 1.27)
					)
					(hide yes)
				)
			)
			(property "ki_fp_filters" "DFN*1EP*3x4.5mm*P0.65mm*"
				(at 0 0 0)
				(effects
					(font
						(size 1.27 1.27)
					)
					(hide yes)
				)
			)
			(symbol "MCP2518FD-xQBB_0_1"
				(rectangle
					(start -12.7 10.16)
					(end 12.7 -10.16)
					(stroke
						(width 0.254)
						(type default)
					)
					(fill
						(type background)
					)
				)
			)
			(symbol "MCP2518FD-xQBB_1_1"
				(pin output line
					(at 15.24 5.08 180)
					(length 2.54)
					(name "TXCAN"
						(effects
							(font
								(size 1.27 1.27)
							)
						)
					)
					(number "1"
						(effects
							(font
								(size 1.27 1.27)
							)
						)
					)
				)
				(pin input line
					(at -15.24 0 0)
					(length 2.54)
					(name "SCK"
						(effects
							(font
								(size 1.27 1.27)
							)
						)
					)
					(number "10"
						(effects
							(font
								(size 1.27 1.27)
							)
						)
					)
				)
				(pin input line
					(at -15.24 7.62 0)
					(length 2.54)
					(name "SDI"
						(effects
							(font
								(size 1.27 1.27)
							)
						)
					)
					(number "11"
						(effects
							(font
								(size 1.27 1.27)
							)
						)
					)
				)
				(pin output line
					(at -15.24 5.08 0)
					(length 2.54)
					(name "SDO"
						(effects
							(font
								(size 1.27 1.27)
							)
						)
					)
					(number "12"
						(effects
							(font
								(size 1.27 1.27)
							)
						)
					)
				)
				(pin input line
					(at -15.24 2.54 0)
					(length 2.54)
					(name "~{CS}"
						(effects
							(font
								(size 1.27 1.27)
							)
						)
					)
					(number "13"
						(effects
							(font
								(size 1.27 1.27)
							)
						)
					)
				)
				(pin power_in line
					(at 0 12.7 270)
					(length 2.54)
					(name "VDD"
						(effects
							(font
								(size 1.27 1.27)
							)
						)
					)
					(number "14"
						(effects
							(font
								(size 1.27 1.27)
							)
						)
					)
				)
				(pin passive line
					(at 0 -12.7 90)
					(length 2.54) hide
					(name "VSS"
						(effects
							(font
								(size 1.27 1.27)
							)
						)
					)
					(number "15"
						(effects
							(font
								(size 1.27 1.27)
							)
						)
					)
				)
				(pin input line
					(at 15.24 7.62 180)
					(length 2.54)
					(name "RXCAN"
						(effects
							(font
								(size 1.27 1.27)
							)
						)
					)
					(number "2"
						(effects
							(font
								(size 1.27 1.27)
							)
						)
					)
				)
				(pin output line
					(at 15.24 2.54 180)
					(length 2.54)
					(name "CLKO/SOF"
						(effects
							(font
								(size 1.27 1.27)
							)
						)
					)
					(number "3"
						(effects
							(font
								(size 1.27 1.27)
							)
						)
					)
				)
				(pin output line
					(at 15.24 -2.54 180)
					(length 2.54)
					(name "~{INT}"
						(effects
							(font
								(size 1.27 1.27)
							)
						)
					)
					(number "4"
						(effects
							(font
								(size 1.27 1.27)
							)
						)
					)
				)
				(pin output line
					(at -15.24 -5.08 0)
					(length 2.54)
					(name "OSC2"
						(effects
							(font
								(size 1.27 1.27)
							)
						)
					)
					(number "5"
						(effects
							(font
								(size 1.27 1.27)
							)
						)
					)
				)
				(pin input line
					(at -15.24 -7.62 0)
					(length 2.54)
					(name "OSC1"
						(effects
							(font
								(size 1.27 1.27)
							)
						)
					)
					(number "6"
						(effects
							(font
								(size 1.27 1.27)
							)
						)
					)
				)
				(pin power_in line
					(at 0 -12.7 90)
					(length 2.54)
					(name "VSS"
						(effects
							(font
								(size 1.27 1.27)
							)
						)
					)
					(number "7"
						(effects
							(font
								(size 1.27 1.27)
							)
						)
					)
				)
				(pin bidirectional line
					(at 15.24 -7.62 180)
					(length 2.54)
					(name "~{INT1}/GPIO1"
						(effects
							(font
								(size 1.27 1.27)
							)
						)
					)
					(number "8"
						(effects
							(font
								(size 1.27 1.27)
							)
						)
					)
				)
				(pin bidirectional line
					(at 15.24 -5.08 180)
					(length 2.54)
					(name "~{INT0}/GPIO0/XSTBY"
						(effects
							(font
								(size 1.27 1.27)
							)
						)
					)
					(number "9"
						(effects
							(font
								(size 1.27 1.27)
							)
						)
					)
				)
			)
		)
		(symbol "Interface_CAN_LIN:SN65HVD230"
			(pin_names
				(offset 1.016)
			)
			(exclude_from_sim no)
			(in_bom yes)
			(on_board yes)
			(property "Reference" "U"
				(at -2.54 10.16 0)
				(effects
					(font
						(size 1.27 1.27)
					)
					(justify right)
				)
			)
			(property "Value" "SN65HVD230"
				(at -2.54 7.62 0)
				(effects
					(font
						(size 1.27 1.27)
					)
					(justify right)
				)
			)
			(property "Footprint" "Package_SO:SOIC-8_3.9x4.9mm_P1.27mm"
				(at 0 -12.7 0)
				(effects
					(font
						(size 1.27 1.27)
					)
					(hide yes)
				)
			)
			(property "Datasheet" "http://www.ti.com/lit/ds/symlink/sn65hvd230.pdf"
				(at -2.54 10.16 0)
				(effects
					(font
						(size 1.27 1.27)
					)
					(hide yes)
				)
			)
			(property "Description" "CAN Bus Transceivers, 3.3V, 1Mbps, Low-Power capabilities, SOIC-8"
				(at 0 0 0)
				(effects
					(font
						(size 1.27 1.27)
					)
					(hide yes)
				)
			)
			(property "ki_keywords" "can transeiver ti low-power"
				(at 0 0 0)
				(effects
					(font
						(size 1.27 1.27)
					)
					(hide yes)
				)
			)
			(property "ki_fp_filters" "SOIC*3.9x4.9mm*P1.27mm*"
				(at 0 0 0)
				(effects
					(font
						(size 1.27 1.27)
					)
					(hide yes)
				)
			)
			(symbol "SN65HVD230_0_1"
				(rectangle
					(start -7.62 5.08)
					(end 7.62 -7.62)
					(stroke
						(width 0.254)
						(type default)
					)
					(fill
						(type background)
					)
				)
			)
			(symbol "SN65HVD230_1_1"
				(pin input line
					(at -10.16 2.54 0)
					(length 2.54)
					(name "D"
						(effects
							(font
								(size 1.27 1.27)
							)
						)
					)
					(number "1"
						(effects
							(font
								(size 1.27 1.27)
							)
						)
					)
				)
				(pin power_in line
					(at 0 -10.16 90)
					(length 2.54)
					(name "GND"
						(effects
							(font
								(size 1.27 1.27)
							)
						)
					)
					(number "2"
						(effects
							(font
								(size 1.27 1.27)
							)
						)
					)
				)
				(pin power_in line
					(at 0 7.62 270)
					(length 2.54)
					(name "VCC"
						(effects
							(font
								(size 1.27 1.27)
							)
						)
					)
					(number "3"
						(effects
							(font
								(size 1.27 1.27)
							)
						)
					)
				)
				(pin output line
					(at -10.16 0 0)
					(length 2.54)
					(name "R"
						(effects
							(font
								(size 1.27 1.27)
							)
						)
					)
					(number "4"
						(effects
							(font
								(size 1.27 1.27)
							)
						)
					)
				)
				(pin output line
					(at -10.16 -2.54 0)
					(length 2.54)
					(name "Vref"
						(effects
							(font
								(size 1.27 1.27)
							)
						)
					)
					(number "5"
						(effects
							(font
								(size 1.27 1.27)
							)
						)
					)
				)
				(pin bidirectional line
					(at 10.16 -2.54 180)
					(length 2.54)
					(name "CANL"
						(effects
							(font
								(size 1.27 1.27)
							)
						)
					)
					(number "6"
						(effects
							(font
								(size 1.27 1.27)
							)
						)
					)
				)
				(pin bidirectional line
					(at 10.16 0 180)
					(length 2.54)
					(name "CANH"
						(effects
							(font
								(size 1.27 1.27)
							)
						)
					)
					(number "7"
						(effects
							(font
								(size 1.27 1.27)
							)
						)
					)
				)
				(pin input line
					(at -10.16 -5.08 0)
					(length 2.54)
					(name "Rs"
						(effects
							(font
								(size 1.27 1.27)
							)
						)
					)
					(number "8"
						(effects
							(font
								(size 1.27 1.27)
							)
						)
					)
				)
			)
		)
		(symbol "Memory_EEPROM:CAT24C256"
			(exclude_from_sim no)
			(in_bom yes)
			(on_board yes)
			(property "Reference" "U"
				(at -6.35 6.35 0)
				(effects
					(font
						(size 1.27 1.27)
					)
				)
			)
			(property "Value" "CAT24C256"
				(at 1.27 6.35 0)
				(effects
					(font
						(size 1.27 1.27)
					)
					(justify left)
				)
			)
			(property "Footprint" ""
				(at 0 0 0)
				(effects
					(font
						(size 1.27 1.27)
					)
					(hide yes)
				)
			)
			(property "Datasheet" "https://www.onsemi.cn/PowerSolutions/document/CAT24C256-D.PDF"
				(at 0 0 0)
				(effects
					(font
						(size 1.27 1.27)
					)
					(hide yes)
				)
			)
			(property "Description" "256 kb CMOS Serial EEPROM, DIP-8/SOIC-8/TSSOP-8/DFN-8"
				(at 0 0 0)
				(effects
					(font
						(size 1.27 1.27)
					)
					(hide yes)
				)
			)
			(property "ki_keywords" "I2C EEPROM Serial 256kb"
				(at 0 0 0)
				(effects
					(font
						(size 1.27 1.27)
					)
					(hide yes)
				)
			)
			(property "ki_fp_filters" "DIP*W7.62mm* SOIC*3.9x4.9mm* TSSOP*4.4x3mm*P0.65mm* DFN*3x2mm*P0.5mm*"
				(at 0 0 0)
				(effects
					(font
						(size 1.27 1.27)
					)
					(hide yes)
				)
			)
			(symbol "CAT24C256_1_1"
				(rectangle
					(start -7.62 5.08)
					(end 7.62 -5.08)
					(stroke
						(width 0.254)
						(type default)
					)
					(fill
						(type background)
					)
				)
				(pin input line
					(at -10.16 2.54 0)
					(length 2.54)
					(name "A0"
						(effects
							(font
								(size 1.27 1.27)
							)
						)
					)
					(number "1"
						(effects
							(font
								(size 1.27 1.27)
							)
						)
					)
				)
				(pin input line
					(at -10.16 0 0)
					(length 2.54)
					(name "A1"
						(effects
							(font
								(size 1.27 1.27)
							)
						)
					)
					(number "2"
						(effects
							(font
								(size 1.27 1.27)
							)
						)
					)
				)
				(pin input line
					(at -10.16 -2.54 0)
					(length 2.54)
					(name "A2"
						(effects
							(font
								(size 1.27 1.27)
							)
						)
					)
					(number "3"
						(effects
							(font
								(size 1.27 1.27)
							)
						)
					)
				)
				(pin power_in line
					(at 0 -7.62 90)
					(length 2.54)
					(name "GND"
						(effects
							(font
								(size 1.27 1.27)
							)
						)
					)
					(number "4"
						(effects
							(font
								(size 1.27 1.27)
							)
						)
					)
				)
				(pin bidirectional line
					(at 10.16 2.54 180)
					(length 2.54)
					(name "SDA"
						(effects
							(font
								(size 1.27 1.27)
							)
						)
					)
					(number "5"
						(effects
							(font
								(size 1.27 1.27)
							)
						)
					)
				)
				(pin input line
					(at 10.16 0 180)
					(length 2.54)
					(name "SCL"
						(effects
							(font
								(size 1.27 1.27)
							)
						)
					)
					(number "6"
						(effects
							(font
								(size 1.27 1.27)
							)
						)
					)
				)
				(pin input line
					(at 10.16 -2.54 180)
					(length 2.54)
					(name "WP"
						(effects
							(font
								(size 1.27 1.27)
							)
						)
					)
					(number "7"
						(effects
							(font
								(size 1.27 1.27)
							)
						)
					)
				)
				(pin power_in line
					(at 0 7.62 270)
					(length 2.54)
					(name "VCC"
						(effects
							(font
								(size 1.27 1.27)
							)
						)
					)
					(number "8"
						(effects
							(font
								(size 1.27 1.27)
							)
						)
					)
				)
			)
		)
		(symbol "power:+3.3V"
			(power)
			(pin_numbers hide)
			(pin_names
				(offset 0) hide)
			(exclude_from_sim no)
			(in_bom yes)
			(on_board yes)
			(property "Reference" "#PWR"
				(at 0 -3.81 0)
				(effects
					(font
						(size 1.27 1.27)
					)
					(hide yes)
				)
			)
			(property "Value" "+3.3V"
				(at 0 3.556 0)
				(effects
					(font
						(size 1.27 1.27)
					)
				)
			)
			(property "Footprint" ""
				(at 0 0 0)
				(effects
					(font
						(size 1.27 1.27)
					)
					(hide yes)
				)
			)
			(property "Datasheet" ""
				(at 0 0 0)
				(effects
					(font
						(size 1.27 1.27)
					)
					(hide yes)
				)
			)
			(property "Description" "Power symbol creates a global label with name \"+3.3V\""
				(at 0 0 0)
				(effects
					(font
						(size 1.27 1.27)
					)
					(hide yes)
				)
			)
			(property "ki_keywords" "global power"
				(at 0 0 0)
				(effects
					(font
						(size 1.27 1.27)
					)
					(hide yes)
				)
			)
			(symbol "+3.3V_0_1"
				(polyline
					(pts
						(xy -0.762 1.27) (xy 0 2.54)
					)
					(stroke
						(width 0)
						(type default)
					)
					(fill
						(type none)
					)
				)
				(polyline
					(pts
						(xy 0 0) (xy 0 2.54)
					)
					(stroke
						(width 0)
						(type default)
					)
					(fill
						(type none)
					)
				)
				(polyline
					(pts
						(xy 0 2.54) (xy 0.762 1.27)
					)
					(stroke
						(width 0)
						(type default)
					)
					(fill
						(type none)
					)
				)
			)
			(symbol "+3.3V_1_1"
				(pin power_in line
					(at 0 0 90)
					(length 0)
					(name "~"
						(effects
							(font
								(size 1.27 1.27)
							)
						)
					)
					(number "1"
						(effects
							(font
								(size 1.27 1.27)
							)
						)
					)
				)
			)
		)
		(symbol "power:+5V"
			(power)
			(pin_numbers hide)
			(pin_names
				(offset 0) hide)
			(exclude_from_sim no)
			(in_bom yes)
			(on_board yes)
			(property "Reference" "#PWR"
				(at 0 -3.81 0)
				(effects
					(font
						(size 1.27 1.27)
					)
					(hide yes)
				)
			)
			(property "Value" "+5V"
				(at 0 3.556 0)
				(effects
					(font
						(size 1.27 1.27)
					)
				)
			)
			(property "Footprint" ""
				(at 0 0 0)
				(effects
					(font
						(size 1.27 1.27)
					)
					(hide yes)
				)
			)
			(property "Datasheet" ""
				(at 0 0 0)
				(effects
					(font
						(size 1.27 1.27)
					)
					(hide yes)
				)
			)
			(property "Description" "Power symbol creates a global label with name \"+5V\""
				(at 0 0 0)
				(effects
					(font
						(size 1.27 1.27)
					)
					(hide yes)
				)
			)
			(property "ki_keywords" "global power"
				(at 0 0 0)
				(effects
					(font
						(size 1.27 1.27)
					)
					(hide yes)
				)
			)
			(symbol "+5V_0_1"
				(polyline
					(pts
						(xy -0.762 1.27) (xy 0 2.54)
					)
					(stroke
						(width 0)
						(type default)
					)
					(fill
						(type none)
					)
				)
				(polyline
					(pts
						(xy 0 0) (xy 0 2.54)
					)
					(stroke
						(width 0)
						(type default)
					)
					(fill
						(type none)
					)
				)
				(polyline
					(pts
						(xy 0 2.54) (xy 0.762 1.27)
					)
					(stroke
						(width 0)
						(type default)
					)
					(fill
						(type none)
					)
				)
			)
			(symbol "+5V_1_1"
				(pin power_in line
					(at 0 0 90)
					(length 0)
					(name "~"
						(effects
							(font
								(size 1.27 1.27)
							)
						)
					)
					(number "1"
						(effects
							(font
								(size 1.27 1.27)
							)
						)
					)
				)
			)
		)
		(symbol "power:GND"
			(power)
			(pin_numbers hide)
			(pin_names
				(offset 0) hide)
			(exclude_from_sim no)
			(in_bom yes)
			(on_board yes)
			(property "Reference" "#PWR"
				(at 0 -6.35 0)
				(effects
					(font
						(size 1.27 1.27)
					)
					(hide yes)
				)
			)
			(property "Value" "GND"
				(at 0 -3.81 0)
				(effects
					(font
						(size 1.27 1.27)
					)
				)
			)
			(property "Footprint" ""
				(at 0 0 0)
				(effects
					(font
						(size 1.27 1.27)
					)
					(hide yes)
				)
			)
			(property "Datasheet" ""
				(at 0 0 0)
				(effects
					(font
						(size 1.27 1.27)
					)
					(hide yes)
				)
			)
			(property "Description" "Power symbol creates a global label with name \"GND\" , ground"
				(at 0 0 0)
				(effects
					(font
						(size 1.27 1.27)
					)
					(hide yes)
				)
			)
			(property "ki_keywords" "global power"
				(at 0 0 0)
				(effects
					(font
						(size 1.27 1.27)
					)
					(hide yes)
				)
			)
			(symbol "GND_0_1"
				(polyline
					(pts
						(xy 0 0) (xy 0 -1.27) (xy 1.27 -1.27) (xy 0 -2.54) (xy -1.27 -1.27) (xy 0 -1.27)
					)
					(stroke
						(width 0)
						(type default)
					)
					(fill
						(type none)
					)
				)
			)
			(symbol "GND_1_1"
				(pin power_in line
					(at 0 0 270)
					(length 0)
					(name "~"
						(effects
							(font
								(size 1.27 1.27)
							)
						)
					)
					(number "1"
						(effects
							(font
								(size 1.27 1.27)
							)
						)
					)
				)
			)
		)
	)
	(junction
		(at 161.29 148.59)
		(diameter 0)
		(color 0 0 0 0)
		(uuid "03ddd061-7ff1-4eab-baeb-f711644057b2")
	)
	(junction
		(at 161.29 143.51)
		(diameter 0)
		(color 0 0 0 0)
		(uuid "1487cfaf-2b5d-4ac5-a6ba-e0a338802102")
	)
	(junction
		(at 104.14 172.72)
		(diameter 1.016)
		(color 0 0 0 0)
		(uuid "31f46708-84a7-4bb2-96fa-b4bea8836a4f")
	)
	(junction
		(at 176.53 146.05)
		(diameter 0)
		(color 0 0 0 0)
		(uuid "3c98dec8-138f-4a63-8e13-de0a9b87e98b")
	)
	(junction
		(at 209.55 113.03)
		(diameter 0)
		(color 0 0 0 0)
		(uuid "40dc11cf-4b55-41d4-975d-4562df9db213")
	)
	(junction
		(at 161.29 146.05)
		(diameter 0)
		(color 0 0 0 0)
		(uuid "6434816b-669d-43dd-b7a5-92540edd0d1f")
	)
	(junction
		(at 91.44 185.42)
		(diameter 1.016)
		(color 0 0 0 0)
		(uuid "6d190b0e-4f79-44ae-a983-48125c0ecbbc")
	)
	(junction
		(at 91.44 162.56)
		(diameter 1.016)
		(color 0 0 0 0)
		(uuid "75f77342-9560-43db-9bd8-54af250345b7")
	)
	(junction
		(at 104.14 162.56)
		(diameter 1.016)
		(color 0 0 0 0)
		(uuid "92892e3e-0f72-49e2-8cf6-373d699a4a10")
	)
	(junction
		(at 257.81 147.32)
		(diameter 0)
		(color 0 0 0 0)
		(uuid "a5594219-5af8-41be-83f5-93a30913475d")
	)
	(junction
		(at 111.76 175.26)
		(diameter 1.016)
		(color 0 0 0 0)
		(uuid "b48250a1-f950-42d2-9528-9fd88e09653a")
	)
	(junction
		(at 176.53 140.97)
		(diameter 0)
		(color 0 0 0 0)
		(uuid "bf215c80-d7e3-48e8-a931-534be62cacab")
	)
	(junction
		(at 111.76 162.56)
		(diameter 1.016)
		(color 0 0 0 0)
		(uuid "de5ba7af-9e5f-47a8-94ac-c2857bb987af")
	)
	(junction
		(at 257.81 123.19)
		(diameter 0)
		(color 0 0 0 0)
		(uuid "f4f14672-70ea-48a0-bc4f-1f75f29d1604")
	)
	(no_connect
		(at 45.72 48.26)
		(uuid "13e34d70-80a5-447d-bd07-a3092abbfbff")
	)
	(no_connect
		(at 45.72 81.28)
		(uuid "1cad5d3e-04f1-4146-a9f5-d02b0fa9cbec")
	)
	(no_connect
		(at 224.79 144.78)
		(uuid "20371ffe-256e-4dfb-9bcc-bab33593aa1c")
	)
	(no_connect
		(at 81.28 172.72)
		(uuid "2a458543-5ff3-4e6d-bbfb-9580cfea0ebb")
	)
	(no_connect
		(at 224.79 142.24)
		(uuid "2b8ef612-aa72-48cf-bf1a-7cc36b54af78")
	)
	(no_connect
		(at 86.36 50.8)
		(uuid "2d6621c4-cc60-4f7f-be6e-e88ed795b31b")
	)
	(no_connect
		(at 45.72 63.5)
		(uuid "2e09cc0d-00ec-4d5d-8d9d-4c7f665e3031")
	)
	(no_connect
		(at 86.36 60.96)
		(uuid "361e757e-8f2f-4962-8763-9a2bf660d936")
	)
	(no_connect
		(at 71.12 30.48)
		(uuid "3f042e14-895d-4569-b064-ed3f4c53025f")
	)
	(no_connect
		(at 86.36 66.04)
		(uuid "4352b1ab-335e-43b5-94bd-34b4666973ab")
	)
	(no_connect
		(at 81.28 175.26)
		(uuid "55412236-a0cb-4041-8dc6-e547987b3f76")
	)
	(no_connect
		(at 45.72 40.64)
		(uuid "57232e69-9663-4f81-b324-8534ad2a474f")
	)
	(no_connect
		(at 86.36 83.82)
		(uuid "60582ee0-6d9f-4ecd-add1-75b5a474ab07")
	)
	(no_connect
		(at 45.72 68.58)
		(uuid "6b118e5c-dfda-4f9c-afcc-3711ee26f200")
	)
	(no_connect
		(at 224.79 134.62)
		(uuid "834c3410-37f3-4ac3-a5cb-8a3773296ee8")
	)
	(no_connect
		(at 45.72 58.42)
		(uuid "848780d1-d938-4045-9d6a-926ddaa2a799")
	)
	(no_connect
		(at 86.36 58.42)
		(uuid "87564402-8fbb-4e2c-aa63-57313b12af7c")
	)
	(no_connect
		(at 45.72 50.8)
		(uuid "9a7bf57e-1c92-4e5f-a73a-8916080c34c8")
	)
	(no_connect
		(at 45.72 73.66)
		(uuid "b3db52c2-d912-4650-beeb-cf3ff4950904")
	)
	(no_connect
		(at 86.36 48.26)
		(uuid "bdd447f4-6710-435b-96fb-7f4c49f3b287")
	)
	(no_connect
		(at 45.72 71.12)
		(uuid "c1cbd7b6-a136-45e5-929a-3141cb1dc66f")
	)
	(no_connect
		(at 247.65 137.16)
		(uuid "c581719b-6107-4e0f-9ee4-2538ee7b53ad")
	)
	(no_connect
		(at 86.36 81.28)
		(uuid "cafae69d-6d5c-44bb-8f1a-13e6a86d54f7")
	)
	(no_connect
		(at 81.28 177.8)
		(uuid "d1f79f5d-acca-4e74-af06-3f75fa02b85b")
	)
	(no_connect
		(at 45.72 53.34)
		(uuid "d3570ba7-4a1d-402b-9570-61f552cf900b")
	)
	(no_connect
		(at 45.72 78.74)
		(uuid "db007500-c482-4937-aabf-4f5fd6635f2f")
	)
	(no_connect
		(at 45.72 60.96)
		(uuid "dd678bc9-f7aa-4ea8-ae8f-eff93c069e34")
	)
	(no_connect
		(at 101.6 177.8)
		(uuid "ddd1b4ce-6229-4872-9dd2-51caaaaf077c")
	)
	(no_connect
		(at 45.72 43.18)
		(uuid "f98104d0-65c7-449d-bd7c-79e996502208")
	)
	(wire
		(pts
			(xy 209.55 149.86) (xy 209.55 154.94)
		)
		(stroke
			(width 0)
			(type default)
		)
		(uuid "0166c38e-aed2-4bb5-b609-8f3d0251486b")
	)
	(wire
		(pts
			(xy 255.27 123.19) (xy 257.81 123.19)
		)
		(stroke
			(width 0)
			(type default)
		)
		(uuid "01a5311c-9116-4dae-afe0-89c11b772051")
	)
	(wire
		(pts
			(xy 101.6 175.26) (xy 111.76 175.26)
		)
		(stroke
			(width 0)
			(type solid)
		)
		(uuid "04970b90-ee70-43be-b52b-3b60e2efe1a9")
	)
	(wire
		(pts
			(xy 91.44 162.56) (xy 91.44 167.64)
		)
		(stroke
			(width 0)
			(type solid)
		)
		(uuid "0acc365f-1e20-4b9b-bc12-b8cdf6870481")
	)
	(wire
		(pts
			(xy 194.31 144.78) (xy 189.23 144.78)
		)
		(stroke
			(width 0)
			(type default)
		)
		(uuid "0d28350f-1f31-4506-b1ad-2e33e6853f56")
	)
	(wire
		(pts
			(xy 111.76 162.56) (xy 104.14 162.56)
		)
		(stroke
			(width 0)
			(type solid)
		)
		(uuid "0d5a4d10-1772-46fa-93a4-8c364cea8598")
	)
	(wire
		(pts
			(xy 66.04 96.52) (xy 66.04 99.06)
		)
		(stroke
			(width 0)
			(type default)
		)
		(uuid "10d9020e-3297-471c-ac26-4ac8b5e01af7")
	)
	(wire
		(pts
			(xy 250.19 123.19) (xy 245.11 123.19)
		)
		(stroke
			(width 0)
			(type default)
		)
		(uuid "1a33c9ec-3f18-4973-9b44-183f893598f5")
	)
	(wire
		(pts
			(xy 101.6 172.72) (xy 104.14 172.72)
		)
		(stroke
			(width 0)
			(type solid)
		)
		(uuid "1be5d0c6-fc22-474c-9421-3a12a77503a4")
	)
	(wire
		(pts
			(xy 161.29 148.59) (xy 161.29 151.13)
		)
		(stroke
			(width 0)
			(type default)
		)
		(uuid "25402f9b-43f3-465a-bd0b-4599174ada44")
	)
	(wire
		(pts
			(xy 209.55 124.46) (xy 209.55 113.03)
		)
		(stroke
			(width 0)
			(type default)
		)
		(uuid "2631f2aa-a4ed-40a5-9285-cfd134b5b7e3")
	)
	(wire
		(pts
			(xy 111.76 160.02) (xy 111.76 162.56)
		)
		(stroke
			(width 0)
			(type solid)
		)
		(uuid "2ea0a8d8-6905-4c75-9d32-433fd56c3998")
	)
	(wire
		(pts
			(xy 170.18 146.05) (xy 176.53 146.05)
		)
		(stroke
			(width 0)
			(type default)
		)
		(uuid "300a62ee-a6bf-4622-af83-5bd6d1aae261")
	)
	(wire
		(pts
			(xy 60.96 27.94) (xy 60.96 30.48)
		)
		(stroke
			(width 0)
			(type default)
		)
		(uuid "3722bd33-dbe5-4ced-8778-7c9d3a899eef")
	)
	(wire
		(pts
			(xy 234.95 134.62) (xy 247.65 134.62)
		)
		(stroke
			(width 0)
			(type default)
		)
		(uuid "38973429-2cfa-4931-a869-b808373bcafe")
	)
	(wire
		(pts
			(xy 257.81 147.32) (xy 257.81 149.86)
		)
		(stroke
			(width 0)
			(type default)
		)
		(uuid "393082a7-5e45-49cc-926e-db4c50f4221e")
	)
	(wire
		(pts
			(xy 194.31 142.24) (xy 189.23 142.24)
		)
		(stroke
			(width 0)
			(type default)
		)
		(uuid "399eb568-1da4-4211-9b98-51e802175a49")
	)
	(wire
		(pts
			(xy 234.95 129.54) (xy 234.95 134.62)
		)
		(stroke
			(width 0)
			(type default)
		)
		(uuid "3a430510-23ed-4eda-9ab5-a8538bb0ca20")
	)
	(wire
		(pts
			(xy 246.38 139.7) (xy 247.65 139.7)
		)
		(stroke
			(width 0)
			(type default)
		)
		(uuid "3cbd1407-141e-41bb-9c0f-26fd8ae9d37c")
	)
	(wire
		(pts
			(xy 161.29 143.51) (xy 173.99 143.51)
		)
		(stroke
			(width 0)
			(type default)
		)
		(uuid "41b8efbf-3fee-4daf-ab71-7aae5a71f716")
	)
	(wire
		(pts
			(xy 189.23 144.78) (xy 189.23 146.05)
		)
		(stroke
			(width 0)
			(type default)
		)
		(uuid "42f4c001-4833-43ac-a512-75eccfc455a3")
	)
	(wire
		(pts
			(xy 77.47 185.42) (xy 91.44 185.42)
		)
		(stroke
			(width 0)
			(type solid)
		)
		(uuid "44910e70-dfd8-4863-a867-0fb2d699cbb1")
	)
	(wire
		(pts
			(xy 91.44 162.56) (xy 77.47 162.56)
		)
		(stroke
			(width 0)
			(type solid)
		)
		(uuid "4b86345d-7e59-422a-a92f-6ade60150a68")
	)
	(wire
		(pts
			(xy 86.36 40.64) (xy 88.9 40.64)
		)
		(stroke
			(width 0)
			(type default)
		)
		(uuid "4bd80e1f-93a0-4ed3-823b-4e98a0382656")
	)
	(wire
		(pts
			(xy 165.1 140.97) (xy 161.29 140.97)
		)
		(stroke
			(width 0)
			(type default)
		)
		(uuid "4c8e3a56-ef19-4ca1-b1af-b4b2a4597002")
	)
	(wire
		(pts
			(xy 215.9 113.03) (xy 217.17 113.03)
		)
		(stroke
			(width 0)
			(type default)
		)
		(uuid "4d9c02b1-4980-4255-93cd-49223ee894e0")
	)
	(wire
		(pts
			(xy 240.03 139.7) (xy 241.3 139.7)
		)
		(stroke
			(width 0)
			(type default)
		)
		(uuid "523fa618-03d6-4799-9417-2e2054e20787")
	)
	(wire
		(pts
			(xy 91.44 182.88) (xy 91.44 185.42)
		)
		(stroke
			(width 0)
			(type solid)
		)
		(uuid "568a66f9-2003-43cd-8e80-09683b636dcb")
	)
	(wire
		(pts
			(xy 86.36 43.18) (xy 88.9 43.18)
		)
		(stroke
			(width 0)
			(type default)
		)
		(uuid "5782a016-68ea-42fd-9136-d287932bfa47")
	)
	(wire
		(pts
			(xy 123.19 170.18) (xy 123.19 172.72)
		)
		(stroke
			(width 0)
			(type default)
		)
		(uuid "599aa01a-346c-4879-9c7a-9dbd4047d2e5")
	)
	(wire
		(pts
			(xy 161.29 146.05) (xy 165.1 146.05)
		)
		(stroke
			(width 0)
			(type default)
		)
		(uuid "614a3090-61ae-4de6-9134-43474688c36b")
	)
	(wire
		(pts
			(xy 104.14 162.56) (xy 104.14 165.1)
		)
		(stroke
			(width 0)
			(type solid)
		)
		(uuid "64b883e6-27ff-4e9f-9ec0-733ca60605ab")
	)
	(wire
		(pts
			(xy 104.14 172.72) (xy 123.19 172.72)
		)
		(stroke
			(width 0)
			(type solid)
		)
		(uuid "660073f7-ac06-4085-bb71-2eafa44f9eb1")
	)
	(wire
		(pts
			(xy 189.23 142.24) (xy 189.23 140.97)
		)
		(stroke
			(width 0)
			(type default)
		)
		(uuid "66809b20-1fc3-436c-aaa7-03d57d184b97")
	)
	(wire
		(pts
			(xy 189.23 140.97) (xy 176.53 140.97)
		)
		(stroke
			(width 0)
			(type default)
		)
		(uuid "68835e60-ea3c-498f-8ffa-d3be2a51d32b")
	)
	(wire
		(pts
			(xy 134.62 170.18) (xy 134.62 175.26)
		)
		(stroke
			(width 0)
			(type default)
		)
		(uuid "6a9d732c-e3c6-4bde-8476-eb9a4b9ce6d1")
	)
	(wire
		(pts
			(xy 179.07 143.51) (xy 180.34 143.51)
		)
		(stroke
			(width 0)
			(type default)
		)
		(uuid "7173b7c9-4bab-4608-a28e-9d2ca0420460")
	)
	(wire
		(pts
			(xy 224.79 132.08) (xy 247.65 132.08)
		)
		(stroke
			(width 0)
			(type default)
		)
		(uuid "73cd08e2-83de-4eae-a53a-2b1df371cc71")
	)
	(wire
		(pts
			(xy 209.55 113.03) (xy 210.82 113.03)
		)
		(stroke
			(width 0)
			(type default)
		)
		(uuid "74b46333-54ad-4b4f-ac84-00ba74c4689d")
	)
	(wire
		(pts
			(xy 91.44 162.56) (xy 104.14 162.56)
		)
		(stroke
			(width 0)
			(type solid)
		)
		(uuid "7c3c5ef8-2561-461d-afbc-fbf9806fbc53")
	)
	(wire
		(pts
			(xy 189.23 146.05) (xy 176.53 146.05)
		)
		(stroke
			(width 0)
			(type default)
		)
		(uuid "829691dd-abf6-4c8d-b0c3-614f2b147dd3")
	)
	(wire
		(pts
			(xy 161.29 148.59) (xy 180.34 148.59)
		)
		(stroke
			(width 0)
			(type default)
		)
		(uuid "8525dde5-139d-4939-a52f-b347eea08827")
	)
	(wire
		(pts
			(xy 86.36 68.58) (xy 88.9 68.58)
		)
		(stroke
			(width 0)
			(type default)
		)
		(uuid "90ae78ea-f3d3-405f-a850-5f38d55d6de0")
	)
	(wire
		(pts
			(xy 161.29 140.97) (xy 161.29 143.51)
		)
		(stroke
			(width 0)
			(type default)
		)
		(uuid "92a1298e-e6af-44d6-8db9-23b3bbfe50e8")
	)
	(wire
		(pts
			(xy 86.36 73.66) (xy 88.9 73.66)
		)
		(stroke
			(width 0)
			(type default)
		)
		(uuid "a1a95288-8e43-426c-af0b-5232b6819900")
	)
	(wire
		(pts
			(xy 245.11 123.19) (xy 245.11 124.46)
		)
		(stroke
			(width 0)
			(type default)
		)
		(uuid "a9ef0a7d-2e5d-4ef1-b49c-edbc2cb074ef")
	)
	(wire
		(pts
			(xy 104.14 170.18) (xy 104.14 172.72)
		)
		(stroke
			(width 0)
			(type solid)
		)
		(uuid "ac18fcf9-4550-451f-a541-8ea4243283cf")
	)
	(wire
		(pts
			(xy 257.81 123.19) (xy 257.81 127)
		)
		(stroke
			(width 0)
			(type default)
		)
		(uuid "aecc66a4-e660-476c-9d9e-4b18c1e4deab")
	)
	(wire
		(pts
			(xy 161.29 143.51) (xy 161.29 146.05)
		)
		(stroke
			(width 0)
			(type default)
		)
		(uuid "b25d31d8-8389-43d9-961e-e51296cd0521")
	)
	(wire
		(pts
			(xy 86.36 71.12) (xy 88.9 71.12)
		)
		(stroke
			(width 0)
			(type default)
		)
		(uuid "b7900a23-1676-4a03-bcd4-c31ce65f6a62")
	)
	(wire
		(pts
			(xy 240.03 139.7) (xy 240.03 147.32)
		)
		(stroke
			(width 0)
			(type default)
		)
		(uuid "c0c89dec-643d-46ef-9202-26e75168f631")
	)
	(wire
		(pts
			(xy 161.29 146.05) (xy 161.29 148.59)
		)
		(stroke
			(width 0)
			(type default)
		)
		(uuid "c0d6bef5-edf8-49f8-9955-8892404cf4b7")
	)
	(wire
		(pts
			(xy 257.81 118.11) (xy 257.81 123.19)
		)
		(stroke
			(width 0)
			(type default)
		)
		(uuid "c27ad253-315c-4fdc-a8d7-d35227ca0422")
	)
	(wire
		(pts
			(xy 38.1 76.2) (xy 45.72 76.2)
		)
		(stroke
			(width 0)
			(type default)
		)
		(uuid "c2c834b7-f6b2-42fb-b43f-29a0debc3876")
	)
	(wire
		(pts
			(xy 77.47 177.8) (xy 77.47 185.42)
		)
		(stroke
			(width 0)
			(type solid)
		)
		(uuid "c4ea7849-1860-4866-9278-e83ca7db9e68")
	)
	(wire
		(pts
			(xy 240.03 147.32) (xy 257.81 147.32)
		)
		(stroke
			(width 0)
			(type default)
		)
		(uuid "c57a63b4-cb27-4325-9e7a-5f6a75b7c4a9")
	)
	(wire
		(pts
			(xy 209.55 113.03) (xy 209.55 110.49)
		)
		(stroke
			(width 0)
			(type default)
		)
		(uuid "c7233a3d-0ef1-45ce-8f80-e7fb5a6cf31e")
	)
	(wire
		(pts
			(xy 91.44 185.42) (xy 91.44 187.96)
		)
		(stroke
			(width 0)
			(type solid)
		)
		(uuid "c7c7f9fb-6e41-42ea-b696-5040f4d237ef")
	)
	(wire
		(pts
			(xy 180.34 143.51) (xy 180.34 148.59)
		)
		(stroke
			(width 0)
			(type default)
		)
		(uuid "ca9aa884-1095-4ea2-8bb0-5d04ada3bd3d")
	)
	(wire
		(pts
			(xy 111.76 175.26) (xy 134.62 175.26)
		)
		(stroke
			(width 0)
			(type solid)
		)
		(uuid "cb5a7185-92e3-44a0-884e-9a5ebbd3d2f9")
	)
	(wire
		(pts
			(xy 77.47 162.56) (xy 77.47 172.72)
		)
		(stroke
			(width 0)
			(type solid)
		)
		(uuid "d777f37a-4f15-4dcb-ae7c-f94d3cb1788a")
	)
	(wire
		(pts
			(xy 224.79 129.54) (xy 234.95 129.54)
		)
		(stroke
			(width 0)
			(type default)
		)
		(uuid "daf9e3e1-aa1b-456d-8536-4dee4ffd846b")
	)
	(wire
		(pts
			(xy 257.81 144.78) (xy 257.81 147.32)
		)
		(stroke
			(width 0)
			(type default)
		)
		(uuid "dcbba660-d22c-447f-b354-2d04013d6565")
	)
	(wire
		(pts
			(xy 217.17 113.03) (xy 217.17 115.57)
		)
		(stroke
			(width 0)
			(type default)
		)
		(uuid "dd577696-caff-409a-82b8-1677e623778a")
	)
	(wire
		(pts
			(xy 111.76 165.1) (xy 111.76 162.56)
		)
		(stroke
			(width 0)
			(type solid)
		)
		(uuid "e9fd6b9b-0f95-486f-a906-da09a7a18861")
	)
	(wire
		(pts
			(xy 86.36 76.2) (xy 88.9 76.2)
		)
		(stroke
			(width 0)
			(type default)
		)
		(uuid "ec90e8c7-cc6c-417a-be06-35a415a1a7bc")
	)
	(wire
		(pts
			(xy 111.76 170.18) (xy 111.76 175.26)
		)
		(stroke
			(width 0)
			(type solid)
		)
		(uuid "f5d367f0-2a52-47e9-8cd3-4a3a05e768ed")
	)
	(wire
		(pts
			(xy 170.18 140.97) (xy 176.53 140.97)
		)
		(stroke
			(width 0)
			(type default)
		)
		(uuid "fc83553d-c260-4a3b-8a99-321e8e6e5e1b")
	)
	(text "ID_SD and ID_SC PINS:\nThese pins are reserved for HAT ID EEPROM.\n\nAt boot time this I2C interface will be\ninterrogated to look for an EEPROM\nthat identifes the attached board and\nallows automagic setup of the GPIOs\n(and optionally, Linux drivers)."
		(exclude_from_sim no)
		(at 18.034 178.816 0)
		(effects
			(font
				(size 1.27 1.27)
			)
			(justify left bottom)
		)
		(uuid "69c527e5-dd3b-4a4e-9632-750dd20decd0")
	)
	(text "HAT ID"
		(exclude_from_sim no)
		(at 17.526 156.972 0)
		(effects
			(font
				(size 3 3)
				(thickness 0.6)
				(bold yes)
			)
			(justify left)
		)
		(uuid "dd91fd94-c8e4-43fc-9348-bef351f4acf9")
	)
	(label "~{SPI_CS}"
		(at 194.31 134.62 180)
		(fields_autoplaced yes)
		(effects
			(font
				(size 1.27 1.27)
			)
			(justify right bottom)
		)
		(uuid "023e2a4a-f336-41ab-9c64-8825f5b0b078")
	)
	(label "SPI_MISO"
		(at 88.9 71.12 0)
		(fields_autoplaced yes)
		(effects
			(font
				(size 1.27 1.27)
			)
			(justify left bottom)
		)
		(uuid "026d0704-5a47-40f5-8547-78f9833da715")
	)
	(label "ID_SCL"
		(at 120.65 175.26 180)
		(fields_autoplaced yes)
		(effects
			(font
				(size 1.27 1.27)
			)
			(justify right bottom)
		)
		(uuid "0a69e470-c938-433f-88b7-74cd90953b6c")
	)
	(label "~{SPI_CS}"
		(at 88.9 68.58 0)
		(fields_autoplaced yes)
		(effects
			(font
				(size 1.27 1.27)
			)
			(justify left bottom)
		)
		(uuid "1c903af8-5bf7-4d68-8646-ad6b414a41a2")
	)
	(label "SPI_SCK"
		(at 88.9 76.2 0)
		(fields_autoplaced yes)
		(effects
			(font
				(size 1.27 1.27)
			)
			(justify left bottom)
		)
		(uuid "7269d82e-369a-4523-a281-6b4c39e66481")
	)
	(label "SPI_SCK"
		(at 194.31 137.16 180)
		(fields_autoplaced yes)
		(effects
			(font
				(size 1.27 1.27)
			)
			(justify right bottom)
		)
		(uuid "81580dc5-b40c-4430-acd1-5cc089d8a5a9")
	)
	(label "ID_SDA"
		(at 120.65 172.72 180)
		(fields_autoplaced yes)
		(effects
			(font
				(size 1.27 1.27)
			)
			(justify right bottom)
		)
		(uuid "8326aa27-9828-482a-b22d-f825048cab7f")
	)
	(label "SPI_MOSI"
		(at 194.31 129.54 180)
		(fields_autoplaced yes)
		(effects
			(font
				(size 1.27 1.27)
			)
			(justify right bottom)
		)
		(uuid "881c2d29-502a-4f85-8517-d91a8917181c")
	)
	(label "ID_SCL"
		(at 88.9 43.18 0)
		(fields_autoplaced yes)
		(effects
			(font
				(size 1.27 1.27)
			)
			(justify left bottom)
		)
		(uuid "a468b96c-b430-4907-b830-504b7dae5574")
	)
	(label "SPI_MISO"
		(at 194.31 132.08 180)
		(fields_autoplaced yes)
		(effects
			(font
				(size 1.27 1.27)
			)
			(justify right bottom)
		)
		(uuid "bdf96461-ad31-431b-b071-cc9f9a24b2b3")
	)
	(label "~{SPI_INT}"
		(at 38.1 76.2 180)
		(fields_autoplaced yes)
		(effects
			(font
				(size 1.27 1.27)
			)
			(justify right bottom)
		)
		(uuid "ca0d37e7-119f-4ae2-ba39-39de4ad31b2b")
	)
	(label "~{SPI_INT}"
		(at 224.79 139.7 0)
		(fields_autoplaced yes)
		(effects
			(font
				(size 1.27 1.27)
			)
			(justify left bottom)
		)
		(uuid "d007f914-c1fb-4402-9623-f9290a28bd74")
	)
	(label "SPI_MOSI"
		(at 88.9 73.66 0)
		(fields_autoplaced yes)
		(effects
			(font
				(size 1.27 1.27)
			)
			(justify left bottom)
		)
		(uuid "de81c87a-4c17-4683-ae4d-20b36c9bda86")
	)
	(label "ID_SDA"
		(at 88.9 40.64 0)
		(fields_autoplaced yes)
		(effects
			(font
				(size 1.27 1.27)
			)
			(justify left bottom)
		)
		(uuid "ecf83ec5-a79f-4fe8-8858-97f6a3506f84")
	)
	(hierarchical_label "CAN_H"
		(shape input)
		(at 267.97 134.62 0)
		(fields_autoplaced yes)
		(effects
			(font
				(size 1.27 1.27)
			)
			(justify left)
		)
		(uuid "bbe06bb3-c6e3-4750-9595-e0ad9c243616")
	)
	(hierarchical_label "1WIRE"
		(shape bidirectional)
		(at 86.36 55.88 0)
		(fields_autoplaced yes)
		(effects
			(font
				(size 1.27 1.27)
			)
			(justify left)
		)
		(uuid "cff95ea2-1869-4887-aa8c-245b61d678ee")
	)
	(hierarchical_label "CAN_L"
		(shape input)
		(at 267.97 137.16 0)
		(fields_autoplaced yes)
		(effects
			(font
				(size 1.27 1.27)
			)
			(justify left)
		)
		(uuid "da3e3ad7-6f29-46d6-9859-591ac5bd0527")
	)
	(symbol
		(lib_id "Device:C_Small")
		(at 77.47 175.26 0)
		(unit 1)
		(exclude_from_sim no)
		(in_bom yes)
		(on_board yes)
		(dnp no)
		(uuid "044fd6fb-bf52-4635-bbf6-235803b4e47a")
		(property "Reference" "C43"
			(at 75.1458 174.1106 0)
			(effects
				(font
					(size 1.27 1.27)
				)
				(justify right)
			)
		)
		(property "Value" "100nF/0.1uF"
			(at 75.1458 176.4093 0)
			(effects
				(font
					(size 1.27 1.27)
				)
				(justify right)
			)
		)
		(property "Footprint" "Capacitor_SMD:C_0603_1608Metric"
			(at 77.47 175.26 0)
			(effects
				(font
					(size 1.27 1.27)
				)
				(hide yes)
			)
		)
		(property "Datasheet" "~"
			(at 77.47 175.26 0)
			(effects
				(font
					(size 1.27 1.27)
				)
				(hide yes)
			)
		)
		(property "Description" ""
			(at 77.47 175.26 0)
			(effects
				(font
					(size 1.27 1.27)
				)
				(hide yes)
			)
		)
		(property "LCSC" "C14663"
			(at 77.47 175.26 0)
			(effects
				(font
					(size 1.27 1.27)
				)
				(hide yes)
			)
		)
		(pin "1"
			(uuid "a3bd5ad7-b425-4451-b09b-348c3c6b988d")
		)
		(pin "2"
			(uuid "53016d21-79db-4638-a106-c01c783025f7")
		)
		(instances
			(project "HydroponicFlowerControl"
				(path "/b3c8a28b-9ce1-4002-b8e8-ef8cb73fe031/9aca03da-9950-423c-b716-bf95878ee447"
					(reference "C43")
					(unit 1)
				)
			)
		)
	)
	(symbol
		(lib_id "Connector:TestPoint")
		(at 123.19 170.18 0)
		(unit 1)
		(exclude_from_sim no)
		(in_bom no)
		(on_board yes)
		(dnp no)
		(fields_autoplaced yes)
		(uuid "2884c667-902b-4dbe-a431-1f49cad59c8b")
		(property "Reference" "TP9"
			(at 125.73 165.6079 0)
			(effects
				(font
					(size 1.27 1.27)
				)
				(justify left)
			)
		)
		(property "Value" "ID_SDA"
			(at 125.73 168.1479 0)
			(effects
				(font
					(size 1.27 1.27)
				)
				(justify left)
			)
		)
		(property "Footprint" "TestPoint:TestPoint_Pad_D1.5mm"
			(at 128.27 170.18 0)
			(effects
				(font
					(size 1.27 1.27)
				)
				(hide yes)
			)
		)
		(property "Datasheet" "~"
			(at 128.27 170.18 0)
			(effects
				(font
					(size 1.27 1.27)
				)
				(hide yes)
			)
		)
		(property "Description" "test point"
			(at 123.19 170.18 0)
			(effects
				(font
					(size 1.27 1.27)
				)
				(hide yes)
			)
		)
		(pin "1"
			(uuid "ac6e413e-636b-4cc0-b6fa-1ec6778a072c")
		)
		(instances
			(project ""
				(path "/b3c8a28b-9ce1-4002-b8e8-ef8cb73fe031/9aca03da-9950-423c-b716-bf95878ee447"
					(reference "TP9")
					(unit 1)
				)
			)
		)
	)
	(symbol
		(lib_id "power:+5V")
		(at 60.96 27.94 0)
		(unit 1)
		(exclude_from_sim no)
		(in_bom yes)
		(on_board yes)
		(dnp no)
		(fields_autoplaced yes)
		(uuid "2e255193-9ec7-42c7-83db-f1a3b7759c57")
		(property "Reference" "#PWR0148"
			(at 60.96 31.75 0)
			(effects
				(font
					(size 1.27 1.27)
				)
				(hide yes)
			)
		)
		(property "Value" "+5V"
			(at 60.96 22.86 0)
			(effects
				(font
					(size 1.27 1.27)
				)
			)
		)
		(property "Footprint" ""
			(at 60.96 27.94 0)
			(effects
				(font
					(size 1.27 1.27)
				)
				(hide yes)
			)
		)
		(property "Datasheet" ""
			(at 60.96 27.94 0)
			(effects
				(font
					(size 1.27 1.27)
				)
				(hide yes)
			)
		)
		(property "Description" "Power symbol creates a global label with name \"+5V\""
			(at 60.96 27.94 0)
			(effects
				(font
					(size 1.27 1.27)
				)
				(hide yes)
			)
		)
		(pin "1"
			(uuid "75082187-73c4-4afe-a44a-2564dfc9968d")
		)
		(instances
			(project "HydroponicFlowerControl"
				(path "/b3c8a28b-9ce1-4002-b8e8-ef8cb73fe031/9aca03da-9950-423c-b716-bf95878ee447"
					(reference "#PWR0148")
					(unit 1)
				)
			)
		)
	)
	(symbol
		(lib_id "power:GND")
		(at 66.04 99.06 0)
		(unit 1)
		(exclude_from_sim no)
		(in_bom yes)
		(on_board yes)
		(dnp no)
		(uuid "35c00022-c6df-442a-b2c8-b40f67f52cc8")
		(property "Reference" "#PWR0147"
			(at 66.04 105.41 0)
			(effects
				(font
					(size 1.27 1.27)
				)
				(hide yes)
			)
		)
		(property "Value" "GND"
			(at 66.04 102.87 0)
			(effects
				(font
					(size 1.27 1.27)
				)
			)
		)
		(property "Footprint" ""
			(at 66.04 99.06 0)
			(effects
				(font
					(size 1.27 1.27)
				)
				(hide yes)
			)
		)
		(property "Datasheet" ""
			(at 66.04 99.06 0)
			(effects
				(font
					(size 1.27 1.27)
				)
				(hide yes)
			)
		)
		(property "Description" ""
			(at 66.04 99.06 0)
			(effects
				(font
					(size 1.27 1.27)
				)
				(hide yes)
			)
		)
		(pin "1"
			(uuid "8be3f598-4035-4517-8574-73b488ebe740")
		)
		(instances
			(project "HydroponicFlowerControl"
				(path "/b3c8a28b-9ce1-4002-b8e8-ef8cb73fe031/9aca03da-9950-423c-b716-bf95878ee447"
					(reference "#PWR0147")
					(unit 1)
				)
			)
		)
	)
	(symbol
		(lib_id "power:GND")
		(at 91.44 187.96 0)
		(unit 1)
		(exclude_from_sim no)
		(in_bom yes)
		(on_board yes)
		(dnp no)
		(uuid "36af53e5-3202-4973-af3f-40ddb71e6d61")
		(property "Reference" "#PWR055"
			(at 91.44 194.31 0)
			(effects
				(font
					(size 1.27 1.27)
				)
				(hide yes)
			)
		)
		(property "Value" "GND"
			(at 91.5543 192.2844 0)
			(effects
				(font
					(size 1.27 1.27)
				)
			)
		)
		(property "Footprint" ""
			(at 91.44 187.96 0)
			(effects
				(font
					(size 1.27 1.27)
				)
			)
		)
		(property "Datasheet" ""
			(at 91.44 187.96 0)
			(effects
				(font
					(size 1.27 1.27)
				)
			)
		)
		(property "Description" ""
			(at 91.44 187.96 0)
			(effects
				(font
					(size 1.27 1.27)
				)
				(hide yes)
			)
		)
		(pin "1"
			(uuid "a417cefb-be02-4d5f-9227-84ae3a5a5b3c")
		)
		(instances
			(project "HydroponicFlowerControl"
				(path "/b3c8a28b-9ce1-4002-b8e8-ef8cb73fe031/9aca03da-9950-423c-b716-bf95878ee447"
					(reference "#PWR055")
					(unit 1)
				)
			)
		)
	)
	(symbol
		(lib_id "Device:C_Small")
		(at 252.73 123.19 90)
		(unit 1)
		(exclude_from_sim no)
		(in_bom yes)
		(on_board yes)
		(dnp no)
		(uuid "46ef3381-40ed-4097-b65d-a8fbde73940e")
		(property "Reference" "C56"
			(at 248.412 118.364 90)
			(effects
				(font
					(size 1.27 1.27)
				)
				(justify left)
			)
		)
		(property "Value" "100nF/0.1uF"
			(at 257.302 120.396 90)
			(effects
				(font
					(size 1.27 1.27)
				)
				(justify left)
			)
		)
		(property "Footprint" "Capacitor_SMD:C_0603_1608Metric"
			(at 252.73 123.19 0)
			(effects
				(font
					(size 1.27 1.27)
				)
				(hide yes)
			)
		)
		(property "Datasheet" "~"
			(at 252.73 123.19 0)
			(effects
				(font
					(size 1.27 1.27)
				)
				(hide yes)
			)
		)
		(property "Description" "Unpolarized capacitor, small symbol"
			(at 252.73 123.19 0)
			(effects
				(font
					(size 1.27 1.27)
				)
				(hide yes)
			)
		)
		(property "LCSC" "C14663"
			(at 252.73 123.19 0)
			(effects
				(font
					(size 1.27 1.27)
				)
				(hide yes)
			)
		)
		(property "LCSC alt" ""
			(at 252.73 123.19 0)
			(effects
				(font
					(size 1.27 1.27)
				)
				(hide yes)
			)
		)
		(pin "2"
			(uuid "68d16bfd-ee45-4c3d-ad7e-b9ce070aad2b")
		)
		(pin "1"
			(uuid "cd611bc0-5a23-4bde-9318-ffb418bb7e20")
		)
		(instances
			(project "HydroponicFlowerControl"
				(path "/b3c8a28b-9ce1-4002-b8e8-ef8cb73fe031/9aca03da-9950-423c-b716-bf95878ee447"
					(reference "C56")
					(unit 1)
				)
			)
		)
	)
	(symbol
		(lib_id "Device:Crystal_GND24_Small")
		(at 176.53 143.51 90)
		(unit 1)
		(exclude_from_sim no)
		(in_bom yes)
		(on_board yes)
		(dnp no)
		(uuid "498454f9-2592-46f9-91c8-3d4461f35869")
		(property "Reference" "Y2"
			(at 175.514 138.43 90)
			(effects
				(font
					(size 1.27 1.27)
				)
			)
		)
		(property "Value" "40MHz"
			(at 183.896 143.51 90)
			(effects
				(font
					(size 1.27 1.27)
				)
			)
		)
		(property "Footprint" "Crystal:Crystal_SMD_3225-4Pin_3.2x2.5mm"
			(at 176.53 143.51 0)
			(effects
				(font
					(size 1.27 1.27)
				)
				(hide yes)
			)
		)
		(property "Datasheet" "https://wmsc.lcsc.com/wmsc/upload/file/pdf/v2/lcsc/2403291504_YXC-X322540MPB4SI_C9010.pdf"
			(at 176.53 143.51 0)
			(effects
				(font
					(size 1.27 1.27)
				)
				(hide yes)
			)
		)
		(property "Description" "Four pin crystal, GND on pins 2 and 4, small symbol"
			(at 176.53 143.51 0)
			(effects
				(font
					(size 1.27 1.27)
				)
				(hide yes)
			)
		)
		(property "LCSC" "C9010"
			(at 176.53 143.51 90)
			(effects
				(font
					(size 1.27 1.27)
				)
				(hide yes)
			)
		)
		(property "LCSC alt" ""
			(at 176.53 143.51 0)
			(effects
				(font
					(size 1.27 1.27)
				)
				(hide yes)
			)
		)
		(pin "1"
			(uuid "84c7438e-b5ad-419b-ae68-2e4a5b66611f")
		)
		(pin "2"
			(uuid "6d2a662c-d36c-4bd2-b670-cef6a5cc8182")
		)
		(pin "4"
			(uuid "c5ba79db-7db4-4c2a-a4ad-e643023b56a9")
		)
		(pin "3"
			(uuid "a8a125c1-f104-4b9b-8b08-659b48144f1e")
		)
		(instances
			(project "HydroponicFlowerControl"
				(path "/b3c8a28b-9ce1-4002-b8e8-ef8cb73fe031/9aca03da-9950-423c-b716-bf95878ee447"
					(reference "Y2")
					(unit 1)
				)
			)
		)
	)
	(symbol
		(lib_id "Interface_CAN_LIN:SN65HVD230")
		(at 257.81 134.62 0)
		(unit 1)
		(exclude_from_sim no)
		(in_bom yes)
		(on_board yes)
		(dnp no)
		(fields_autoplaced yes)
		(uuid "4e53cf1c-3839-4ee6-a046-c9757611fb54")
		(property "Reference" "U19"
			(at 259.7659 125.095 0)
			(effects
				(font
					(size 1.27 1.27)
				)
				(justify left)
			)
		)
		(property "Value" "SN65HVD230"
			(at 259.7659 127.635 0)
			(effects
				(font
					(size 1.27 1.27)
				)
				(justify left)
			)
		)
		(property "Footprint" "Package_SO:SOIC-8_3.9x4.9mm_P1.27mm"
			(at 257.81 147.32 0)
			(effects
				(font
					(size 1.27 1.27)
				)
				(hide yes)
			)
		)
		(property "Datasheet" "http://www.ti.com/lit/ds/symlink/sn65hvd230.pdf"
			(at 255.27 124.46 0)
			(effects
				(font
					(size 1.27 1.27)
				)
				(hide yes)
			)
		)
		(property "Description" ""
			(at 257.81 134.62 0)
			(effects
				(font
					(size 1.27 1.27)
				)
				(hide yes)
			)
		)
		(property "LCSC" "C12084"
			(at 257.81 134.62 0)
			(effects
				(font
					(size 1.27 1.27)
				)
				(hide yes)
			)
		)
		(property "JLCPCB Rotation Offset" "0"
			(at 257.81 134.62 0)
			(effects
				(font
					(size 1.27 1.27)
				)
				(hide yes)
			)
		)
		(property "LCSC alt" ""
			(at 257.81 134.62 0)
			(effects
				(font
					(size 1.27 1.27)
				)
				(hide yes)
			)
		)
		(pin "1"
			(uuid "2a9bc56c-1bfc-45b4-87ec-5b03458ee12e")
		)
		(pin "2"
			(uuid "dfaf6756-8c04-45b2-ad2d-27cefb8577ae")
		)
		(pin "3"
			(uuid "199012e2-c052-4e96-bc91-98c13a50c9e8")
		)
		(pin "4"
			(uuid "f0431687-a7e3-4dbd-9c17-cfb3f4a6e149")
		)
		(pin "5"
			(uuid "5ed7e1cd-92d7-443d-bf40-a71b19bc40ff")
		)
		(pin "6"
			(uuid "98718854-db34-4f6a-81ed-457ec8ec48cb")
		)
		(pin "7"
			(uuid "d84a308c-f577-4bae-8c9c-3e108b6045ab")
		)
		(pin "8"
			(uuid "2066e96d-2033-4667-ad6c-54a0eaf2c668")
		)
		(instances
			(project "HydroponicFlowerControl"
				(path "/b3c8a28b-9ce1-4002-b8e8-ef8cb73fe031/9aca03da-9950-423c-b716-bf95878ee447"
					(reference "U19")
					(unit 1)
				)
			)
		)
	)
	(symbol
		(lib_id "power:GND")
		(at 209.55 154.94 0)
		(unit 1)
		(exclude_from_sim no)
		(in_bom yes)
		(on_board yes)
		(dnp no)
		(uuid "62dcf372-1b40-44e9-aa38-b23afcb417e9")
		(property "Reference" "#PWR0146"
			(at 209.55 161.29 0)
			(effects
				(font
					(size 1.27 1.27)
				)
				(hide yes)
			)
		)
		(property "Value" "GND"
			(at 209.55 158.75 0)
			(effects
				(font
					(size 1.27 1.27)
				)
			)
		)
		(property "Footprint" ""
			(at 209.55 154.94 0)
			(effects
				(font
					(size 1.27 1.27)
				)
				(hide yes)
			)
		)
		(property "Datasheet" ""
			(at 209.55 154.94 0)
			(effects
				(font
					(size 1.27 1.27)
				)
				(hide yes)
			)
		)
		(property "Description" ""
			(at 209.55 154.94 0)
			(effects
				(font
					(size 1.27 1.27)
				)
				(hide yes)
			)
		)
		(pin "1"
			(uuid "d4a78298-83e8-43ec-abfc-6f9b5ba8755f")
		)
		(instances
			(project "HydroponicFlowerControl"
				(path "/b3c8a28b-9ce1-4002-b8e8-ef8cb73fe031/9aca03da-9950-423c-b716-bf95878ee447"
					(reference "#PWR0146")
					(unit 1)
				)
			)
		)
	)
	(symbol
		(lib_id "Device:C_Small")
		(at 167.64 140.97 90)
		(unit 1)
		(exclude_from_sim no)
		(in_bom yes)
		(on_board yes)
		(dnp no)
		(uuid "72f40eca-2a92-46dd-98bf-11e906177b5c")
		(property "Reference" "C58"
			(at 167.64 135.636 90)
			(effects
				(font
					(size 1.27 1.27)
				)
			)
		)
		(property "Value" "20pF"
			(at 167.894 137.922 90)
			(effects
				(font
					(size 1.27 1.27)
				)
			)
		)
		(property "Footprint" "Capacitor_SMD:C_0603_1608Metric"
			(at 167.64 140.97 0)
			(effects
				(font
					(size 1.27 1.27)
				)
				(hide yes)
			)
		)
		(property "Datasheet" "~"
			(at 167.64 140.97 0)
			(effects
				(font
					(size 1.27 1.27)
				)
				(hide yes)
			)
		)
		(property "Description" ""
			(at 167.64 140.97 0)
			(effects
				(font
					(size 1.27 1.27)
				)
				(hide yes)
			)
		)
		(property "LCSC" "C1648"
			(at 167.6463 133.985 0)
			(effects
				(font
					(size 1.27 1.27)
				)
				(hide yes)
			)
		)
		(property "LCSC alt" ""
			(at 167.64 140.97 0)
			(effects
				(font
					(size 1.27 1.27)
				)
				(hide yes)
			)
		)
		(pin "1"
			(uuid "6ac52413-51cd-4b2b-b93e-27b1a0678a72")
		)
		(pin "2"
			(uuid "33adff50-1c09-4be9-b3ec-13af62c08cda")
		)
		(instances
			(project "HydroponicFlowerControl"
				(path "/b3c8a28b-9ce1-4002-b8e8-ef8cb73fe031/9aca03da-9950-423c-b716-bf95878ee447"
					(reference "C58")
					(unit 1)
				)
			)
		)
	)
	(symbol
		(lib_id "power:GND")
		(at 245.11 124.46 0)
		(unit 1)
		(exclude_from_sim no)
		(in_bom yes)
		(on_board yes)
		(dnp no)
		(fields_autoplaced yes)
		(uuid "7844ba99-1c66-432e-a5e7-b1345a69c747")
		(property "Reference" "#PWR0133"
			(at 245.11 130.81 0)
			(effects
				(font
					(size 1.27 1.27)
				)
				(hide yes)
			)
		)
		(property "Value" "GND"
			(at 245.11 129.54 0)
			(effects
				(font
					(size 1.27 1.27)
				)
			)
		)
		(property "Footprint" ""
			(at 245.11 124.46 0)
			(effects
				(font
					(size 1.27 1.27)
				)
				(hide yes)
			)
		)
		(property "Datasheet" ""
			(at 245.11 124.46 0)
			(effects
				(font
					(size 1.27 1.27)
				)
				(hide yes)
			)
		)
		(property "Description" ""
			(at 245.11 124.46 0)
			(effects
				(font
					(size 1.27 1.27)
				)
				(hide yes)
			)
		)
		(pin "1"
			(uuid "67a4b5cb-4943-408f-aa23-2bbc89030d5e")
		)
		(instances
			(project "HydroponicFlowerControl"
				(path "/b3c8a28b-9ce1-4002-b8e8-ef8cb73fe031/9aca03da-9950-423c-b716-bf95878ee447"
					(reference "#PWR0133")
					(unit 1)
				)
			)
		)
	)
	(symbol
		(lib_id "Device:R_Small")
		(at 243.84 139.7 270)
		(unit 1)
		(exclude_from_sim no)
		(in_bom yes)
		(on_board yes)
		(dnp no)
		(uuid "7e1757a6-5b85-44e2-9704-b3f94d84c9d7")
		(property "Reference" "R67"
			(at 243.84 137.16 90)
			(effects
				(font
					(size 1.27 1.27)
				)
			)
		)
		(property "Value" "0"
			(at 243.84 142.24 90)
			(effects
				(font
					(size 1.27 1.27)
				)
			)
		)
		(property "Footprint" "Resistor_SMD:R_0603_1608Metric"
			(at 243.84 139.7 0)
			(effects
				(font
					(size 1.27 1.27)
				)
				(hide yes)
			)
		)
		(property "Datasheet" "~"
			(at 243.84 139.7 0)
			(effects
				(font
					(size 1.27 1.27)
				)
				(hide yes)
			)
		)
		(property "Description" ""
			(at 243.84 139.7 0)
			(effects
				(font
					(size 1.27 1.27)
				)
				(hide yes)
			)
		)
		(property "LCSC" "C21189"
			(at 245.1101 142.24 0)
			(effects
				(font
					(size 1.27 1.27)
				)
				(hide yes)
			)
		)
		(property "LCSC alt" ""
			(at 243.84 139.7 0)
			(effects
				(font
					(size 1.27 1.27)
				)
				(hide yes)
			)
		)
		(pin "1"
			(uuid "fa419b8e-d552-4ab6-b944-b0054dd9c49f")
		)
		(pin "2"
			(uuid "078db4e6-20d2-459a-86ce-ab0d49d85244")
		)
		(instances
			(project "HydroponicFlowerControl"
				(path "/b3c8a28b-9ce1-4002-b8e8-ef8cb73fe031/9aca03da-9950-423c-b716-bf95878ee447"
					(reference "R67")
					(unit 1)
				)
			)
		)
	)
	(symbol
		(lib_id "power:GND")
		(at 217.17 115.57 0)
		(unit 1)
		(exclude_from_sim no)
		(in_bom yes)
		(on_board yes)
		(dnp no)
		(uuid "9fab0779-9d4e-4984-b75c-7b91cb1397cd")
		(property "Reference" "#PWR0144"
			(at 217.17 121.92 0)
			(effects
				(font
					(size 1.27 1.27)
				)
				(hide yes)
			)
		)
		(property "Value" "GND"
			(at 217.17 119.38 0)
			(effects
				(font
					(size 1.27 1.27)
				)
			)
		)
		(property "Footprint" ""
			(at 217.17 115.57 0)
			(effects
				(font
					(size 1.27 1.27)
				)
				(hide yes)
			)
		)
		(property "Datasheet" ""
			(at 217.17 115.57 0)
			(effects
				(font
					(size 1.27 1.27)
				)
				(hide yes)
			)
		)
		(property "Description" ""
			(at 217.17 115.57 0)
			(effects
				(font
					(size 1.27 1.27)
				)
				(hide yes)
			)
		)
		(pin "1"
			(uuid "1d887c33-0e7b-449c-aece-99a6f87402de")
		)
		(instances
			(project "HydroponicFlowerControl"
				(path "/b3c8a28b-9ce1-4002-b8e8-ef8cb73fe031/9aca03da-9950-423c-b716-bf95878ee447"
					(reference "#PWR0144")
					(unit 1)
				)
			)
		)
	)
	(symbol
		(lib_id "Connector:Raspberry_Pi_2_3")
		(at 66.04 63.5 0)
		(unit 1)
		(exclude_from_sim no)
		(in_bom yes)
		(on_board yes)
		(dnp no)
		(fields_autoplaced yes)
		(uuid "ae4c4548-6eb9-481d-bbcb-5ff0b7b58fd8")
		(property "Reference" "J18"
			(at 68.2341 96.52 0)
			(effects
				(font
					(size 1.27 1.27)
				)
				(justify left)
			)
		)
		(property "Value" "Raspberry_Pi_2_3"
			(at 68.2341 99.06 0)
			(effects
				(font
					(size 1.27 1.27)
				)
				(justify left)
			)
		)
		(property "Footprint" "HydroponicFlowerControl:HDR-SMD_40P-P2.54-V-F-R2-C20-S7.1-EH"
			(at 66.04 63.5 0)
			(effects
				(font
					(size 1.27 1.27)
				)
				(hide yes)
			)
		)
		(property "Datasheet" "https://www.raspberrypi.org/documentation/hardware/raspberrypi/schematics/rpi_SCH_3bplus_1p0_reduced.pdf"
			(at 127 107.95 0)
			(effects
				(font
					(size 1.27 1.27)
				)
				(hide yes)
			)
		)
		(property "Description" "expansion header for Raspberry Pi 2 & 3"
			(at 66.04 63.5 0)
			(effects
				(font
					(size 1.27 1.27)
				)
				(hide yes)
			)
		)
		(property "JLCPCB Rotation Offset" "0"
			(at 66.04 63.5 0)
			(effects
				(font
					(size 1.27 1.27)
				)
				(hide yes)
			)
		)
		(property "LCSC" "C2685092"
			(at 66.04 63.5 0)
			(effects
				(font
					(size 1.27 1.27)
				)
				(hide yes)
			)
		)
		(pin "40"
			(uuid "66969152-3513-4ae4-9def-c501043a8300")
		)
		(pin "7"
			(uuid "b3c4bdfc-a226-42d0-aceb-eb1c58f50d0e")
		)
		(pin "34"
			(uuid "c37d6bf1-0e95-4dd7-b1da-0a57b59f2efd")
		)
		(pin "24"
			(uuid "1e08c0c5-266d-4b39-b820-052e4c4747b9")
		)
		(pin "35"
			(uuid "62732083-bfe2-4241-b39b-38fff0431673")
		)
		(pin "16"
			(uuid "dea5c700-ce1f-4366-bca7-10baa4c7870a")
		)
		(pin "10"
			(uuid "9f618c32-066e-4b43-bb9e-3d2cea5f3bb8")
		)
		(pin "20"
			(uuid "b3f5c79f-1993-43be-bae6-fbff7bc7a9ce")
		)
		(pin "3"
			(uuid "705353ae-62f2-46fe-8965-81d4c2f823f6")
		)
		(pin "1"
			(uuid "e1e99cf8-968b-4b57-af1b-63ff1116dcbd")
		)
		(pin "14"
			(uuid "eaad6281-cb1e-4629-b451-819b6d04c5f8")
		)
		(pin "31"
			(uuid "556bb35d-4016-47a8-b5a1-cfff7a359815")
		)
		(pin "30"
			(uuid "fafa9537-642a-4037-a965-137e9428b543")
		)
		(pin "13"
			(uuid "69cb1d22-c9ce-4bf0-8096-5b842e3e0148")
		)
		(pin "37"
			(uuid "dfc555a5-d62c-421f-a954-73310c29280d")
		)
		(pin "11"
			(uuid "846e7751-ea45-43de-bb9f-d5d197d17fb0")
		)
		(pin "38"
			(uuid "6df8a641-a426-48fc-8b32-51f8c7064b2b")
		)
		(pin "8"
			(uuid "3ef7ae73-76bc-4b0c-ab3b-32d9f97f1bf0")
		)
		(pin "39"
			(uuid "c252c708-08e7-447a-8536-b4e3432f6449")
		)
		(pin "5"
			(uuid "c2e8e4bf-c5e2-4597-94bd-66c590fc48ea")
		)
		(pin "28"
			(uuid "c0e5660d-54c2-4614-beb1-b5da798dbe1a")
		)
		(pin "12"
			(uuid "0c91656d-b7fc-4a23-a6a6-dce689b39a04")
		)
		(pin "6"
			(uuid "03855f32-7d15-430f-af6e-cc51efdbe3f1")
		)
		(pin "36"
			(uuid "f40038ef-e7c3-480d-a5fc-b14f47d8abc1")
		)
		(pin "4"
			(uuid "c91e20a2-060e-4cb9-8342-91538e8ce91e")
		)
		(pin "22"
			(uuid "59b8a17a-2c77-482b-957e-bd76db720d1a")
		)
		(pin "19"
			(uuid "db673dc9-3601-4af1-83ae-d730f583297b")
		)
		(pin "27"
			(uuid "b9726165-cb39-40e7-87bb-10c2410759d9")
		)
		(pin "29"
			(uuid "f5c32325-1c13-4847-8ac6-98056931062a")
		)
		(pin "26"
			(uuid "81c67f71-f2d3-49b7-a98d-114b0a602e0a")
		)
		(pin "2"
			(uuid "8433320f-7d53-4c8a-bbc4-fe530dcf57a4")
		)
		(pin "18"
			(uuid "73fcc72f-e0dd-4ff2-881b-cf3423f47cfc")
		)
		(pin "25"
			(uuid "5390e664-8f4b-4b8a-8763-a8aa95b94f01")
		)
		(pin "21"
			(uuid "37f72ec5-4931-409a-9426-13b812975475")
		)
		(pin "23"
			(uuid "cb206de8-79fe-4a5d-9838-c313ebb0457f")
		)
		(pin "9"
			(uuid "c48ce878-0bf1-4c30-8d52-282753f25237")
		)
		(pin "33"
			(uuid "720d3fff-b423-4433-9c78-da6dc7751770")
		)
		(pin "17"
			(uuid "4905d0fa-c2c1-4656-9e71-32410b38a555")
		)
		(pin "32"
			(uuid "76bba3c7-ead6-498f-be07-ac122b6d6ef7")
		)
		(pin "15"
			(uuid "c6e85e49-2205-4c56-95c2-eb5e98074509")
		)
		(instances
			(project "HydroponicFlowerControl"
				(path "/b3c8a28b-9ce1-4002-b8e8-ef8cb73fe031/9aca03da-9950-423c-b716-bf95878ee447"
					(reference "J18")
					(unit 1)
				)
			)
		)
	)
	(symbol
		(lib_id "Device:C_Small")
		(at 167.64 146.05 90)
		(unit 1)
		(exclude_from_sim no)
		(in_bom yes)
		(on_board yes)
		(dnp no)
		(uuid "ae79ad5a-fb56-4f5d-b9b5-4defc8b6f0c1")
		(property "Reference" "C59"
			(at 167.64 150.622 90)
			(effects
				(font
					(size 1.27 1.27)
				)
			)
		)
		(property "Value" "20pF"
			(at 167.64 152.654 90)
			(effects
				(font
					(size 1.27 1.27)
				)
			)
		)
		(property "Footprint" "Capacitor_SMD:C_0603_1608Metric"
			(at 167.64 146.05 0)
			(effects
				(font
					(size 1.27 1.27)
				)
				(hide yes)
			)
		)
		(property "Datasheet" "~"
			(at 167.64 146.05 0)
			(effects
				(font
					(size 1.27 1.27)
				)
				(hide yes)
			)
		)
		(property "Description" ""
			(at 167.64 146.05 0)
			(effects
				(font
					(size 1.27 1.27)
				)
				(hide yes)
			)
		)
		(property "LCSC" "C1648"
			(at 167.6463 139.065 0)
			(effects
				(font
					(size 1.27 1.27)
				)
				(hide yes)
			)
		)
		(property "LCSC alt" ""
			(at 167.64 146.05 0)
			(effects
				(font
					(size 1.27 1.27)
				)
				(hide yes)
			)
		)
		(pin "1"
			(uuid "850c2bcc-1455-4539-b069-68fad91a6c31")
		)
		(pin "2"
			(uuid "f6fc12b7-2c18-450b-8a80-32dcac457a9c")
		)
		(instances
			(project "HydroponicFlowerControl"
				(path "/b3c8a28b-9ce1-4002-b8e8-ef8cb73fe031/9aca03da-9950-423c-b716-bf95878ee447"
					(reference "C59")
					(unit 1)
				)
			)
		)
	)
	(symbol
		(lib_id "Device:R_Small")
		(at 111.76 167.64 0)
		(unit 1)
		(exclude_from_sim no)
		(in_bom yes)
		(on_board yes)
		(dnp no)
		(uuid "af614c85-b4b2-4a11-b6f6-c03738de3761")
		(property "Reference" "R76"
			(at 113.2586 166.497 0)
			(effects
				(font
					(size 1.27 1.27)
				)
				(justify left)
			)
		)
		(property "Value" "3.9k"
			(at 113.2587 168.7893 0)
			(effects
				(font
					(size 1.27 1.27)
				)
				(justify left)
			)
		)
		(property "Footprint" "Resistor_SMD:R_0603_1608Metric"
			(at 111.76 167.64 0)
			(effects
				(font
					(size 1.27 1.27)
				)
				(hide yes)
			)
		)
		(property "Datasheet" "~"
			(at 111.76 167.64 0)
			(effects
				(font
					(size 1.27 1.27)
				)
				(hide yes)
			)
		)
		(property "Description" ""
			(at 111.76 167.64 0)
			(effects
				(font
					(size 1.27 1.27)
				)
				(hide yes)
			)
		)
		(property "LCSC" "C23018"
			(at 111.76 167.64 0)
			(effects
				(font
					(size 1.27 1.27)
				)
				(hide yes)
			)
		)
		(pin "1"
			(uuid "0f11452f-09bf-497e-8fab-0f864742d502")
		)
		(pin "2"
			(uuid "400b1eaa-5f51-4200-a87a-7c7d102e9eec")
		)
		(instances
			(project "HydroponicFlowerControl"
				(path "/b3c8a28b-9ce1-4002-b8e8-ef8cb73fe031/9aca03da-9950-423c-b716-bf95878ee447"
					(reference "R76")
					(unit 1)
				)
			)
		)
	)
	(symbol
		(lib_id "Connector:TestPoint")
		(at 134.62 170.18 0)
		(unit 1)
		(exclude_from_sim no)
		(in_bom no)
		(on_board yes)
		(dnp no)
		(fields_autoplaced yes)
		(uuid "b05bb87c-69c2-475e-9ca0-ce534a1ef905")
		(property "Reference" "TP14"
			(at 137.16 165.6079 0)
			(effects
				(font
					(size 1.27 1.27)
				)
				(justify left)
			)
		)
		(property "Value" "ID_SCL"
			(at 137.16 168.1479 0)
			(effects
				(font
					(size 1.27 1.27)
				)
				(justify left)
			)
		)
		(property "Footprint" "TestPoint:TestPoint_Pad_D1.5mm"
			(at 139.7 170.18 0)
			(effects
				(font
					(size 1.27 1.27)
				)
				(hide yes)
			)
		)
		(property "Datasheet" "~"
			(at 139.7 170.18 0)
			(effects
				(font
					(size 1.27 1.27)
				)
				(hide yes)
			)
		)
		(property "Description" "test point"
			(at 134.62 170.18 0)
			(effects
				(font
					(size 1.27 1.27)
				)
				(hide yes)
			)
		)
		(pin "1"
			(uuid "f97e9095-f2da-42c7-a7a0-7cebdf66eac5")
		)
		(instances
			(project "HydroponicFlowerControl"
				(path "/b3c8a28b-9ce1-4002-b8e8-ef8cb73fe031/9aca03da-9950-423c-b716-bf95878ee447"
					(reference "TP14")
					(unit 1)
				)
			)
		)
	)
	(symbol
		(lib_id "power:GND")
		(at 161.29 151.13 0)
		(unit 1)
		(exclude_from_sim no)
		(in_bom yes)
		(on_board yes)
		(dnp no)
		(uuid "b842be69-a121-438e-8bac-db721a4e5dd7")
		(property "Reference" "#PWR0143"
			(at 161.29 157.48 0)
			(effects
				(font
					(size 1.27 1.27)
				)
				(hide yes)
			)
		)
		(property "Value" "GND"
			(at 161.29 154.94 0)
			(effects
				(font
					(size 1.27 1.27)
				)
			)
		)
		(property "Footprint" ""
			(at 161.29 151.13 0)
			(effects
				(font
					(size 1.27 1.27)
				)
				(hide yes)
			)
		)
		(property "Datasheet" ""
			(at 161.29 151.13 0)
			(effects
				(font
					(size 1.27 1.27)
				)
				(hide yes)
			)
		)
		(property "Description" ""
			(at 161.29 151.13 0)
			(effects
				(font
					(size 1.27 1.27)
				)
				(hide yes)
			)
		)
		(pin "1"
			(uuid "1888de7f-2f3b-4a3d-83e5-11e37aa64902")
		)
		(instances
			(project "HydroponicFlowerControl"
				(path "/b3c8a28b-9ce1-4002-b8e8-ef8cb73fe031/9aca03da-9950-423c-b716-bf95878ee447"
					(reference "#PWR0143")
					(unit 1)
				)
			)
		)
	)
	(symbol
		(lib_id "Device:R_Small")
		(at 104.14 167.64 0)
		(unit 1)
		(exclude_from_sim no)
		(in_bom yes)
		(on_board yes)
		(dnp no)
		(uuid "bca16989-5beb-4542-87fa-6afd95d15a09")
		(property "Reference" "R47"
			(at 105.6386 166.497 0)
			(effects
				(font
					(size 1.27 1.27)
				)
				(justify left)
			)
		)
		(property "Value" "3.9k"
			(at 105.6387 168.7893 0)
			(effects
				(font
					(size 1.27 1.27)
				)
				(justify left)
			)
		)
		(property "Footprint" "Resistor_SMD:R_0603_1608Metric"
			(at 104.14 167.64 0)
			(effects
				(font
					(size 1.27 1.27)
				)
				(hide yes)
			)
		)
		(property "Datasheet" "~"
			(at 104.14 167.64 0)
			(effects
				(font
					(size 1.27 1.27)
				)
				(hide yes)
			)
		)
		(property "Description" ""
			(at 104.14 167.64 0)
			(effects
				(font
					(size 1.27 1.27)
				)
				(hide yes)
			)
		)
		(property "LCSC" "C23018"
			(at 104.14 167.64 0)
			(effects
				(font
					(size 1.27 1.27)
				)
				(hide yes)
			)
		)
		(pin "1"
			(uuid "89eca27a-d649-451e-81cd-fea3f67cbb9d")
		)
		(pin "2"
			(uuid "5cc2f5a4-5a8e-41d2-bcf8-835d7c16f419")
		)
		(instances
			(project "HydroponicFlowerControl"
				(path "/b3c8a28b-9ce1-4002-b8e8-ef8cb73fe031/9aca03da-9950-423c-b716-bf95878ee447"
					(reference "R47")
					(unit 1)
				)
			)
		)
	)
	(symbol
		(lib_id "power:+3.3V")
		(at 209.55 110.49 0)
		(unit 1)
		(exclude_from_sim no)
		(in_bom yes)
		(on_board yes)
		(dnp no)
		(uuid "c071fd6b-081d-48f2-bb4c-68d1b10f7d30")
		(property "Reference" "#PWR0145"
			(at 209.55 114.3 0)
			(effects
				(font
					(size 1.27 1.27)
				)
				(hide yes)
			)
		)
		(property "Value" "+3.3V"
			(at 209.042 105.918 0)
			(effects
				(font
					(size 1.27 1.27)
				)
			)
		)
		(property "Footprint" ""
			(at 209.55 110.49 0)
			(effects
				(font
					(size 1.27 1.27)
				)
				(hide yes)
			)
		)
		(property "Datasheet" ""
			(at 209.55 110.49 0)
			(effects
				(font
					(size 1.27 1.27)
				)
				(hide yes)
			)
		)
		(property "Description" "Power symbol creates a global label with name \"+3.3V\""
			(at 209.55 110.49 0)
			(effects
				(font
					(size 1.27 1.27)
				)
				(hide yes)
			)
		)
		(pin "1"
			(uuid "467d89f9-3757-4e45-8ea5-33985bd0168f")
		)
		(instances
			(project "HydroponicFlowerControl"
				(path "/b3c8a28b-9ce1-4002-b8e8-ef8cb73fe031/9aca03da-9950-423c-b716-bf95878ee447"
					(reference "#PWR0145")
					(unit 1)
				)
			)
		)
	)
	(symbol
		(lib_id "Memory_EEPROM:CAT24C256")
		(at 91.44 175.26 0)
		(unit 1)
		(exclude_from_sim no)
		(in_bom yes)
		(on_board yes)
		(dnp no)
		(uuid "c1d9d28c-2454-4d79-a84e-429781b3cfc4")
		(property "Reference" "U1"
			(at 85.09 168.2558 0)
			(effects
				(font
					(size 1.27 1.27)
				)
			)
		)
		(property "Value" "AT24C256C"
			(at 97.79 181.9845 0)
			(effects
				(font
					(size 1.27 1.27)
				)
			)
		)
		(property "Footprint" "Package_SO:SOIC-8_3.9x4.9mm_P1.27mm"
			(at 91.44 175.26 0)
			(effects
				(font
					(size 1.27 1.27)
				)
				(hide yes)
			)
		)
		(property "Datasheet" "https://wmsc.lcsc.com/wmsc/upload/file/pdf/v2/lcsc/2304140030_Microchip-Tech-AT24C256C-SSHL-T_C6482.pdf"
			(at 91.44 175.26 0)
			(effects
				(font
					(size 1.27 1.27)
				)
				(hide yes)
			)
		)
		(property "Description" ""
			(at 91.44 175.26 0)
			(effects
				(font
					(size 1.27 1.27)
				)
				(hide yes)
			)
		)
		(property "LCSC" "C6482"
			(at 91.44 175.26 0)
			(effects
				(font
					(size 1.27 1.27)
				)
				(hide yes)
			)
		)
		(pin "1"
			(uuid "38adae89-4671-462d-babc-926c9d668a32")
		)
		(pin "2"
			(uuid "e77fd1a5-cdc4-47a6-ac92-4319a7459d73")
		)
		(pin "3"
			(uuid "772c9f63-7b89-4b96-b2ae-11b77a4cef1d")
		)
		(pin "4"
			(uuid "c5c6775a-e6f6-4d49-aef4-91d6532f6d37")
		)
		(pin "5"
			(uuid "e0ec7f8c-c4b3-4a8e-b879-de8ffea7b6c1")
		)
		(pin "6"
			(uuid "229581a8-4db0-458f-bdd6-e2ec66e3be70")
		)
		(pin "7"
			(uuid "09adce80-e4ae-451e-80fa-13185385b32a")
		)
		(pin "8"
			(uuid "dd08afac-142e-484b-bf6b-248d10263acf")
		)
		(instances
			(project "HydroponicFlowerControl"
				(path "/b3c8a28b-9ce1-4002-b8e8-ef8cb73fe031/9aca03da-9950-423c-b716-bf95878ee447"
					(reference "U1")
					(unit 1)
				)
			)
		)
	)
	(symbol
		(lib_id "Device:C_Small")
		(at 213.36 113.03 90)
		(unit 1)
		(exclude_from_sim no)
		(in_bom yes)
		(on_board yes)
		(dnp no)
		(uuid "c5699bd4-17a4-4ae9-83b3-3042f006d3e9")
		(property "Reference" "C60"
			(at 215.392 107.696 90)
			(effects
				(font
					(size 1.27 1.27)
				)
				(justify left)
			)
		)
		(property "Value" "100nF/0.1uF"
			(at 224.282 109.982 90)
			(effects
				(font
					(size 1.27 1.27)
				)
				(justify left)
			)
		)
		(property "Footprint" "Capacitor_SMD:C_0603_1608Metric"
			(at 213.36 113.03 0)
			(effects
				(font
					(size 1.27 1.27)
				)
				(hide yes)
			)
		)
		(property "Datasheet" "~"
			(at 213.36 113.03 0)
			(effects
				(font
					(size 1.27 1.27)
				)
				(hide yes)
			)
		)
		(property "Description" "Unpolarized capacitor, small symbol"
			(at 213.36 113.03 0)
			(effects
				(font
					(size 1.27 1.27)
				)
				(hide yes)
			)
		)
		(property "LCSC" "C14663"
			(at 213.36 113.03 0)
			(effects
				(font
					(size 1.27 1.27)
				)
				(hide yes)
			)
		)
		(property "LCSC alt" ""
			(at 213.36 113.03 0)
			(effects
				(font
					(size 1.27 1.27)
				)
				(hide yes)
			)
		)
		(pin "2"
			(uuid "0906cfd1-7926-4bdc-9413-78240851527c")
		)
		(pin "1"
			(uuid "54b457d5-16d1-4b01-97cd-ac77c0a9de5b")
		)
		(instances
			(project "HydroponicFlowerControl"
				(path "/b3c8a28b-9ce1-4002-b8e8-ef8cb73fe031/9aca03da-9950-423c-b716-bf95878ee447"
					(reference "C60")
					(unit 1)
				)
			)
		)
	)
	(symbol
		(lib_id "power:+3.3V")
		(at 257.81 118.11 0)
		(unit 1)
		(exclude_from_sim no)
		(in_bom yes)
		(on_board yes)
		(dnp no)
		(uuid "d28017a2-177e-4b96-b015-441926e8a06b")
		(property "Reference" "#PWR0137"
			(at 257.81 121.92 0)
			(effects
				(font
					(size 1.27 1.27)
				)
				(hide yes)
			)
		)
		(property "Value" "+3.3V"
			(at 257.302 113.538 0)
			(effects
				(font
					(size 1.27 1.27)
				)
			)
		)
		(property "Footprint" ""
			(at 257.81 118.11 0)
			(effects
				(font
					(size 1.27 1.27)
				)
				(hide yes)
			)
		)
		(property "Datasheet" ""
			(at 257.81 118.11 0)
			(effects
				(font
					(size 1.27 1.27)
				)
				(hide yes)
			)
		)
		(property "Description" "Power symbol creates a global label with name \"+3.3V\""
			(at 257.81 118.11 0)
			(effects
				(font
					(size 1.27 1.27)
				)
				(hide yes)
			)
		)
		(pin "1"
			(uuid "0da16253-6bdf-4a3f-95cc-ded4bf1c559a")
		)
		(instances
			(project "HydroponicFlowerControl"
				(path "/b3c8a28b-9ce1-4002-b8e8-ef8cb73fe031/9aca03da-9950-423c-b716-bf95878ee447"
					(reference "#PWR0137")
					(unit 1)
				)
			)
		)
	)
	(symbol
		(lib_id "power:+3.3V")
		(at 111.76 160.02 0)
		(unit 1)
		(exclude_from_sim no)
		(in_bom yes)
		(on_board yes)
		(dnp no)
		(uuid "d8d26a8b-90e7-42d0-8cfc-b60cf7ad0f8b")
		(property "Reference" "#PWR064"
			(at 111.76 163.83 0)
			(effects
				(font
					(size 1.27 1.27)
				)
				(hide yes)
			)
		)
		(property "Value" "+3.3V"
			(at 111.252 155.448 0)
			(effects
				(font
					(size 1.27 1.27)
				)
			)
		)
		(property "Footprint" ""
			(at 111.76 160.02 0)
			(effects
				(font
					(size 1.27 1.27)
				)
				(hide yes)
			)
		)
		(property "Datasheet" ""
			(at 111.76 160.02 0)
			(effects
				(font
					(size 1.27 1.27)
				)
				(hide yes)
			)
		)
		(property "Description" "Power symbol creates a global label with name \"+3.3V\""
			(at 111.76 160.02 0)
			(effects
				(font
					(size 1.27 1.27)
				)
				(hide yes)
			)
		)
		(pin "1"
			(uuid "6ec594c4-4dc9-4e8b-b2eb-40b0bf329c6a")
		)
		(instances
			(project "HydroponicFlowerControl"
				(path "/b3c8a28b-9ce1-4002-b8e8-ef8cb73fe031/9aca03da-9950-423c-b716-bf95878ee447"
					(reference "#PWR064")
					(unit 1)
				)
			)
		)
	)
	(symbol
		(lib_id "Interface_CAN_LIN:MCP2518FD-xQBB")
		(at 209.55 137.16 0)
		(unit 1)
		(exclude_from_sim no)
		(in_bom yes)
		(on_board yes)
		(dnp no)
		(fields_autoplaced yes)
		(uuid "eb192236-1904-49af-b420-08cc43efa076")
		(property "Reference" "U16"
			(at 211.7441 121.92 0)
			(effects
				(font
					(size 1.27 1.27)
				)
				(justify left)
			)
		)
		(property "Value" "MCP2518FD-xQBB"
			(at 211.7441 124.46 0)
			(effects
				(font
					(size 1.27 1.27)
				)
				(justify left)
			)
		)
		(property "Footprint" "Package_SO:SOIC-14_3.9x8.7mm_P1.27mm"
			(at 210.82 151.13 0)
			(effects
				(font
					(size 1.27 1.27)
				)
				(justify left)
				(hide yes)
			)
		)
		(property "Datasheet" "https://ww1.microchip.com/downloads/aemDocuments/documents/OTH/ProductDocuments/DataSheets/External-CAN-FD-Controller-with-SPI-Interface-DS20006027B.pdf"
			(at 210.82 153.67 0)
			(effects
				(font
					(size 1.27 1.27)
				)
				(justify left)
				(hide yes)
			)
		)
		(property "Description" "CAN FD Controller with SPI Interface, up to 8 Mbps, Vdd 2.7..5.5V,  functional safety ready, VDFN-14"
			(at 209.55 137.16 0)
			(effects
				(font
					(size 1.27 1.27)
				)
				(hide yes)
			)
		)
		(property "LCSC" "C626758"
			(at 209.55 137.16 0)
			(effects
				(font
					(size 1.27 1.27)
				)
				(hide yes)
			)
		)
		(property "LCSC alt" ""
			(at 209.55 137.16 0)
			(effects
				(font
					(size 1.27 1.27)
				)
				(hide yes)
			)
		)
		(pin "1"
			(uuid "cda3bbc2-f5e2-433d-ade4-b83042dcb7a7")
		)
		(pin "12"
			(uuid "b67bc33e-7e4e-40eb-9dcf-3178b5ec64f3")
		)
		(pin "2"
			(uuid "8f6cc27c-4822-4960-a6ea-935a3707fa07")
		)
		(pin "14"
			(uuid "3a117640-9032-4e62-9724-9d58f651ff93")
		)
		(pin "13"
			(uuid "b0024431-7ed1-42f9-83b1-c407c7d482a6")
		)
		(pin "5"
			(uuid "c7ac60bd-2963-4139-aec8-07926881c3bc")
		)
		(pin "6"
			(uuid "154502f3-390b-4d46-83a4-cf0e83ddd551")
		)
		(pin "9"
			(uuid "8cb8a106-12ad-4e7b-a9f0-3799fd68fc8d")
		)
		(pin "7"
			(uuid "7750d143-311b-4306-a0be-52949345b3d3")
		)
		(pin "8"
			(uuid "7290783d-d548-474a-b780-20e1283c6110")
		)
		(pin "4"
			(uuid "453a3e0e-b2ba-4c2c-bbd6-ba6398b09dcc")
		)
		(pin "10"
			(uuid "b1338718-38df-48df-b0df-9b3315c64568")
		)
		(pin "3"
			(uuid "55037074-1ad6-426c-a87f-397be3807d04")
		)
		(pin "11"
			(uuid "1b64b5e5-6d1c-42da-992e-34934b325aa0")
		)
		(pin "15"
			(uuid "89f99483-02b7-4f3c-9a5e-fca812da0b03")
		)
		(instances
			(project "HydroponicFlowerControl"
				(path "/b3c8a28b-9ce1-4002-b8e8-ef8cb73fe031/9aca03da-9950-423c-b716-bf95878ee447"
					(reference "U16")
					(unit 1)
				)
			)
		)
	)
	(symbol
		(lib_id "power:GND")
		(at 257.81 149.86 0)
		(unit 1)
		(exclude_from_sim no)
		(in_bom yes)
		(on_board yes)
		(dnp no)
		(uuid "ecf8c595-c1ee-433b-8699-2b1f2d98a456")
		(property "Reference" "#PWR0138"
			(at 257.81 156.21 0)
			(effects
				(font
					(size 1.27 1.27)
				)
				(hide yes)
			)
		)
		(property "Value" "GND"
			(at 257.81 153.67 0)
			(effects
				(font
					(size 1.27 1.27)
				)
			)
		)
		(property "Footprint" ""
			(at 257.81 149.86 0)
			(effects
				(font
					(size 1.27 1.27)
				)
				(hide yes)
			)
		)
		(property "Datasheet" ""
			(at 257.81 149.86 0)
			(effects
				(font
					(size 1.27 1.27)
				)
				(hide yes)
			)
		)
		(property "Description" ""
			(at 257.81 149.86 0)
			(effects
				(font
					(size 1.27 1.27)
				)
				(hide yes)
			)
		)
		(pin "1"
			(uuid "01ad8737-1e1f-4e1e-9f1c-680bccf134ea")
		)
		(instances
			(project "HydroponicFlowerControl"
				(path "/b3c8a28b-9ce1-4002-b8e8-ef8cb73fe031/9aca03da-9950-423c-b716-bf95878ee447"
					(reference "#PWR0138")
					(unit 1)
				)
			)
		)
	)
)
