[
  {
    "id": "radarSingleMapScreenConfig",
    "title": "Radar view",
    "views": {
      "allIds": ["radarView"],
      "byId": {
        "radarView": {
          "title": "Radar view",
          "componentType": "ConfigurableMapWithSlider",
          "initialProps": {
            "mapPreset": {
              "layers": [
                {
                  "service": "https://geoservices.knmi.nl/wms?dataset=RADAR&",
                  "name": "RAD_NL25_PCP_CM",
                  "format": "image/png",
                  "style": "radar/nearest",
                  "enabled": true,
                  "layerType": "mapLayer"
                },
                {
                  "service": "https://openwms.fmi.fi/geoserver/wms?",
                  "name": "Radar:suomi_dbz_eureffin",
                  "format": "image/png",
                  "style": "Radar dbz Summer",
                  "enabled": true,
                  "layerType": "mapLayer"
                },
                {
                  "service": "https://public-wms.met.no/verportal/verportal.map?",
                  "name": "radar_precipitation_intensity_nordic",
                  "id": "radar_precipitation_intensity_nordic_id",
                  "format": "image/png",
                  "style": "",
                  "enabled": true,
                  "layerType": "mapLayer"
                }
              ],
              "proj": {
                "bbox": {
                  "left": 58703.6377,
                  "bottom": 6408480.4514,
                  "right": 3967387.5161,
                  "top": 11520588.9031
                },
                "srs": "EPSG:3857"
              },
              "activeLayerId": "radar_precipitation_intensity_nordic_id",
              "toggleTimestepAuto": false,
              "setTimestep": 5
            }
          }
        }
      }
    },
    "mosaicNode": "radarView"
  },
  {
    "id": "satelliteSingleMapScreenConfig",
    "title": "Satellite",
    "views": {
      "allIds": ["satellite"],
      "byId": {
        "satellite": {
          "title": "Satellite",
          "componentType": "ConfigurableMapWithSlider",
          "initialProps": {
            "mapPreset": {
              "layers": [
                {
                  "service": "https://view.eumetsat.int/geoserver/wms?",
                  "name": "msg_fes:rgb_airmass",
                  "format": "image/png",
                  "enabled": true,
                  "style": "",
                  "layerType": "mapLayer"
                },
                {
                  "service": "https://view.eumetsat.int/geoserver/wms?",
                  "name": "msg_fes:rgb_eview",
                  "format": "image/png",
                  "enabled": true,
                  "style": "",
                  "layerType": "mapLayer"
                },
                {
                  "service": "https://view.eumetsat.int/geoserver/wms?",
                  "name": "msg_fes:rgb_ash",
                  "format": "image/png",
                  "enabled": true,
                  "style": "",
                  "layerType": "mapLayer"
                },
                {
                  "service": "https://view.eumetsat.int/geoserver/wms?",
                  "name": "msg_fes:ir108",
                  "format": "image/png",
                  "enabled": true,
                  "style": "",
                  "layerType": "mapLayer"
                },
                {
                  "service": "https://view.eumetsat.int/geoserver/wms?",
                  "name": "msg_fes:ir039",
                  "format": "image/png",
                  "enabled": true,
                  "style": "",
                  "layerType": "mapLayer"
                }
              ],
              "proj": {
                "bbox": {
                  "left": 58703.6377,
                  "bottom": 6408480.4514,
                  "right": 3967387.5161,
                  "top": 11520588.9031
                },
                "srs": "EPSG:3857"
              }
            }
          }
        }
      }
    },
    "mosaicNode": "satellite"
  },
  {
    "id": "sfcObsSingleMapScreenConfig",
    "title": "SFC Obs",
    "views": {
      "allIds": ["sfcObs"],
      "byId": {
        "sfcObs": {
          "title": "SFC Obs",
          "componentType": "ConfigurableMapWithSlider",
          "initialProps": {
            "mapPreset": {
              "layers": [
                {
                  "service": "https://geoservices.knmi.nl/adagucserver?dataset=OBS&",
                  "name": "10M/T2m_Td2m",
                  "format": "image/png",
                  "enabled": true,
                  "style": "",
                  "layerType": "mapLayer"
                },
                {
                  "service": "https://geoservices.knmi.nl/adagucserver?dataset=OBS&",
                  "name": "10M/hc",
                  "format": "image/png",
                  "enabled": true,
                  "style": "",
                  "layerType": "mapLayer"
                },
                {
                  "service": "https://geoservices.knmi.nl/adagucserver?dataset=OBS&",
                  "name": "10M/wind",
                  "format": "image/png",
                  "enabled": true,
                  "style": "",
                  "layerType": "mapLayer"
                },
                {
                  "service": "https://geoservices.knmi.nl/adagucserver?dataset=OBS&",
                  "name": "10M/gust",
                  "format": "image/png",
                  "enabled": true,
                  "style": "",
                  "layerType": "mapLayer"
                },
                {
                  "service": "https://geoservices.knmi.nl/adagucserver?dataset=OBS&",
                  "name": "10M/weathercodesymbol",
                  "format": "image/png",
                  "enabled": true,
                  "style": "",
                  "layerType": "mapLayer"
                },
                {
                  "service": "https://ogcie.iblsoft.com/metocean/wms?",
                  "name": "surface-obs",
                  "format": "image/png",
                  "enabled": true,
                  "style": "",
                  "layerType": "mapLayer"
                }
              ],
              "proj": {
                "bbox": {
                  "left": -450651.2255879827,
                  "bottom": 6490531.093143953,
                  "right": 1428345.8183648037,
                  "top": 7438773.776232235
                },
                "srs": "EPSG:3857"
              }
            }
          }
        }
      }
    },
    "mosaicNode": "sfcObs"
  },
  {
    "id": "harmSingleMapScreenConfig",
    "title": "HARM",
    "views": {
      "allIds": ["harm"],
      "byId": {
        "harm": {
          "title": "HARM",
          "componentType": "ConfigurableMapWithSlider",
          "initialProps": {
            "mapPreset": {
              "layers": [
                {
                  "service": "https://geoservices.knmi.nl/adagucserver?dataset=HARM_N25&",
                  "name": "wind__at_pl",
                  "id": "wind__at_pl",
                  "format": "image/png",
                  "enabled": true,
                  "style": "",
                  "layerType": "mapLayer",
                  "dimensions": [
                    {
                      "name": "elevation",
                      "currentValue": "850"
                    }
                  ]
                },
                {
                  "service": "https://geoservices.knmi.nl/adagucserver?dataset=HARM_N25&",
                  "name": "air_temperature__at_pl",
                  "id": "air_temperature__at_pl",
                  "format": "image/png",
                  "enabled": true,
                  "style": "",
                  "layerType": "mapLayer",
                  "dimensions": [
                    {
                      "name": "elevation",
                      "currentValue": "850"
                    }
                  ]
                },
                {
                  "service": "https://geoservices.knmi.nl/adagucserver?dataset=HARM_N25&",
                  "name": "geopotential__at_pl",
                  "id": "geopotential__at_pl",
                  "format": "image/png",
                  "enabled": true,
                  "style": "",
                  "layerType": "mapLayer",
                  "dimensions": [
                    {
                      "name": "elevation",
                      "currentValue": "850"
                    }
                  ]
                },
                {
                  "service": "https://geoservices.knmi.nl/adagucserver?dataset=HARM_N25&",
                  "name": "relative_humidity__at_pl",
                  "id": "relative_humidity__at_pl",
                  "format": "image/png",
                  "enabled": true,
                  "style": "",
                  "layerType": "mapLayer",
                  "dimensions": [
                    {
                      "name": "elevation",
                      "currentValue": "850"
                    }
                  ]
                },
                {
                  "service": "https://geoservices.knmi.nl/adagucserver?dataset=HARM_N25&",
                  "name": "air_temperature__at_2m",
                  "id": "air_temperature__at_2m",
                  "format": "image/png",
                  "enabled": true,
                  "style": "",
                  "layerType": "mapLayer"
                },
                {
                  "service": "https://geoservices.knmi.nl/adagucserver?dataset=HARM_N25&",
                  "name": "wind__at_10m",
                  "id": "wind__at_10m",
                  "format": "image/png",
                  "enabled": true,
                  "style": "",
                  "layerType": "mapLayer"
                },
                {
                  "service": "https://geoservices.knmi.nl/adagucserver?dataset=HARM_N25&",
                  "name": "wind_speed_of_gust__at_10m",
                  "id": "wind_speed_of_gust__at_10m",
                  "format": "image/png",
                  "enabled": true,
                  "style": "",
                  "layerType": "mapLayer"
                },
                {
                  "service": "https://geoservices.knmi.nl/adagucserver?dataset=HARM_N25&",
                  "name": "precipitation_flux",
                  "id": "precipitation_flux",
                  "format": "image/png",
                  "enabled": true,
                  "style": "",
                  "layerType": "mapLayer"
                }
              ],
              "proj": {
                "bbox": {
                  "left": -450651.2255879827,
                  "bottom": 6490531.093143953,
                  "right": 1428345.8183648037,
                  "top": 7438773.776232235
                },
                "srs": "EPSG:3857"
              }
            }
          }
        }
      }
    },
    "mosaicNode": "harm"
  },
  {
    "id": "harmSfcObsSingleMapScreenConfig",
    "title": "HARM vs SFC Obs",
    "views": {
      "allIds": ["harmSfcObs"],
      "byId": {
        "harmSfcObs": {
          "title": "HARM vs SFC Obs",
          "componentType": "ConfigurableMapWithSlider",
          "initialProps": {
            "mapPreset": {
              "layers": [
                {
                  "service": "https://geoservices.knmi.nl/adagucserver?dataset=OBS&",
                  "name": "10M/ta",
                  "format": "image/png",
                  "enabled": true,
                  "layerType": "mapLayer"
                },
                {
                  "service": "https://geoservices.knmi.nl/adagucserver?dataset=HARM_N25&",
                  "name": "precipitation_flux",
                  "format": "image/png",
                  "enabled": true,
                  "layerType": "mapLayer"
                },
                {
                  "service": "https://geoservices.knmi.nl/adagucserver?dataset=HARM_N25&",
                  "name": "cloud_area_fraction",
                  "format": "image/png",
                  "enabled": false,
                  "layerType": "mapLayer"
                },
                {
                  "service": "https://geoservices.knmi.nl/adagucserver?dataset=HARM_N25&",
                  "name": "low_type_cloud_area_fraction",
                  "format": "image/png",
                  "enabled": false,
                  "layerType": "mapLayer"
                },
                {
                  "service": "https://geoservices.knmi.nl/adagucserver?dataset=HARM_N25&",
                  "name": "medium_type_cloud_area_fraction",
                  "format": "image/png",
                  "enabled": false,
                  "layerType": "mapLayer"
                },
                {
                  "service": "https://geoservices.knmi.nl/adagucserver?dataset=HARM_N25&",
                  "name": "high_type_cloud_area_fraction",
                  "format": "image/png",
                  "enabled": false,
                  "layerType": "mapLayer"
                },
                {
                  "service": "https://geoservices.knmi.nl/adagucserver?dataset=HARM_N25&",
                  "name": "cloud_base_altitude",
                  "format": "image/png",
                  "enabled": false,
                  "layerType": "mapLayer"
                },
                {
                  "service": "https://geoservices.knmi.nl/adagucserver?dataset=HARM_N25&",
                  "name": "wind__at_10m",
                  "format": "image/png",
                  "enabled": true,
                  "layerType": "mapLayer"
                },
                {
                  "service": "https://geoservices.knmi.nl/adagucserver?dataset=HARM_N25&",
                  "name": "air_temperature__at_2m",
                  "format": "image/png",
                  "enabled": true,
                  "layerType": "mapLayer"
                },
                {
                  "service": "https://geoservices.knmi.nl/adagucserver?dataset=HARM_N25&",
                  "name": "dew_point_temperature__at_2m",
                  "format": "image/png",
                  "enabled": false,
                  "layerType": "mapLayer"
                },
                {
                  "service": "https://geoservices.knmi.nl/adagucserver?dataset=HARM_N25&",
                  "name": "wind_speed_of_gust__at_10m",
                  "format": "image/png",
                  "enabled": false,
                  "layerType": "mapLayer"
                },

                {
                  "service": "https://geoservices.knmi.nl/adagucserver?dataset=OBS&",
                  "name": "10M/hc",
                  "format": "image/png",
                  "enabled": false,
                  "layerType": "mapLayer"
                },
                {
                  "service": "https://geoservices.knmi.nl/adagucserver?dataset=OBS&",
                  "name": "10M/wind",
                  "format": "image/png",
                  "enabled": false,
                  "layerType": "mapLayer"
                },
                {
                  "service": "https://geoservices.knmi.nl/adagucserver?dataset=OBS&",
                  "name": "10M/gust",
                  "format": "image/png",
                  "enabled": false,
                  "layerType": "mapLayer"
                }
              ],
              "proj": {
                "bbox": {
                  "left": -450651.2255879827,
                  "bottom": 6490531.093143953,
                  "right": 1428345.8183648037,
                  "top": 7438773.776232235
                },
                "srs": "EPSG:3857"
              }
            }
          }
        }
      }
    },
    "mosaicNode": "harmSfcObs"
  },
  {
    "id": "harmEcWmsSingleMapScreenConfig",
    "title": "HARM vs EC (via WMS)",
    "views": {
      "allIds": ["harmEcWms"],
      "byId": {
        "harmEcWms": {
          "title": "HARM vs EC (via WMS)",
          "componentType": "ConfigurableMapWithSlider",
          "initialProps": {
            "mapPreset": {
              "layers": [
                {
                  "service": "https://geoservices.knmi.nl/adagucserver?dataset=HARM_N25&",
                  "name": "wind__at_10m",
                  "format": "image/png",
                  "enabled": true,
                  "layerType": "mapLayer"
                },
                {
                  "service": "https://geoservices.knmi.nl/adagucserver?dataset=HARM_N25&",
                  "name": "air_temperature__at_2m",
                  "format": "image/png",
                  "enabled": true,
                  "layerType": "mapLayer"
                },
                {
                  "service": "https://geoservices.knmi.nl/adagucserver?dataset=HARM_N25&",
                  "name": "cloud_base_altitude",
                  "format": "image/png",
                  "enabled": true,
                  "layerType": "mapLayer"
                },
                {
                  "service": "https://geoservices.knmi.nl/adagucserver?dataset=HARM_N25&",
                  "name": "precipitation_flux",
                  "format": "image/png",
                  "enabled": true,
                  "layerType": "mapLayer"
                }
              ],
              "proj": {
                "bbox": {
                  "left": -450651.2255879827,
                  "bottom": 6490531.093143953,
                  "right": 1428345.8183648037,
                  "top": 7438773.776232235
                },
                "srs": "EPSG:3857"
              }
            }
          }
        }
      }
    },
    "mosaicNode": "harmEcWms"
  },
  {
    "id": "ecEpsSingleMapScreenConfig",
    "title": "EC Surface pressure and EPS",
    "views": {
      "allIds": ["ecEps"],
      "byId": {
        "ecEps": {
          "title": "EC Surface pressure and EPS",
          "componentType": "ConfigurableMapWithSlider",
          "initialProps": {
            "mapPreset": {
              "layers": [
                {
                  "service": "https://eccharts.ecmwf.int/wms/?token=public",
                  "name": "msl_public",
                  "format": "image/png",
                  "enabled": true,
                  "style": "ct_blk_i5_t2",
                  "opacity": 1,
                  "layerType": "mapLayer"
                },
                {
                  "service": "https://eccharts.ecmwf.int/wms/?token=public",
                  "name": "msl_mean_public",
                  "format": "image/png",
                  "enabled": true,
                  "style": "ct_blue_i5_t2",
                  "opacity": 1,
                  "layerType": "mapLayer"
                },
                {
                  "service": "https://eccharts.ecmwf.int/wms/?token=public",
                  "name": "msl_spread_public",
                  "format": "image/png",
                  "enabled": true,
                  "style": "sh_range_f02t50",
                  "opacity": 0.2,
                  "layerType": "mapLayer"
                }
              ],
              "proj": {
                "bbox": {
                  "left": 58703.6377,
                  "bottom": 6408480.4514,
                  "right": 3967387.5161,
                  "top": 11520588.9031
                },
                "srs": "EPSG:3857"
              },
              "toggleTimestepAuto": true,
              "setTimestep": 180
            }
          }
        }
      }
    },
    "mosaicNode": "ecEps"
  },
  {
    "id": "screenConfigRadarTemperature",
    "title": "Radar and temperature",
    "views": {
      "byId": {
        "Radar": {
          "title": "Radar",
          "componentType": "ConfigurableMapWithSlider",
          "initialProps": {
            "mapPreset": {
              "layers": [
                {
                  "service": "https://openwms.fmi.fi/geoserver/wms?",
                  "name": "Radar:suomi_dbz_eureffin",
                  "format": "image/png",
                  "style": "Radar dbz Summer",
                  "enabled": true,
                  "layerType": "mapLayer"
                },
                {
                  "service": "https://public-wms.met.no/verportal/verportal.map?",
                  "name": "radar_precipitation_intensity_nordic",
                  "format": "image/png",
                  "style": "",
                  "enabled": true,
                  "layerType": "mapLayer"
                },
                {
                  "service": "https://geoservices.knmi.nl/wms?dataset=RADAR&",
                  "name": "RAD_NL25_PCP_CM",
                  "format": "image/png",
                  "style": "precip-blue-transparent/nearest",
                  "enabled": true,
                  "layerType": "mapLayer"
                }
              ],
              "proj": {
                "bbox": {
                  "left": 58703.6377,
                  "bottom": 6408480.4514,
                  "right": 3967387.5161,
                  "top": 11520588.9031
                },
                "srs": "EPSG:3857"
              }
            },
            "syncGroupsIds": ["Area_radarTemp", "Time_radarTemp"]
          }
        },
        "Temperature": {
          "title": "Temperature",
          "componentType": "ConfigurableMapWithSlider",
          "initialProps": {
            "mapPreset": {
              "layers": [
                {
                  "service": "https://geoservices.knmi.nl/adagucserver?dataset=OBS&service=WMS&",
                  "name": "10M/ta",
                  "layerType": "mapLayer"
                },
                {
                  "service": "https://eccharts.ecmwf.int/wms/?token=public",
                  "name": "t850_public",
                  "opacity": 0.8,
                  "layerType": "mapLayer"
                }
              ],
              "proj": {
                "bbox": {
                  "left": 58703.6377,
                  "bottom": 6408480.4514,
                  "right": 3967387.5161,
                  "top": 11520588.9031
                },
                "srs": "EPSG:3857"
              }
            },
            "syncGroupsIds": ["Area_radarTemp", "Time_radarTemp"]
          }
        }
      },
      "allIds": ["Radar", "Temperature"]
    },
    "syncGroups": [
      {
        "id": "Area_radarTemp",
        "type": "SYNCGROUPS_TYPE_SETBBOX"
      },
      {
        "id": "Time_radarTemp",
        "type": "SYNCGROUPS_TYPE_SETTIME"
      }
    ],
    "viewType": "multiWindow",
    "mosaicNode": {
      "direction": "row",
      "first": "Radar",
      "second": "Temperature"
    }
  },
  {
    "id": "screenConfigHarmoniePrecipMSLRefTimePresetWithoutMultiMapLayerManager",
    "title": "Precipitation, pressure and wind 1:1",
    "views": {
      "allIds": ["screenRefTime"],
      "byId": {
        "screenRefTime": {
          "title": "Harmonie precipitation, pressure and wind",
          "componentType": "HarmRefTimePreset",
          "initialProps": {
            "layers": [
              {
                "service": "https://geoservices.knmi.nl/wms?DATASET=HARM_N25&",
                "name": "air_pressure_at_sea_level",
                "layerType": "mapLayer"
              },
              {
                "service": "https://geoservices.knmi.nl/wms?DATASET=HARM_N25&",
                "name": "wind__at_10m",
                "layerType": "mapLayer"
              },
              {
                "service": "https://geoservices.knmi.nl/wms?DATASET=HARM_N25&",
                "name": "precipitation_flux",
                "layerType": "mapLayer"
              }
            ],
            "syncGroupsIds": ["areaLayerGroupA", "layerGroupA"]
          }
        }
      }
    },
    "syncGroups": [
      {
        "id": "areaLayerGroupA",
        "type": "SYNCGROUPS_TYPE_SETBBOX"
      },
      {
        "id": "timeLayerGroupA",
        "type": "SYNCGROUPS_TYPE_SETTIME"
      },
      {
        "id": "layerGroupA",
        "type": "SYNCGROUPS_TYPE_SETLAYERACTIONS"
      }
    ],
    "viewType": "tiledWindow",
    "mosaicNode": "screenRefTime"
  },
  {
    "id": "screenConfigHarmoniePrecipMSLRefTimePresetWithMultiMapLayerManager",
    "title": "Precipitation, pressure and wind 1:all",
    "views": {
      "allIds": ["screenRefTimeAll"],
      "byId": {
        "screenRefTimeAll": {
          "title": "Harmonie precipitation, pressure and wind all",
          "componentType": "HarmRefTimePreset",
          "initialProps": {
            "layers": [
              {
                "service": "https://geoservices.knmi.nl/wms?DATASET=HARM_N25&",
                "name": "air_pressure_at_sea_level",
                "layerType": "mapLayer"
              },
              {
                "service": "https://geoservices.knmi.nl/wms?DATASET=HARM_N25&",
                "name": "wind__at_10m",
                "layerType": "mapLayer"
              },
              {
                "service": "https://geoservices.knmi.nl/wms?DATASET=HARM_N25&",
                "name": "precipitation_flux",
                "layerType": "mapLayer"
              }
            ],
            "syncGroupsIds": ["areaLayerGroupA", "layerGroupA"]
          }
        }
      }
    },
    "syncGroups": [
      {
        "id": "areaLayerGroupA",
        "type": "SYNCGROUPS_TYPE_SETBBOX"
      },
      {
        "id": "timeLayerGroupA",
        "type": "SYNCGROUPS_TYPE_SETTIME"
      },
      {
        "id": "layerGroupA",
        "type": "SYNCGROUPS_TYPE_SETLAYERACTIONS"
      }
    ],
    "viewType": "tiledWindow",
    "mosaicNode": "screenRefTimeAll"
  },
  {
    "id": "screenConfigHarmoniePresetWithoutMultiMapLayerManager",
    "title": "Harmonie Temperature and Precipitation 1:1",
    "views": {
      "allIds": ["screenHarm"],
      "byId": {
        "screenHarm": {
          "title": "Harmonie Temperature and Precipitation",
          "componentType": "HarmonieTempAndPrecipPreset",
          "initialProps": {
            "layers": {
              "topRow": {
                "service": "https://geoservices.knmi.nl/wms?DATASET=HARM_N25&",
                "name": "air_temperature__at_2m",
                "id": "layerid_18",
                "layerType": "mapLayer",
                "enabled": true
              },
              "bottomRow": {
                "service": "https://geoservices.knmi.nl/wms?DATASET=HARM_N25&",
                "name": "precipitation_flux",
                "id": "layerid_19",
                "layerType": "mapLayer",
                "enabled": true
              },
              "topRowSyncGroups": [
                "timeLayerGroupA",
                "areaLayerGroupA",
                "layerGroupA"
              ],
              "bottomRowSyncGroups": [
                "timeLayerGroupA",
                "areaLayerGroupA",
                "layerGroupB"
              ]
            }
          }
        }
      }
    },
    "syncGroups": [
      {
        "id": "areaLayerGroupA",
        "type": "SYNCGROUPS_TYPE_SETBBOX"
      },
      {
        "id": "timeLayerGroupA",
        "type": "SYNCGROUPS_TYPE_SETTIME"
      },
      {
        "id": "layerGroupA",
        "type": "SYNCGROUPS_TYPE_SETLAYERACTIONS"
      },
      {
        "id": "layerGroupB",
        "type": "SYNCGROUPS_TYPE_SETLAYERACTIONS"
      }
    ],
    "viewType": "tiledWindow",
    "mosaicNode": "screenHarm"
  },
  {
    "id": "screenConfigHarmoniePresetWithMultiMapLayerManager",
    "title": "Harmonie Temperature and Precipitation 1:all",
    "views": {
      "allIds": ["screenHarmAll"],
      "byId": {
        "screenHarmAll": {
          "title": "Harmonie Temperature and Precipitation all",
          "componentType": "HarmonieTempAndPrecipPreset",
          "initialProps": {
            "layers": {
              "topRow": {
                "service": "https://geoservices.knmi.nl/wms?DATASET=HARM_N25&",
                "name": "air_temperature__at_2m",
                "id": "layerid_18",
                "layerType": "mapLayer",
                "enabled": true
              },
              "bottomRow": {
                "service": "https://geoservices.knmi.nl/wms?DATASET=HARM_N25&",
                "name": "precipitation_flux",
                "id": "layerid_19",
                "layerType": "mapLayer",
                "enabled": true
              },
              "topRowSyncGroups": [
                "timeLayerGroupA",
                "areaLayerGroupA",
                "layerGroupA"
              ],
              "bottomRowSyncGroups": [
                "timeLayerGroupA",
                "areaLayerGroupA",
                "layerGroupB"
              ]
            }
          }
        }
      }
    },
    "syncGroups": [
      {
        "id": "areaLayerGroupA",
        "type": "SYNCGROUPS_TYPE_SETBBOX"
      },
      {
        "id": "timeLayerGroupA",
        "type": "SYNCGROUPS_TYPE_SETTIME"
      },
      {
        "id": "layerGroupA",
        "type": "SYNCGROUPS_TYPE_SETLAYERACTIONS"
      },
      {
        "id": "layerGroupB",
        "type": "SYNCGROUPS_TYPE_SETLAYERACTIONS"
      }
    ],
    "viewType": "tiledWindow",
    "mosaicNode": "screenHarmAll"
  },
  {
    "id": "screenConfigObservations",
    "title": "Observations",
    "views": {
      "allIds": ["Observations"],
      "byId": {
        "Observations": {
          "title": "Observations",
          "componentType": "ConfigurableMultiMapWithSlider",
          "initialProps": {
            "mapPreset": [
              {
                "layers": [
                  {
                    "service": "https://openwms.fmi.fi/geoserver/wms?",
                    "name": "Radar:suomi_dbz_eureffin",
                    "format": "image/png",
                    "style": "Radar dbz Summer",
                    "enabled": true,
                    "layerType": "mapLayer"
                  },
                  {
                    "service": "https://public-wms.met.no/verportal/verportal.map?",
                    "name": "radar_precipitation_intensity_nordic",
                    "format": "image/png",
                    "style": "",
                    "enabled": true,
                    "layerType": "mapLayer"
                  },
                  {
                    "service": "https://geoservices.knmi.nl/wms?dataset=RADAR&",
                    "name": "RAD_NL25_PCP_CM",
                    "format": "image/png",
                    "style": "precip-blue-transparent/nearest",
                    "enabled": true,
                    "layerType": "mapLayer"
                  }
                ],
                "proj": {
                  "bbox": {
                    "left": 58703.6377,
                    "bottom": 6408480.4514,
                    "right": 3967387.5161,
                    "top": 11520588.9031
                  },
                  "srs": "EPSG:3857"
                }
              },
              {
                "layers": [
                  {
                    "service": "https://geoservices.knmi.nl/adagucserver?dataset=OBS&service=WMS&",
                    "name": "10M/ta",
                    "layerType": "mapLayer"
                  },
                  {
                    "service": "https://eccharts.ecmwf.int/wms/?token=public",
                    "name": "t850_public",
                    "opacity": 0.8,
                    "layerType": "mapLayer"
                  }
                ],
                "proj": {
                  "bbox": {
                    "left": 58703.6377,
                    "bottom": 6408480.4514,
                    "right": 3967387.5161,
                    "top": 11520588.9031
                  },
                  "srs": "EPSG:3857"
                }
              },
              {
                "layers": [
                  {
                    "service": "https://eccharts.ecmwf.int/wms/?token=public",
                    "name": "msl_public",
                    "format": "image/png",
                    "style": "ct_blk_i5_t2",
                    "opacity": 1,
                    "enabled": true,
                    "layerType": "mapLayer"
                  },
                  {
                    "service": "https://eccharts.ecmwf.int/wms/?token=public",
                    "name": "msl_mean_public",
                    "format": "image/png",
                    "style": "ct_blue_i5_t2",
                    "opacity": 1,
                    "enabled": true,
                    "layerType": "mapLayer"
                  },
                  {
                    "service": "https://eccharts.ecmwf.int/wms/?token=public",
                    "name": "msl_spread_public",
                    "format": "image/png",
                    "style": "sh_range_f02t50",
                    "opacity": 0.2,
                    "enabled": true,
                    "layerType": "mapLayer"
                  }
                ],
                "proj": {
                  "bbox": {
                    "left": 58703.6377,
                    "bottom": 6408480.4514,
                    "right": 3967387.5161,
                    "top": 11520588.9031
                  },
                  "srs": "EPSG:3857"
                }
              },
              {
                "layers": [
                  {
                    "service": "https://public-wms.met.no/verportal/verportal.map?",
                    "name": "wind_10m_global",
                    "format": "image/png",
                    "style": "",
                    "enabled": true,
                    "layerType": "mapLayer"
                  }
                ],
                "proj": {
                  "bbox": {
                    "left": 58703.6377,
                    "bottom": 6408480.4514,
                    "right": 3967387.5161,
                    "top": 11520588.9031
                  },
                  "srs": "EPSG:3857"
                }
              }
            ],
            "syncGroupsIds": ["Area_Observations", "Time_Observations"]
          }
        }
      }
    },
    "syncGroups": [
      {
        "id": "Area_Observations",
        "type": "SYNCGROUPS_TYPE_SETBBOX"
      },
      {
        "id": "Time_Observations",
        "type": "SYNCGROUPS_TYPE_SETTIME"
      }
    ],
    "viewType": "tiledWindow",
    "mosaicNode": "Observations"
  },
  {
    "id": "defaultTimeseriesPreset",
    "title": "Timeseries",
    "views": {
      "byId": {
        "TimeseriesMap": {
          "title": "TimeseriesMap",
          "componentType": "ConfigurableMapWithSlider",
          "initialProps": {
            "mapPreset": {
              "layers": [],
              "displayMapPin": true,
              "proj": {
                "bbox": {
                  "left": 58703.6377,
                  "bottom": 6408480.4514,
                  "right": 3967387.5161,
                  "top": 11520588.9031
                },
                "srs": "EPSG:3857"
              }
            }
          }
        },
        "Timeseries": {
          "title": "Hirlam forecast from FMI SOFP",
          "componentType": "TimeSeries",
          "initialProps": {
            "plotPreset": {
              "mapId": "TimeseriesMap",
              "plots": [
                {
                  "title": "Plot 1",
                  "plotId": "Plot_1"
                },
                {
                  "title": "Plot 2",
                  "plotId": "Plot_2"
                },
                {
                  "title": "Plot 3",
                  "plotId": "Plot_3"
                }
              ],
              "services": [
                {
                  "parameters": [
                    {
                      "plotId": "Plot_1",
                      "unit": "°C",
                      "propertyName": "Temperature",
                      "plotType": "line"
                    },
                    {
                      "plotId": "Plot_1",
                      "unit": "°C",
                      "propertyName": "DewPoint",
                      "plotType": "line"
                    },
                    {
                      "plotId": "Plot_2",
                      "unit": "%",
                      "propertyName": "Humidity",
                      "plotType": "line"
                    },
                    {
                      "plotId": "Plot_3",
                      "unit": "mm",
                      "propertyName": "Precipitation1h",
                      "plotType": "bar"
                    }
                  ],
                  "serviceUrl": "https://for.weather.fmibeta.com/sofp/collections/hirlam_timeseries/items?f=json&limit=200"
                }
              ]
            }
          }
        }
      },
      "allIds": ["TimeseriesMap", "Timeseries"]
    },
    "viewType": "multiWindow",
    "mosaicNode": {
      "direction": "row",
      "first": "TimeseriesMap",
      "second": "Timeseries"
    }
  },
  {
    "id": "emptyMap",
    "title": "Empty Map",
    "views": {
      "allIds": ["emptyMapView"],
      "byId": {
        "emptyMapView": {
          "title": "Empty Map",
          "componentType": "ConfigurableMapWithSlider",
          "initialProps": {
            "mapPreset": {
              "layers": [],
              "proj": {
                "bbox": {
                  "left": 58703.6377,
                  "bottom": 6408480.4514,
                  "right": 3967387.5161,
                  "top": 11520588.9031
                },
                "srs": "EPSG:3857"
              }
            },
            "syncGroupsIds": []
          }
        }
      }
    },
    "mosaicNode": "emptyMapView",
    "viewType": "singleWindow"
  }
]
