[
  {
    "id": "satcompGeneral3hScreenConfig",
    "title": "Satcomp general 3h",
    "syncGroups": [
      { "id": "Area_satcompGeneral3h", "type": "SYNCGROUPS_TYPE_SETBBOX" },
      { "id": "Time_satcompGeneral3h", "type": "SYNCGROUPS_TYPE_SETTIME" }
    ],
    "views": {
      "byId": {
        "satcompGeneral3hLeft": {
          "title": "HRV Comb 3h",
          "componentType": "ConfigurableMapWithSlider",
          "initialProps": {
            "mapPreset": {
              "layers": [
                {
                  "service": "https://adaguc-server-geoweb.geoweb.knmi.cloud/adagucserver?dataset=OVL",
                  "name": "countries",
                  "layerType": "mapLayer",
                  "style": "yellow_s/polyline"
                },
                {
                  "service": "https://adaguc-server-geoweb.geoweb.knmi.cloud/adagucserver?dataset=OVL",
                  "name": "amsterdam_fir",
                  "layerType": "mapLayer",
                  "style": "yellow_m/polyline"
                },
                {
                  "service": "https://adaguc-server-geoweb.geoweb.knmi.cloud/adagucserver?dataset=OVL",
                  "name": "riverseurope",
                  "layerType": "mapLayer",
                  "style": "blue_s/polyline"
                },
                {
                  "service": "https://adaguc-server-geoweb.geoweb.knmi.cloud/adagucserver?dataset=satcomp",
                  "name": "output_1km_hrv_comb",
                  "layerType": "mapLayer",
                  "enabled": true,
                  "style": "auto/rgba",
                  "id": "satcompHRVComb1k"
                }
              ],
              "activeLayerId": "satcompHRVComb1k",
              "baseLayer": {
                "id": "layerid_4",
                "name": "WorldMap",
                "type": "twms",
                "layerType": "baseLayer",
                "enabled": true
              },
              "proj": {
                "srs": "EPSG:32661",
                "bbox": {
                  "left": -3488964.2796964603,
                  "bottom": -6271301.10537141,
                  "right": 5484118.042808909,
                  "top": 1113711.2729771999
                }
              },
              "animationPayload": { "duration": 180, "interval": 5 },
              "shouldAnimate": true,
              "shouldAutoUpdate": true
            },
            "syncGroupsIds": ["Area_satcompGeneral3h", "Time_satcompGeneral3h"]
          }
        },
        "satcompGeneral3hRight": {
          "title": "Airmass 3h",
          "componentType": "ConfigurableMapWithSlider",
          "initialProps": {
            "mapPreset": {
              "layers": [
                {
                  "service": "https://adaguc-server-geoweb.geoweb.knmi.cloud/adagucserver?dataset=OVL",
                  "name": "countries",
                  "layerType": "mapLayer",
                  "style": "yellow_s/polyline"
                },
                {
                  "service": "https://adaguc-server-geoweb.geoweb.knmi.cloud/adagucserver?dataset=OVL",
                  "name": "amsterdam_fir",
                  "layerType": "mapLayer",
                  "style": "yellow_m/polyline"
                },
                {
                  "service": "https://adaguc-server-geoweb.geoweb.knmi.cloud/adagucserver?dataset=OVL",
                  "name": "riverseurope",
                  "layerType": "mapLayer",
                  "style": "blue_s/polyline"
                },
                {
                  "service": "https://adaguc-server-geoweb.geoweb.knmi.cloud/adagucserver?dataset=satcomp",
                  "name": "output_3km_airmass",
                  "layerType": "mapLayer",
                  "enabled": true,
                  "style": "auto/rgba"
                }
              ],
              "baseLayer": {
                "id": "layerid_4",
                "name": "WorldMap",
                "type": "twms",
                "layerType": "baseLayer",
                "enabled": true
              },
              "proj": {
                "srs": "EPSG:32661",
                "bbox": {
                  "left": -3488964.2796964603,
                  "bottom": -6271301.10537141,
                  "right": 5484118.042808909,
                  "top": 1113711.2729771999
                }
              },
              "animationPayload": { "duration": 180, "interval": 5 }
            },
            "syncGroupsIds": ["Area_satcompGeneral3h", "Time_satcompGeneral3h"]
          }
        }
      },
      "allIds": ["satcompGeneral3hLeft", "satcompGeneral3hRight"]
    },
    "viewType": "multiWindow",
    "mosaicNode": {
      "direction": "row",
      "first": "satcompGeneral3hLeft",
      "second": "satcompGeneral3hRight"
    }
  },
  {
    "id": "satcompGeneral6hScreenConfig",
    "title": "Satcomp general 6h",
    "syncGroups": [
      { "id": "Area_satcompGeneral6h", "type": "SYNCGROUPS_TYPE_SETBBOX" },
      { "id": "Time_satcompGeneral6h", "type": "SYNCGROUPS_TYPE_SETTIME" }
    ],
    "views": {
      "byId": {
        "satcompGeneral6hLeft": {
          "title": "HRV Comb 6h",
          "componentType": "ConfigurableMapWithSlider",
          "initialProps": {
            "mapPreset": {
              "layers": [
                {
                  "service": "https://adaguc-server-geoweb.geoweb.knmi.cloud/adagucserver?dataset=OVL",
                  "name": "countries",
                  "layerType": "mapLayer",
                  "style": "yellow_s/polyline"
                },
                {
                  "service": "https://adaguc-server-geoweb.geoweb.knmi.cloud/adagucserver?dataset=OVL",
                  "name": "amsterdam_fir",
                  "layerType": "mapLayer",
                  "style": "yellow_m/polyline"
                },
                {
                  "service": "https://adaguc-server-geoweb.geoweb.knmi.cloud/adagucserver?dataset=OVL",
                  "name": "riverseurope",
                  "layerType": "mapLayer",
                  "style": "blue_s/polyline"
                },
                {
                  "service": "https://adaguc-server-geoweb.geoweb.knmi.cloud/adagucserver?dataset=satcomp",
                  "name": "output_1km_hrv_comb",
                  "layerType": "mapLayer",
                  "enabled": true,
                  "style": "auto/rgba",
                  "id": "satcompHRVComb1k"
                }
              ],
              "activeLayerId": "satcompHRVComb1k",
              "baseLayer": {
                "id": "layerid_4",
                "name": "WorldMap",
                "type": "twms",
                "layerType": "baseLayer",
                "enabled": true
              },
              "proj": {
                "srs": "EPSG:32661",
                "bbox": {
                  "left": -3488964.2796964603,
                  "bottom": -6271301.10537141,
                  "right": 5484118.042808909,
                  "top": 1113711.2729771999
                }
              },
              "animationPayload": { "duration": 360, "interval": 5 },
              "shouldAnimate": true,
              "shouldAutoUpdate": true
            },
            "syncGroupsIds": ["Area_satcompGeneral6h", "Time_satcompGeneral6h"]
          }
        },
        "satcompGeneral6hRight": {
          "title": "Airmass 6h",
          "componentType": "ConfigurableMapWithSlider",
          "initialProps": {
            "mapPreset": {
              "layers": [
                {
                  "service": "https://adaguc-server-geoweb.geoweb.knmi.cloud/adagucserver?dataset=OVL",
                  "name": "countries",
                  "layerType": "mapLayer",
                  "style": "yellow_s/polyline"
                },
                {
                  "service": "https://adaguc-server-geoweb.geoweb.knmi.cloud/adagucserver?dataset=OVL",
                  "name": "amsterdam_fir",
                  "layerType": "mapLayer",
                  "style": "yellow_m/polyline"
                },
                {
                  "service": "https://adaguc-server-geoweb.geoweb.knmi.cloud/adagucserver?dataset=OVL",
                  "name": "riverseurope",
                  "layerType": "mapLayer",
                  "style": "blue_s/polyline"
                },
                {
                  "service": "https://adaguc-server-geoweb.geoweb.knmi.cloud/adagucserver?dataset=satcomp",
                  "name": "output_3km_airmass",
                  "layerType": "mapLayer",
                  "enabled": true,
                  "style": "auto/rgba"
                }
              ],
              "baseLayer": {
                "id": "layerid_4",
                "name": "WorldMap",
                "type": "twms",
                "layerType": "baseLayer",
                "enabled": true
              },
              "proj": {
                "srs": "EPSG:32661",
                "bbox": {
                  "left": -3488964.2796964603,
                  "bottom": -6271301.10537141,
                  "right": 5484118.042808909,
                  "top": 1113711.2729771999
                }
              },
              "animationPayload": { "duration": 360, "interval": 5 }
            },
            "syncGroupsIds": ["Area_satcompGeneral6h", "Time_satcompGeneral6h"]
          }
        }
      },
      "allIds": ["satcompGeneral6hLeft", "satcompGeneral6hRight"]
    },
    "viewType": "multiWindow",
    "mosaicNode": {
      "direction": "row",
      "first": "satcompGeneral6hLeft",
      "second": "satcompGeneral6hRight"
    }
  },
  {
    "id": "satcompAviation3hScreenConfig",
    "title": "Satcomp Aviation 3h",
    "syncGroups": [
      { "id": "Area_satcompAviation3h", "type": "SYNCGROUPS_TYPE_SETBBOX" },
      { "id": "Time_satcompAviation3h", "type": "SYNCGROUPS_TYPE_SETTIME" }
    ],
    "views": {
      "byId": {
        "satcompAviation3hLeft": {
          "title": "HRV Comb 3h",
          "componentType": "ConfigurableMapWithSlider",
          "initialProps": {
            "mapPreset": {
              "layers": [
                {
                  "service": "https://adaguc-server-geoweb.geoweb.knmi.cloud/adagucserver?dataset=OVL",
                  "name": "countries",
                  "layerType": "mapLayer",
                  "style": "yellow_s/polyline"
                },
                {
                  "service": "https://adaguc-server-geoweb.geoweb.knmi.cloud/adagucserver?dataset=OVL",
                  "name": "amsterdam_fir",
                  "layerType": "mapLayer",
                  "style": "yellow_m/polyline"
                },
                {
                  "service": "https://adaguc-server-geoweb.geoweb.knmi.cloud/adagucserver?dataset=OVL",
                  "name": "riverseurope",
                  "layerType": "mapLayer",
                  "style": "blue_s/polyline"
                },
                {
                  "service": "https://adaguc-server-geoweb.geoweb.knmi.cloud/adagucserver?dataset=satcomp",
                  "name": "output_1km_hrv_comb",
                  "layerType": "mapLayer",
                  "enabled": true,
                  "style": "auto/rgba",
                  "id": "satcompHRVComb1k"
                }
              ],
              "activeLayerId": "satcompHRVComb1k",
              "baseLayer": {
                "id": "layerid_4",
                "name": "WorldMap",
                "type": "twms",
                "layerType": "baseLayer",
                "enabled": true
              },
              "proj": {
                "srs": "EPSG:32661",
                "bbox": {
                  "left": -3488964.2796964603,
                  "bottom": -6271301.10537141,
                  "right": 5484118.042808909,
                  "top": 1113711.2729771999
                }
              },
              "animationPayload": { "duration": 180, "interval": 5 }
            },
            "syncGroupsIds": ["Time_satcompAviation3h"]
          }
        },
        "satcompAviation3hRight": {
          "title": "HRV Comb RSS 3h",
          "componentType": "ConfigurableMapWithSlider",
          "initialProps": {
            "mapPreset": {
              "layers": [
                {
                  "service": "https://adaguc-server-geoweb.geoweb.knmi.cloud/adagucserver?dataset=OVL",
                  "name": "countries",
                  "layerType": "mapLayer",
                  "style": "yellow_s/polyline"
                },
                {
                  "service": "https://adaguc-server-geoweb.geoweb.knmi.cloud/adagucserver?dataset=OVL",
                  "name": "amsterdam_fir",
                  "layerType": "mapLayer",
                  "style": "yellow_m/polyline"
                },
                {
                  "service": "https://adaguc-server-geoweb.geoweb.knmi.cloud/adagucserver?dataset=OVL",
                  "name": "riverseurope",
                  "layerType": "mapLayer",
                  "style": "blue_s/polyline"
                },
                {
                  "service": "https://adaguc-server-geoweb.geoweb.knmi.cloud/adagucserver?dataset=satcomp",
                  "name": "RSS_output_1km_hrv_comb",
                  "layerType": "mapLayer",
                  "enabled": true,
                  "style": "auto/rgba",
                  "id": "satcompHRVCombRSS"
                }
              ],
              "activeLayerId": "satcompHRVCombRSS",
              "baseLayer": {
                "id": "layerid_4",
                "name": "WorldMap",
                "type": "twms",
                "layerType": "baseLayer",
                "enabled": true
              },
              "proj": {
                "srs": "EPSG:3857",
                "bbox": {
                  "left": -450651.2255879827,
                  "bottom": 6393842.957153378,
                  "right": 1428345.8183648037,
                  "top": 7342085.640241
                }
              },
              "animationPayload": { "duration": 180, "interval": 5 },
              "shouldAnimate": true,
              "shouldAutoUpdate": true
            },
            "syncGroupsIds": ["Time_satcompAviation3h"]
          }
        }
      },
      "allIds": ["satcompAviation3hLeft", "satcompAviation3hRight"]
    },
    "viewType": "multiWindow",
    "mosaicNode": {
      "direction": "row",
      "first": "satcompAviation3hLeft",
      "second": "satcompAviation3hRight"
    }
  },
  {
    "id": "satcompAviation6hScreenConfig",
    "title": "Satcomp Aviation 6h",
    "syncGroups": [
      { "id": " Area_satcompAviation6h", "type": "SYNCGROUPS_TYPE_SETBBOX" },
      { "id": "Time_satcompAviation6h", "type": "SYNCGROUPS_TYPE_SETTIME" }
    ],
    "views": {
      "byId": {
        "satcompAviation6hLeft": {
          "title": "HRV Comb 6h",
          "componentType": "ConfigurableMapWithSlider",
          "initialProps": {
            "mapPreset": {
              "layers": [
                {
                  "service": "https://adaguc-server-geoweb.geoweb.knmi.cloud/adagucserver?dataset=OVL",
                  "name": "countries",
                  "layerType": "mapLayer",
                  "style": "yellow_s/polyline"
                },
                {
                  "service": "https://adaguc-server-geoweb.geoweb.knmi.cloud/adagucserver?dataset=OVL",
                  "name": "amsterdam_fir",
                  "layerType": "mapLayer",
                  "style": "yellow_m/polyline"
                },
                {
                  "service": "https://adaguc-server-geoweb.geoweb.knmi.cloud/adagucserver?dataset=OVL",
                  "name": "riverseurope",
                  "layerType": "mapLayer",
                  "style": "blue_s/polyline"
                },
                {
                  "service": "https://adaguc-server-geoweb.geoweb.knmi.cloud/adagucserver?dataset=satcomp",
                  "name": "output_1km_hrv_comb",
                  "layerType": "mapLayer",
                  "enabled": true,
                  "style": "auto/rgba",
                  "id": "satcompHRVComb1k"
                }
              ],
              "activeLayerId": "satcompHRVComb1k",
              "baseLayer": {
                "id": "layerid_4",
                "name": "WorldMap",
                "type": "twms",
                "layerType": "baseLayer",
                "enabled": true
              },
              "proj": {
                "srs": "EPSG:32661",
                "bbox": {
                  "left": -3488964.2796964603,
                  "bottom": -6271301.10537141,
                  "right": 5484118.042808909,
                  "top": 1113711.2729771999
                }
              },
              "animationPayload": { "duration": 360, "interval": 5 }
            },
            "syncGroupsIds": ["Time_satcompAviation6h"]
          }
        },
        "satcompAviation6hRight": {
          "title": "HRV Comb RSS 6h",
          "componentType": "ConfigurableMapWithSlider",
          "initialProps": {
            "mapPreset": {
              "layers": [
                {
                  "service": "https://adaguc-server-geoweb.geoweb.knmi.cloud/adagucserver?dataset=OVL",
                  "name": "countries",
                  "layerType": "mapLayer",
                  "style": "yellow_s/polyline"
                },
                {
                  "service": "https://adaguc-server-geoweb.geoweb.knmi.cloud/adagucserver?dataset=OVL",
                  "name": "amsterdam_fir",
                  "layerType": "mapLayer",
                  "style": "yellow_m/polyline"
                },
                {
                  "service": "https://adaguc-server-geoweb.geoweb.knmi.cloud/adagucserver?dataset=OVL",
                  "name": "riverseurope",
                  "layerType": "mapLayer",
                  "style": "blue_s/polyline"
                },
                {
                  "service": "https://adaguc-server-geoweb.geoweb.knmi.cloud/adagucserver?dataset=satcomp",
                  "name": "RSS_output_1km_hrv_comb",
                  "layerType": "mapLayer",
                  "enabled": true,
                  "style": "auto/rgba",
                  "id": "satcompHRVCombRSS"
                }
              ],
              "activeLayerId": "satcompHRVCombRSS",
              "baseLayer": {
                "id": "layerid_4",
                "name": "WorldMap",
                "type": "twms",
                "layerType": "baseLayer",
                "enabled": true
              },
              "proj": {
                "srs": "EPSG:3857",
                "bbox": {
                  "left": -450651.2255879827,
                  "bottom": 6393842.957153378,
                  "right": 1428345.8183648037,
                  "top": 7342085.640241
                }
              },
              "animationPayload": { "duration": 360, "interval": 5 },
              "shouldAnimate": true,
              "shouldAutoUpdate": true
            },
            "syncGroupsIds": ["Time_satcompAviation6h"]
          }
        }
      },
      "allIds": ["satcompAviation6hLeft", "satcompAviation6hRight"]
    },
    "viewType": "multiWindow",
    "mosaicNode": {
      "direction": "row",
      "first": "satcompAviation6hLeft",
      "second": "satcompAviation6hRight"
    }
  },
  {
    "id": "satcompFogST3hScreenConfig",
    "title": "Satcomp Fog ST 3h",
    "syncGroups": [
      { "id": "Area_satcompFogST3h", "type": "SYNCGROUPS_TYPE_SETBBOX" },
      { "id": "Time_satcompFogST3h", "type": "SYNCGROUPS_TYPE_SETTIME" }
    ],
    "views": {
      "byId": {
        "satcompFogST3hLeft": {
          "title": "HRV Comb RSS 3h",
          "componentType": "ConfigurableMapWithSlider",
          "initialProps": {
            "mapPreset": {
              "layers": [
                {
                  "service": "https://adaguc-server-geoweb.geoweb.knmi.cloud/adagucserver?dataset=OVL",
                  "name": "countries",
                  "layerType": "mapLayer",
                  "style": "yellow_s/polyline"
                },
                {
                  "service": "https://adaguc-server-geoweb.geoweb.knmi.cloud/adagucserver?dataset=OVL",
                  "name": "amsterdam_fir",
                  "layerType": "mapLayer",
                  "style": "yellow_m/polyline"
                },
                {
                  "service": "https://adaguc-server-geoweb.geoweb.knmi.cloud/adagucserver?dataset=OVL",
                  "name": "riverseurope",
                  "layerType": "mapLayer",
                  "style": "blue_s/polyline"
                },
                {
                  "service": "https://adaguc-server-geoweb.geoweb.knmi.cloud/adagucserver?dataset=satcomp",
                  "name": "RSS_output_1km_hrv_comb",
                  "layerType": "mapLayer",
                  "enabled": true,
                  "style": "auto/rgba",
                  "id": "satcompHRVCombRSS"
                }
              ],
              "activeLayerId": "satcompHRVCombRSS",
              "baseLayer": {
                "id": "layerid_4",
                "name": "WorldMap",
                "type": "twms",
                "layerType": "baseLayer",
                "enabled": true
              },
              "proj": {
                "srs": "EPSG:3857",
                "bbox": {
                  "left": -450651.2255879827,
                  "bottom": 6393842.957153378,
                  "right": 1428345.8183648037,
                  "top": 7342085.640241
                }
              },
              "animationPayload": { "duration": 180, "interval": 5 },
              "shouldAnimate": true,
              "shouldAutoUpdate": true
            },
            "syncGroupsIds": ["Time_satcompFogST3h"]
          }
        },
        "satcompFogST3hMiddle": {
          "title": "Fog 3h",
          "componentType": "ConfigurableMapWithSlider",
          "initialProps": {
            "mapPreset": {
              "layers": [
                {
                  "service": "https://adaguc-server-geoweb.geoweb.knmi.cloud/adagucserver?dataset=OVL",
                  "name": "countries",
                  "layerType": "mapLayer",
                  "style": "yellow_s/polyline"
                },
                {
                  "service": "https://adaguc-server-geoweb.geoweb.knmi.cloud/adagucserver?dataset=OVL",
                  "name": "amsterdam_fir",
                  "layerType": "mapLayer",
                  "style": "yellow_m/polyline"
                },
                {
                  "service": "https://adaguc-server-geoweb.geoweb.knmi.cloud/adagucserver?dataset=OVL",
                  "name": "riverseurope",
                  "layerType": "mapLayer",
                  "style": "blue_s/polyline"
                },
                {
                  "service": "https://adaguc-server-geoweb.geoweb.knmi.cloud/adagucserver?dataset=satcomp",
                  "name": "output_3km_fog",
                  "layerType": "mapLayer",
                  "enabled": true,
                  "style": "auto/rgba"
                }
              ],
              "baseLayer": {
                "id": "layerid_4",
                "name": "WorldMap",
                "type": "twms",
                "layerType": "baseLayer",
                "enabled": true
              },
              "proj": {
                "srs": "EPSG:32661",
                "bbox": {
                  "left": -3488964.2796964603,
                  "bottom": -6271301.10537141,
                  "right": 5484118.042808909,
                  "top": 1113711.2729771999
                }
              },
              "animationPayload": { "duration": 180, "interval": 5 }
            },
            "syncGroupsIds": ["Time_satcompFogST3h"]
          }
        },
        "satcompFogST3hRight": {
          "title": "HRV Comb 3h",
          "componentType": "ConfigurableMapWithSlider",
          "initialProps": {
            "mapPreset": {
              "layers": [
                {
                  "service": "https://adaguc-server-geoweb.geoweb.knmi.cloud/adagucserver?dataset=OVL",
                  "name": "countries",
                  "layerType": "mapLayer",
                  "style": "yellow_s/polyline"
                },
                {
                  "service": "https://adaguc-server-geoweb.geoweb.knmi.cloud/adagucserver?dataset=OVL",
                  "name": "amsterdam_fir",
                  "layerType": "mapLayer",
                  "style": "yellow_m/polyline"
                },
                {
                  "service": "https://adaguc-server-geoweb.geoweb.knmi.cloud/adagucserver?dataset=OVL",
                  "name": "riverseurope",
                  "layerType": "mapLayer",
                  "style": "blue_s/polyline"
                },
                {
                  "service": "https://adaguc-server-geoweb.geoweb.knmi.cloud/adagucserver?dataset=satcomp",
                  "name": "output_1km_hrv_comb",
                  "layerType": "mapLayer",
                  "enabled": true,
                  "style": "auto/rgba",
                  "id": "satcompHRVComb1k"
                }
              ],
              "activeLayerId": "satcompHRVComb1k",
              "baseLayer": {
                "id": "layerid_4",
                "name": "WorldMap",
                "type": "twms",
                "layerType": "baseLayer",
                "enabled": true
              },
              "proj": {
                "srs": "EPSG:32661",
                "bbox": {
                  "left": -3488964.2796964603,
                  "bottom": -6271301.10537141,
                  "right": 5484118.042808909,
                  "top": 1113711.2729771999
                }
              },
              "animationPayload": { "duration": 180, "interval": 5 }
            },
            "syncGroupsIds": ["Area_satcompFogST3h", "Time_satcompFogST3h"]
          }
        }
      },
      "allIds": [
        "satcompFogST3hLeft",
        "satcompFogST3hRight",
        "satcompFogST3hMiddle"
      ]
    },
    "viewType": "multiWindow",
    "mosaicNode": {
      "direction": "row",
      "first": "satcompFogST3hLeft",
      "second": {
        "direction": "row",
        "first": "satcompFogST3hMiddle",
        "second": "satcompFogST3hRight"
      },
      "splitPercentage": 33
    }
  },
  {
    "id": "satcompFogST6hScreenConfig",
    "title": "Satcomp Fog ST 6h",
    "syncGroups": [
      { "id": "Area_satcompFogST6h", "type": "SYNCGROUPS_TYPE_SETBBOX" },
      { "id": "Time_satcompFogST6h", "type": "SYNCGROUPS_TYPE_SETTIME" }
    ],
    "views": {
      "byId": {
        "satcompFogST6hLeft": {
          "title": "HRV Comb RSS 6h",
          "componentType": "ConfigurableMapWithSlider",
          "initialProps": {
            "mapPreset": {
              "layers": [
                {
                  "service": "https://adaguc-server-geoweb.geoweb.knmi.cloud/adagucserver?dataset=OVL",
                  "name": "countries",
                  "layerType": "mapLayer",
                  "style": "yellow_s/polyline"
                },
                {
                  "service": "https://adaguc-server-geoweb.geoweb.knmi.cloud/adagucserver?dataset=OVL",
                  "name": "amsterdam_fir",
                  "layerType": "mapLayer",
                  "style": "yellow_m/polyline"
                },
                {
                  "service": "https://adaguc-server-geoweb.geoweb.knmi.cloud/adagucserver?dataset=OVL",
                  "name": "riverseurope",
                  "layerType": "mapLayer",
                  "style": "blue_s/polyline"
                },
                {
                  "service": "https://adaguc-server-geoweb.geoweb.knmi.cloud/adagucserver?dataset=satcomp",
                  "name": "RSS_output_1km_hrv_comb",
                  "layerType": "mapLayer",
                  "enabled": true,
                  "style": "auto/rgba",
                  "id": "satcompHRVCombRSS"
                }
              ],
              "activeLayerId": "satcompHRVCombRSS",
              "baseLayer": {
                "id": "layerid_4",
                "name": "WorldMap",
                "type": "twms",
                "layerType": "baseLayer",
                "enabled": true
              },
              "proj": {
                "srs": "EPSG:3857",
                "bbox": {
                  "left": -450651.2255879827,
                  "bottom": 6393842.957153378,
                  "right": 1428345.8183648037,
                  "top": 7342085.640241
                }
              },
              "animationPayload": { "duration": 360, "interval": 5 },
              "shouldAnimate": true,
              "shouldAutoUpdate": true
            },
            "syncGroupsIds": ["Time_satcompFogST6h"]
          }
        },
        "satcompFogST6hMiddle": {
          "title": "Fog 6h",
          "componentType": "ConfigurableMapWithSlider",
          "initialProps": {
            "mapPreset": {
              "layers": [
                {
                  "service": "https://adaguc-server-geoweb.geoweb.knmi.cloud/adagucserver?dataset=OVL",
                  "name": "countries",
                  "layerType": "mapLayer",
                  "style": "yellow_s/polyline"
                },
                {
                  "service": "https://adaguc-server-geoweb.geoweb.knmi.cloud/adagucserver?dataset=OVL",
                  "name": "amsterdam_fir",
                  "layerType": "mapLayer",
                  "style": "yellow_m/polyline"
                },
                {
                  "service": "https://adaguc-server-geoweb.geoweb.knmi.cloud/adagucserver?dataset=OVL",
                  "name": "riverseurope",
                  "layerType": "mapLayer",
                  "style": "blue_s/polyline"
                },
                {
                  "service": "https://adaguc-server-geoweb.geoweb.knmi.cloud/adagucserver?dataset=satcomp",
                  "name": "output_3km_fog",
                  "layerType": "mapLayer",
                  "enabled": true,
                  "style": "auto/rgba"
                }
              ],
              "baseLayer": {
                "id": "layerid_4",
                "name": "WorldMap",
                "type": "twms",
                "layerType": "baseLayer",
                "enabled": true
              },
              "proj": {
                "srs": "EPSG:32661",
                "bbox": {
                  "left": -3488964.2796964603,
                  "bottom": -6271301.10537141,
                  "right": 5484118.042808909,
                  "top": 1113711.2729771999
                }
              },
              "animationPayload": { "duration": 360, "interval": 5 }
            },
            "syncGroupsIds": ["Time_satcompFogST6h"]
          }
        },
        "satcompFogST6hRight": {
          "title": "HRV Comb 6h",
          "componentType": "ConfigurableMapWithSlider",
          "initialProps": {
            "mapPreset": {
              "layers": [
                {
                  "service": "https://adaguc-server-geoweb.geoweb.knmi.cloud/adagucserver?dataset=OVL",
                  "name": "countries",
                  "layerType": "mapLayer",
                  "style": "yellow_s/polyline"
                },
                {
                  "service": "https://adaguc-server-geoweb.geoweb.knmi.cloud/adagucserver?dataset=OVL",
                  "name": "amsterdam_fir",
                  "layerType": "mapLayer",
                  "style": "yellow_m/polyline"
                },
                {
                  "service": "https://adaguc-server-geoweb.geoweb.knmi.cloud/adagucserver?dataset=OVL",
                  "name": "riverseurope",
                  "layerType": "mapLayer",
                  "style": "blue_s/polyline"
                },
                {
                  "service": "https://adaguc-server-geoweb.geoweb.knmi.cloud/adagucserver?dataset=satcomp",
                  "name": "output_1km_hrv_comb",
                  "layerType": "mapLayer",
                  "enabled": true,
                  "style": "auto/rgba",
                  "id": "satcompHRVComb1k"
                }
              ],
              "activeLayerId": "satcompHRVComb1k",
              "baseLayer": {
                "id": "layerid_4",
                "name": "WorldMap",
                "type": "twms",
                "layerType": "baseLayer",
                "enabled": true
              },
              "proj": {
                "srs": "EPSG:32661",
                "bbox": {
                  "left": -3488964.2796964603,
                  "bottom": -6271301.10537141,
                  "right": 5484118.042808909,
                  "top": 1113711.2729771999
                }
              },
              "animationPayload": { "duration": 360, "interval": 5 }
            },
            "syncGroupsIds": ["Area_satcompFogST6h", "Time_satcompFogST6h"]
          }
        }
      },
      "allIds": [
        "satcompFogST6hLeft",
        "satcompFogST6hRight",
        "satcompFogST6hMiddle"
      ]
    },
    "viewType": "multiWindow",
    "mosaicNode": {
      "direction": "row",
      "first": "satcompFogST6hLeft",
      "second": {
        "direction": "row",
        "first": "satcompFogST6hMiddle",
        "second": "satcompFogST6hRight"
      },
      "splitPercentage": 33
    }
  },
  {
    "id": "satcompVolAsh3hScreenConfig",
    "title": "Satcomp Volcanic Ash 3h",
    "syncGroups": [
      { "id": "Area_satcompVolAsh3h", "type": "SYNCGROUPS_TYPE_SETBBOX" },
      { "id": "Time_satcompVolAsh3h", "type": "SYNCGROUPS_TYPE_SETTIME" }
    ],
    "views": {
      "byId": {
        "satcompVolAsh3hLeft": {
          "title": "Volcanic ash 3h",
          "componentType": "ConfigurableMapWithSlider",
          "initialProps": {
            "mapPreset": {
              "layers": [
                {
                  "service": "https://adaguc-server-geoweb.geoweb.knmi.cloud/adagucserver?dataset=OVL",
                  "name": "countries",
                  "layerType": "mapLayer",
                  "style": "yellow_s/polyline"
                },
                {
                  "service": "https://adaguc-server-geoweb.geoweb.knmi.cloud/adagucserver?dataset=OVL",
                  "name": "amsterdam_fir",
                  "layerType": "mapLayer",
                  "style": "yellow_m/polyline"
                },
                {
                  "service": "https://adaguc-server-geoweb.geoweb.knmi.cloud/adagucserver?dataset=OVL",
                  "name": "riverseurope",
                  "layerType": "mapLayer",
                  "style": "blue_s/polyline"
                },
                {
                  "service": "https://adaguc-server-geoweb.geoweb.knmi.cloud/adagucserver?dataset=satcomp",
                  "name": "output_3km_ash",
                  "layerType": "mapLayer",
                  "enabled": true,
                  "style": "auto/rgba"
                }
              ],
              "baseLayer": {
                "id": "layerid_4",
                "name": "WorldMap",
                "type": "twms",
                "layerType": "baseLayer",
                "enabled": true
              },
              "proj": {
                "srs": "EPSG:32661",
                "bbox": {
                  "left": -3488964.2796964603,
                  "bottom": -6271301.10537141,
                  "right": 5484118.042808909,
                  "top": 1113711.2729771999
                }
              },
              "animationPayload": { "duration": 180, "interval": 5 }
            },
            "syncGroupsIds": ["Area_satcompVolAsh3h", "Time_satcompVolAsh3h"]
          }
        },
        "satcompVolAsh3hRight": {
          "title": "HRV Comb 3h",
          "componentType": "ConfigurableMapWithSlider",
          "initialProps": {
            "mapPreset": {
              "layers": [
                {
                  "service": "https://adaguc-server-geoweb.geoweb.knmi.cloud/adagucserver?dataset=OVL",
                  "name": "countries",
                  "layerType": "mapLayer",
                  "style": "yellow_s/polyline"
                },
                {
                  "service": "https://adaguc-server-geoweb.geoweb.knmi.cloud/adagucserver?dataset=OVL",
                  "name": "amsterdam_fir",
                  "layerType": "mapLayer",
                  "style": "yellow_m/polyline"
                },
                {
                  "service": "https://adaguc-server-geoweb.geoweb.knmi.cloud/adagucserver?dataset=OVL",
                  "name": "riverseurope",
                  "layerType": "mapLayer",
                  "style": "blue_s/polyline"
                },
                {
                  "service": "https://adaguc-server-geoweb.geoweb.knmi.cloud/adagucserver?dataset=satcomp",
                  "name": "output_1km_hrv_comb",
                  "layerType": "mapLayer",
                  "enabled": true,
                  "style": "auto/rgba",
                  "id": "satcompHRVComb1k"
                }
              ],
              "activeLayerId": "satcompHRVComb1k",
              "baseLayer": {
                "id": "layerid_4",
                "name": "WorldMap",
                "type": "twms",
                "layerType": "baseLayer",
                "enabled": true
              },
              "proj": {
                "srs": "EPSG:32661",
                "bbox": {
                  "left": -3488964.2796964603,
                  "bottom": -6271301.10537141,
                  "right": 5484118.042808909,
                  "top": 1113711.2729771999
                }
              },
              "animationPayload": { "duration": 180, "interval": 5 },
              "shouldAnimate": true,
              "shouldAutoUpdate": true
            },
            "syncGroupsIds": ["Area_satcompVolAsh3h", "Time_satcompVolAsh3h"]
          }
        }
      },
      "allIds": ["satcompVolAsh3hLeft", "satcompVolAsh3hRight"]
    },
    "viewType": "multiWindow",
    "mosaicNode": {
      "direction": "row",
      "first": "satcompVolAsh3hLeft",
      "second": "satcompVolAsh3hRight"
    }
  },
  {
    "id": "satcompVolAsh6hScreenConfig",
    "title": "Satcomp Volcanic Ash 6h",
    "syncGroups": [
      { "id": "Area_satcompVolAsh6h", "type": "SYNCGROUPS_TYPE_SETBBOX" },
      { "id": "Time_satcompVolAsh6h", "type": "SYNCGROUPS_TYPE_SETTIME" }
    ],
    "views": {
      "byId": {
        "satcompVolAsh6hLeft": {
          "title": "Volcanic ash 6h",
          "componentType": "ConfigurableMapWithSlider",
          "initialProps": {
            "mapPreset": {
              "layers": [
                {
                  "service": "https://adaguc-server-geoweb.geoweb.knmi.cloud/adagucserver?dataset=OVL",
                  "name": "countries",
                  "layerType": "mapLayer",
                  "style": "yellow_s/polyline"
                },
                {
                  "service": "https://adaguc-server-geoweb.geoweb.knmi.cloud/adagucserver?dataset=OVL",
                  "name": "amsterdam_fir",
                  "layerType": "mapLayer",
                  "style": "yellow_m/polyline"
                },
                {
                  "service": "https://adaguc-server-geoweb.geoweb.knmi.cloud/adagucserver?dataset=OVL",
                  "name": "riverseurope",
                  "layerType": "mapLayer",
                  "style": "blue_s/polyline"
                },
                {
                  "service": "https://adaguc-server-geoweb.geoweb.knmi.cloud/adagucserver?dataset=satcomp",
                  "name": "output_3km_ash",
                  "layerType": "mapLayer",
                  "enabled": true,
                  "style": "auto/rgba"
                }
              ],
              "baseLayer": {
                "id": "layerid_4",
                "name": "WorldMap",
                "type": "twms",
                "layerType": "baseLayer",
                "enabled": true
              },
              "proj": {
                "srs": "EPSG:32661",
                "bbox": {
                  "left": -3488964.2796964603,
                  "bottom": -6271301.10537141,
                  "right": 5484118.042808909,
                  "top": 1113711.2729771999
                }
              },
              "animationPayload": { "duration": 360, "interval": 5 }
            },
            "syncGroupsIds": ["Area_satcompVolAsh6h", "Time_satcompVolAsh6h"]
          }
        },
        "satcompVolAsh6hRight": {
          "title": "HRV Comb 6h",
          "componentType": "ConfigurableMapWithSlider",
          "initialProps": {
            "mapPreset": {
              "layers": [
                {
                  "service": "https://adaguc-server-geoweb.geoweb.knmi.cloud/adagucserver?dataset=OVL",
                  "name": "countries",
                  "layerType": "mapLayer",
                  "style": "yellow_s/polyline"
                },
                {
                  "service": "https://adaguc-server-geoweb.geoweb.knmi.cloud/adagucserver?dataset=OVL",
                  "name": "amsterdam_fir",
                  "layerType": "mapLayer",
                  "style": "yellow_m/polyline"
                },
                {
                  "service": "https://adaguc-server-geoweb.geoweb.knmi.cloud/adagucserver?dataset=OVL",
                  "name": "riverseurope",
                  "layerType": "mapLayer",
                  "style": "blue_s/polyline"
                },
                {
                  "service": "https://adaguc-server-geoweb.geoweb.knmi.cloud/adagucserver?dataset=satcomp",
                  "name": "output_1km_hrv_comb",
                  "layerType": "mapLayer",
                  "enabled": true,
                  "style": "auto/rgba",
                  "id": "satcompHRVComb1k"
                }
              ],
              "activeLayerId": "satcompHRVComb1k",
              "baseLayer": {
                "id": "layerid_4",
                "name": "WorldMap",
                "type": "twms",
                "layerType": "baseLayer",
                "enabled": true
              },
              "proj": {
                "srs": "EPSG:32661",
                "bbox": {
                  "left": -3488964.2796964603,
                  "bottom": -6271301.10537141,
                  "right": 5484118.042808909,
                  "top": 1113711.2729771999
                }
              },
              "animationPayload": { "duration": 360, "interval": 5 },
              "shouldAnimate": true,
              "shouldAutoUpdate": true
            },
            "syncGroupsIds": ["Area_satcompVolAsh6h", "Time_satcompVolAsh6h"]
          }
        }
      },
      "allIds": ["satcompVolAsh6hLeft", "satcompVolAsh6hRight"]
    },
    "viewType": "multiWindow",
    "mosaicNode": {
      "direction": "row",
      "first": "satcompVolAsh6hLeft",
      "second": "satcompVolAsh6hRight"
    }
  },
  {
    "id": "satcompDust3hScreenConfig",
    "title": "Satcomp Dust 3h",
    "syncGroups": [
      { "id": "Area_satcompDust3h", "type": "SYNCGROUPS_TYPE_SETBBOX" },
      { "id": "Time_satcompDust3h", "type": "SYNCGROUPS_TYPE_SETTIME" }
    ],
    "views": {
      "byId": {
        "satcompDust3hLeft": {
          "title": "Dust 3h",
          "componentType": "ConfigurableMapWithSlider",
          "initialProps": {
            "mapPreset": {
              "layers": [
                {
                  "service": "https://adaguc-server-geoweb.geoweb.knmi.cloud/adagucserver?dataset=OVL",
                  "name": "countries",
                  "layerType": "mapLayer",
                  "style": "yellow_s/polyline"
                },
                {
                  "service": "https://adaguc-server-geoweb.geoweb.knmi.cloud/adagucserver?dataset=OVL",
                  "name": "amsterdam_fir",
                  "layerType": "mapLayer",
                  "style": "yellow_m/polyline"
                },
                {
                  "service": "https://adaguc-server-geoweb.geoweb.knmi.cloud/adagucserver?dataset=OVL",
                  "name": "riverseurope",
                  "layerType": "mapLayer",
                  "style": "blue_s/polyline"
                },
                {
                  "service": "https://adaguc-server-geoweb.geoweb.knmi.cloud/adagucserver?dataset=satcomp",
                  "name": "output_3km_dust",
                  "layerType": "mapLayer",
                  "enabled": true,
                  "style": "auto/rgba"
                }
              ],
              "baseLayer": {
                "id": "layerid_4",
                "name": "WorldMap",
                "type": "twms",
                "layerType": "baseLayer",
                "enabled": true
              },
              "proj": {
                "srs": "EPSG:32661",
                "bbox": {
                  "left": -3488964.2796964603,
                  "bottom": -6271301.10537141,
                  "right": 5484118.042808909,
                  "top": 1113711.2729771999
                }
              },
              "animationPayload": { "duration": 180, "interval": 5 }
            },
            "syncGroupsIds": ["Area_satcompDust3h", "Time_satcompDust3h"]
          }
        },
        "satcompDust3hRight": {
          "title": "HRV Comb 3h",
          "componentType": "ConfigurableMapWithSlider",
          "initialProps": {
            "mapPreset": {
              "layers": [
                {
                  "service": "https://adaguc-server-geoweb.geoweb.knmi.cloud/adagucserver?dataset=OVL",
                  "name": "countries",
                  "layerType": "mapLayer",
                  "style": "yellow_s/polyline"
                },
                {
                  "service": "https://adaguc-server-geoweb.geoweb.knmi.cloud/adagucserver?dataset=OVL",
                  "name": "amsterdam_fir",
                  "layerType": "mapLayer",
                  "style": "yellow_m/polyline"
                },
                {
                  "service": "https://adaguc-server-geoweb.geoweb.knmi.cloud/adagucserver?dataset=OVL",
                  "name": "riverseurope",
                  "layerType": "mapLayer",
                  "style": "blue_s/polyline"
                },
                {
                  "service": "https://adaguc-server-geoweb.geoweb.knmi.cloud/adagucserver?dataset=satcomp",
                  "name": "output_1km_hrv_comb",
                  "layerType": "mapLayer",
                  "enabled": true,
                  "style": "auto/rgba",
                  "id": "satcompHRVComb1k"
                }
              ],
              "activeLayerId": "satcompHRVComb1k",
              "baseLayer": {
                "id": "layerid_4",
                "name": "WorldMap",
                "type": "twms",
                "layerType": "baseLayer",
                "enabled": true
              },
              "proj": {
                "srs": "EPSG:32661",
                "bbox": {
                  "left": -3488964.2796964603,
                  "bottom": -6271301.10537141,
                  "right": 5484118.042808909,
                  "top": 1113711.2729771999
                }
              },
              "animationPayload": { "duration": 180, "interval": 5 },
              "shouldAnimate": true,
              "shouldAutoUpdate": true
            },
            "syncGroupsIds": ["Area_satcompDust3h", "Time_satcompDust3h"]
          }
        }
      },
      "allIds": ["satcompDust3hLeft", "satcompDust3hRight"]
    },
    "viewType": "multiWindow",
    "mosaicNode": {
      "direction": "row",
      "first": "satcompDust3hLeft",
      "second": "satcompDust3hRight"
    }
  },
  {
    "id": "satcompDust6hScreenConfig",
    "title": "Satcomp Dust 6h",
    "syncGroups": [
      { "id": "Area_satcompDust6h", "type": "SYNCGROUPS_TYPE_SETBBOX" },
      { "id": "Time_satcompDust6h", "type": "SYNCGROUPS_TYPE_SETTIME" }
    ],
    "views": {
      "byId": {
        "satcompDust6hLeft": {
          "title": "Dust 6h",
          "componentType": "ConfigurableMapWithSlider",
          "initialProps": {
            "mapPreset": {
              "layers": [
                {
                  "service": "https://adaguc-server-geoweb.geoweb.knmi.cloud/adagucserver?dataset=OVL",
                  "name": "countries",
                  "layerType": "mapLayer",
                  "style": "yellow_s/polyline"
                },
                {
                  "service": "https://adaguc-server-geoweb.geoweb.knmi.cloud/adagucserver?dataset=OVL",
                  "name": "amsterdam_fir",
                  "layerType": "mapLayer",
                  "style": "yellow_m/polyline"
                },
                {
                  "service": "https://adaguc-server-geoweb.geoweb.knmi.cloud/adagucserver?dataset=OVL",
                  "name": "riverseurope",
                  "layerType": "mapLayer",
                  "style": "blue_s/polyline"
                },
                {
                  "service": "https://adaguc-server-geoweb.geoweb.knmi.cloud/adagucserver?dataset=satcomp",
                  "name": "output_3km_dust",
                  "layerType": "mapLayer",
                  "enabled": true,
                  "style": "auto/rgba"
                }
              ],
              "baseLayer": {
                "id": "layerid_4",
                "name": "WorldMap",
                "type": "twms",
                "layerType": "baseLayer",
                "enabled": true
              },
              "proj": {
                "srs": "EPSG:32661",
                "bbox": {
                  "left": -3488964.2796964603,
                  "bottom": -6271301.10537141,
                  "right": 5484118.042808909,
                  "top": 1113711.2729771999
                }
              },
              "animationPayload": { "duration": 360, "interval": 5 }
            },
            "syncGroupsIds": ["Area_satcompDust6h", "Time_satcompDust6h"]
          }
        },
        "satcompDust6hRight": {
          "title": "HRV Comb 6h",
          "componentType": "ConfigurableMapWithSlider",
          "initialProps": {
            "mapPreset": {
              "layers": [
                {
                  "service": "https://adaguc-server-geoweb.geoweb.knmi.cloud/adagucserver?dataset=OVL",
                  "name": "countries",
                  "layerType": "mapLayer",
                  "style": "yellow_s/polyline"
                },
                {
                  "service": "https://adaguc-server-geoweb.geoweb.knmi.cloud/adagucserver?dataset=OVL",
                  "name": "amsterdam_fir",
                  "layerType": "mapLayer",
                  "style": "yellow_m/polyline"
                },
                {
                  "service": "https://adaguc-server-geoweb.geoweb.knmi.cloud/adagucserver?dataset=OVL",
                  "name": "riverseurope",
                  "layerType": "mapLayer",
                  "style": "blue_s/polyline"
                },
                {
                  "service": "https://adaguc-server-geoweb.geoweb.knmi.cloud/adagucserver?dataset=satcomp",
                  "name": "output_1km_hrv_comb",
                  "layerType": "mapLayer",
                  "enabled": true,
                  "style": "auto/rgba",
                  "id": "satcompHRVComb1k"
                }
              ],
              "activeLayerId": "satcompHRVComb1k",
              "baseLayer": {
                "id": "layerid_4",
                "name": "WorldMap",
                "type": "twms",
                "layerType": "baseLayer",
                "enabled": true
              },
              "proj": {
                "srs": "EPSG:32661",
                "bbox": {
                  "left": -3488964.2796964603,
                  "bottom": -6271301.10537141,
                  "right": 5484118.042808909,
                  "top": 1113711.2729771999
                }
              },
              "animationPayload": { "duration": 360, "interval": 5 },
              "shouldAnimate": true,
              "shouldAutoUpdate": true
            },
            "syncGroupsIds": ["Area_satcompDust6h", "Time_satcompDust6h"]
          }
        }
      },
      "allIds": ["satcompDust6hLeft", "satcompDust6hRight"]
    },
    "viewType": "multiWindow",
    "mosaicNode": {
      "direction": "row",
      "first": "satcompDust6hLeft",
      "second": "satcompDust6hRight"
    }
  }
]
