{
  "fileServerFolder": ".",
  "fixturesFolder": "./src/fixtures",
  "integrationFolder": "./src/integration",
  "modifyObstructiveCode": false,
  "supportFile": "./src/support/index.ts",
  "pluginsFile": false,
  "video": true,
  "videosFolder": "../../dist/cypress/apps/atmos-poc-e2e/videos",
  "screenshotsFolder": "../../dist/cypress/apps/atmos-poc-e2e/screenshots",
  "chromeWebSecurity": false
}
