{
  "objectName": "Waddeneilanden",
  "scope": "global",
  "keywords": "NL,KNMI Specific",
  "geoJSON": {
    "type": "FeatureCollection",
    "name": "waddeneilanden",
    "crs": {
      "type": "name",
      "properties": {
        "name": "urn:ogc:def:crs:OGC:1.3:CRS84"
      }
    },
    "features": [
      {
        "type": "Feature",
        "properties": {
          "id": "12",
          "gid": 12,
          "provincienaam": "Waddeneilanden",
          "fill":"#4B18FF",
          "fill-opacity":0.5,
          "stroke":"#4B18FF",
          "stroke-opacity":1.0,
          "stroke-width":2
        },
        "geometry": {
          "type": "Polygon",
          "coordinates": [
            [
              [
                6.435338160648664,
                53.56597783029337
              ],
              [
                6.612607863874832,
                53.564308182448059
              ],
              [
                6.637131608867202,
                53.576423270973919
              ],
              [
                6.66635181768039,
                53.561066610391443
              ],
              [
                6.5884,
                53.5381
              ],
              [
                6.5005,
                53.5362
              ],
              [
                6.4013,
                53.5161
              ],
              [
                6.3321,
                53.5001
              ],
              [
                6.2458,
                53.4774
              ],
              [
                6.1631,
                53.4733
              ],
              [
                6.1333,
                53.4547
              ],
              [
                6.114,
                53.4654
              ],
              [
                6.0387,
                53.4434
              ],
              [
                5.9596,
                53.4594
              ],
              [
                5.9039,
                53.4581
              ],
              [
                5.8026,
                53.4375
              ],
              [
                5.7271,
                53.4436
              ],
              [
                5.6816,
                53.4243
              ],
              [
                5.6299,
                53.4305
              ],
              [
                5.6091,
                53.449
              ],
              [
                5.5713,
                53.4434
              ],
              [
                5.4778,
                53.4204
              ],
              [
                5.4596,
                53.4057
              ],
              [
                5.3781,
                53.4071
              ],
              [
                5.3434,
                53.387
              ],
              [
                5.2939,
                53.374
              ],
              [
                5.2623,
                53.3742
              ],
              [
                5.2272,
                53.3683
              ],
              [
                5.184,
                53.3438
              ],
              [
                5.1586,
                53.3499
              ],
              [
                5.0971,
                53.3076
              ],
              [
                5.0954,
                53.2967
              ],
              [
                5.0691,
                53.2965
              ],
              [
                5.0356,
                53.2825
              ],
              [
                4.9703,
                53.2671
              ],
              [
                4.9839,
                53.2533
              ],
              [
                4.9395,
                53.2357
              ],
              [
                4.9184,
                53.2163
              ],
              [
                4.8874,
                53.2195
              ],
              [
                4.8542,
                53.1882
              ],
              [
                4.879,
                53.1602
              ],
              [
                4.9025,
                53.1417
              ],
              [
                4.8939,
                53.0808
              ],
              [
                4.848,
                53.0329
              ],
              [
                4.8188,
                53.0297
              ],
              [
                4.7891,
                53.0029
              ],
              [
                4.757,
                52.9967
              ],
              [
                4.755929639600257,
                52.969998564668266
              ],
              [
                4.644654089225724,
                52.942006710648883
              ],
              [
                4.613329455836052,
                52.960973019525305
              ],
              [
                4.613000600913399,
                52.979483278608789
              ],
              [
                4.687076738104963,
                53.002406178000832
              ],
              [
                4.686353229574998,
                53.047333866476784
              ],
              [
                4.715549918254522,
                53.087939350817805
              ],
              [
                4.818788948979371,
                53.182826474040702
              ],
              [
                4.818375719542797,
                53.214274793610038
              ],
              [
                4.840601493896656,
                53.23234946567009
              ],
              [
                4.907689840695929,
                53.259592891829548
              ],
              [
                5.027117206182639,
                53.313922641089064
              ],
              [
                5.087068925720035,
                53.323072484022745
              ],
              [
                5.101778301229778,
                53.368034278315669
              ],
              [
                5.161774221397536,
                53.386131724273866
              ],
              [
                5.176693205809005,
                53.408621252131539
              ],
              [
                5.357118952221548,
                53.431263557653516
              ],
              [
                5.552855804638939,
                53.471584856901806
              ],
              [
                5.613209200241766,
                53.493948560537973
              ],
              [
                5.703442561037901,
                53.471283620940852
              ],
              [
                5.839015292115441,
                53.475343907844575
              ],
              [
                5.959611797489944,
                53.483816292866344
              ],
              [
                6.00492851146347,
                53.492577463650299
              ],
              [
                6.0501246982537,
                53.492337372945009
              ],
              [
                6.110461129669016,
                53.496482940596074
              ],
              [
                6.125992280638432,
                53.523343617253474
              ],
              [
                6.186128094180111,
                53.513975269492178
              ],
              [
                6.322071497950349,
                53.526475656654107
              ],
              [
                6.352528041688637,
                53.539713416137701
              ],
              [
                6.428587646675005,
                53.566036264003245
              ],
              [
                6.435338160648664,
                53.56597783029337
              ]
            ]
          ]
        }
      }
    ]
  }
}
