{
  "objectName": "Theems",
  "scope": "global",
  "keywords": "NL,North Sea districts",
  "geoJSON": {
    "type": "FeatureCollection",
    "name": "theems",
    "crs": {
      "type": "name",
      "properties": {
        "name": "urn:ogc:def:crs:OGC:1.3:CRS84"
      }
    },
    "features": [
      {
        "type": "Feature",
        "properties": {
          "name": "Theems",
          "fill":"#4B18FF",
          "fill-opacity":0.5,
          "stroke":"#4B18FF",
          "stroke-opacity":1.0,
          "stroke-width":2
        },
        "geometry": {
          "type": "Polygon",
          "coordinates": [
            [
              [
                2.0,
                52.75
              ],
              [
                4.6,
                52.75
              ],
              [
                2.8,
                51.25
              ],
              [
                1.36,
                51.25
              ],
              [
                2.0,
                52.75
              ]
            ]
          ]
        }
      }
    ]
  }
}
