{
  "objectName": "Zuid-Holland",
  "scope": "global",
  "keywords": "NL,Provinces",
  "geoJSON": {
    "type": "FeatureCollection",
    "features": [
      {
        "type": "Feature",
        "properties": {
          "fill": "#4B18FF",
          "fill-opacity": 0.5,
          "stroke": "#4B18FF",
          "stroke-opacity": 1,
          "stroke-width": 2,
          "selectionType": "poly"
        },
        "geometry": {
          "type": "Polygon",
          "coordinates": [
            [
              [
                4.110164075952056,
                52.00443650358239
              ],
              [
                4.032776826481483,
                52.0035712684069
              ],
              [
                3.953130875831724,
                51.98914354588207
              ],
              [
                3.940749522930179,
                51.921571139324385
              ],
              [
                3.972617445119628,
                51.91096495541641
              ],
              [
                3.95314682158292,
                51.85003185556172
              ],
              [
                3.860366796888848,
                51.828363606800615
              ],
              [
                3.773675345120725,
                51.78152047827931
              ],
              [
                3.826212601617971,
                51.76584104908727
              ],
              [
                3.8474281904221,
                51.75340101330751
              ],
              [
                3.875894347575464,
                51.74769206834314
              ],
              [
                3.886170625148256,
                51.74935849846188
              ],
              [
                3.905056993652656,
                51.76463442434868
              ],
              [
                3.921443465451218,
                51.770744775705495
              ],
              [
                3.940329676967175,
                51.773799947565124
              ],
              [
                3.958938003821526,
                51.77213343791173
              ],
              [
                3.974491327492621,
                51.76380098692387
              ],
              [
                4.013336251592603,
                51.759011840312304
              ],
              [
                4.018884952763966,
                51.74271775651072
              ],
              [
                4.026258155388194,
                51.73830883889761
              ],
              [
                4.035037756891598,
                51.73019358885665
              ],
              [
                4.036703941868468,
                51.71102922210162
              ],
              [
                4.040036764965286,
                51.7026968035844
              ],
              [
                4.047813346447623,
                51.694364407963796
              ],
              [
                4.098083805142505,
                51.69047587207376
              ],
              [
                4.11002649203032,
                51.68714291038097
              ],
              [
                4.123080127461564,
                51.68575409917287
              ],
              [
                4.151824517744555,
                51.68523312469486
              ],
              [
                4.193764111549876,
                51.66439927396384
              ],
              [
                4.242786202359671,
                51.64706300245336
              ],
              [
                4.275002699967221,
                51.64377788724587
              ],
              [
                4.332549787062406,
                51.653749259574326
              ],
              [
                4.361693250636804,
                51.66291646271265
              ],
              [
                4.374455695606056,
                51.671998692081154
              ],
              [
                4.378843411237823,
                51.6781671302735
              ],
              [
                4.379431108082684,
                51.683591554608725
              ],
              [
                4.393621155328045,
                51.69329622197776
              ],
              [
                4.423549727577674,
                51.709474841912574
              ],
              [
                4.50043078067044,
                51.69290411587819
              ],
              [
                4.514917269048115,
                51.6924735603383
              ],
              [
                4.542469880464878,
                51.69482386938327
              ],
              [
                4.589299877697373,
                51.703323093763665
              ],
              [
                4.617063042363953,
                51.713450544698766
              ],
              [
                4.675222591695757,
                51.72420939039605
              ],
              [
                4.681597589101822,
                51.72841872802829
              ],
              [
                4.693262894328346,
                51.732281626147056
              ],
              [
                4.717281335345218,
                51.743819054640845
              ],
              [
                4.736630793974386,
                51.75556837949224
              ],
              [
                4.744788205733937,
                51.76348743164607
              ],
              [
                4.750568881008353,
                51.7757615055616
              ],
              [
                4.755239671168642,
                51.78161140553361
              ],
              [
                4.765433700203797,
                51.78936310642584
              ],
              [
                4.773539017784475,
                51.793324335789556
              ],
              [
                4.797194138180009,
                51.79976996464423
              ],
              [
                4.806875681322408,
                51.800336286486086
              ],
              [
                4.836108440957887,
                51.79783909669762
              ],
              [
                4.845984335976475,
                51.798756955855154
              ],
              [
                4.859667267153295,
                51.80268434607915
              ],
              [
                4.889400948115378,
                51.8188950153433
              ],
              [
                4.911273500720934,
                51.825981781049705
              ],
              [
                4.92272846876005,
                51.828072479459216
              ],
              [
                4.936064116271525,
                51.82831449956043
              ],
              [
                4.987756923750402,
                51.821059363558106
              ],
              [
                5.008280644492098,
                51.82101944378482
              ],
              [
                5.02635176676337,
                51.81885673991692
              ],
              [
                5.0314150015857,
                51.841084802418244
              ],
              [
                4.999296319520615,
                51.84459988083365
              ],
              [
                4.998483116134643,
                51.85445273495402
              ],
              [
                4.994095428201885,
                51.86136426178563
              ],
              [
                5.006974839710074,
                51.857860047785394
              ],
              [
                5.043734655703723,
                51.85922991703327
              ],
              [
                5.053508541106293,
                51.85736317397644
              ],
              [
                5.062358152453464,
                51.85936205362705
              ],
              [
                5.06306028126499,
                51.861860183484545
              ],
              [
                5.052198839889443,
                51.86664300884488
              ],
              [
                5.05361408041046,
                51.8718976671706
              ],
              [
                5.062372756253096,
                51.874317769732556
              ],
              [
                5.073658695193276,
                51.8740390119611
              ],
              [
                5.080532403703822,
                51.8755247269218
              ],
              [
                5.086339589708939,
                51.880768964975886
              ],
              [
                5.088159412984975,
                51.88709435830094
              ],
              [
                5.090974556623528,
                51.88897642816434
              ],
              [
                5.112736806283495,
                51.88777617992664
              ],
              [
                5.117671295106713,
                51.892569902084865
              ],
              [
                5.118498764202482,
                51.89637768620635
              ],
              [
                5.116947868134779,
                51.8981040140697
              ],
              [
                5.119408863265156,
                51.89860526182493
              ],
              [
                5.132277545899579,
                51.91488175936804
              ],
              [
                5.136435753022019,
                51.91450842819225
              ],
              [
                5.135674745403953,
                51.918222742415885
              ],
              [
                5.148459847748613,
                51.929485190584096
              ],
              [
                5.147963229906776,
                51.93215495624831
              ],
              [
                5.149437441712074,
                51.93352697535099
              ],
              [
                5.1333520075923,
                51.93775463707281
              ],
              [
                5.13013804455382,
                51.93491165190064
              ],
              [
                5.088842838738999,
                51.95000486661349
              ],
              [
                5.054458603633468,
                51.954791382892274
              ],
              [
                5.058467399411898,
                51.9605537056365
              ],
              [
                5.064642369728175,
                51.964591010685076
              ],
              [
                5.054383803487148,
                51.97658548732319
              ],
              [
                5.048842404280942,
                51.97406003187942
              ],
              [
                5.047794442858709,
                51.9765576977427
              ],
              [
                5.043011249101522,
                51.97766175500906
              ],
              [
                5.040402204349415,
                51.9774436267203
              ],
              [
                5.037775260301771,
                51.972717301865515
              ],
              [
                5.034054578106439,
                51.97017031924885
              ],
              [
                5.027243432005463,
                51.96916008190874
              ],
              [
                5.017768551558927,
                51.971366664234104
              ],
              [
                5.00300951070768,
                51.97813823486772
              ],
              [
                4.998073523291359,
                51.977871504878
              ],
              [
                4.98804536138632,
                51.97399285078855
              ],
              [
                4.975436107640151,
                51.96288589649896
              ],
              [
                4.968288606561994,
                51.95937716592537
              ],
              [
                4.948691208629904,
                51.963471750338165
              ],
              [
                4.93982050789964,
                51.963439960753206
              ],
              [
                4.934563140143914,
                51.96061073144328
              ],
              [
                4.924493712189521,
                51.94894594740373
              ],
              [
                4.916379881931722,
                51.94317845316256
              ],
              [
                4.877792920155551,
                51.93803067558324
              ],
              [
                4.871222881982648,
                51.95464349499806
              ],
              [
                4.86080596262244,
                51.96778403013042
              ],
              [
                4.845621868218755,
                51.97498493211975
              ],
              [
                4.834106221869275,
                51.98559238812291
              ],
              [
                4.835217848184347,
                51.98614302050801
              ],
              [
                4.817805905521933,
                51.99976688905375
              ],
              [
                4.857126556382688,
                52.005959507987875
              ],
              [
                4.8474809326353,
                52.01771510400933
              ],
              [
                4.824994256849426,
                52.01723660891756
              ],
              [
                4.815616228006649,
                52.0139807264924
              ],
              [
                4.803523202820685,
                52.01395615945559
              ],
              [
                4.798700208048443,
                52.02227172806321
              ],
              [
                4.809933419604721,
                52.02676451715629
              ],
              [
                4.80670437012654,
                52.03316730157611
              ],
              [
                4.811822228051363,
                52.03382451107384
              ],
              [
                4.817192930196525,
                52.036931096710745
              ],
              [
                4.829490283666749,
                52.049813400239636
              ],
              [
                4.848048500015045,
                52.0581646847532
              ],
              [
                4.855970528981325,
                52.059064909027576
              ],
              [
                4.867858338946211,
                52.06305408882083
              ],
              [
                4.873200411814841,
                52.068745393147665
              ],
              [
                4.842203785799458,
                52.069005587975305
              ],
              [
                4.829807903191165,
                52.066823402842935
              ],
              [
                4.83403538854582,
                52.07273585029401
              ],
              [
                4.83266586141244,
                52.0728437167819
              ],
              [
                4.833045259568267,
                52.07482692983456
              ],
              [
                4.826275687671344,
                52.07464357557839
              ],
              [
                4.823347903181683,
                52.09336852616911
              ],
              [
                4.823055886140569,
                52.10519280467351
              ],
              [
                4.825379801010069,
                52.10708718781171
              ],
              [
                4.792042722601032,
                52.122311683160305
              ],
              [
                4.79834161683514,
                52.12529872571625
              ],
              [
                4.802600843089516,
                52.12505975281998
              ],
              [
                4.807766095660114,
                52.12862189091895
              ],
              [
                4.808882165372829,
                52.131887744378886
              ],
              [
                4.807485524940801,
                52.13502158495671
              ],
              [
                4.810158751761132,
                52.138550499078406
              ],
              [
                4.832857874477126,
                52.14476235872125
              ],
              [
                4.834128194636692,
                52.142876491107224
              ],
              [
                4.836704642118558,
                52.142879922427674
              ],
              [
                4.837366434221968,
                52.14064959388378
              ],
              [
                4.840276080943526,
                52.141560746010256
              ],
              [
                4.842871910809118,
                52.13945955403154
              ],
              [
                4.85147861206475,
                52.139674402617096
              ],
              [
                4.855238666869632,
                52.13720961848718
              ],
              [
                4.874518480819276,
                52.13883141526052
              ],
              [
                4.873623464337585,
                52.156082509353354
              ],
              [
                4.892178256131203,
                52.16179792033831
              ],
              [
                4.85558182867335,
                52.17891717529035
              ],
              [
                4.84392085538641,
                52.18012162776817
              ],
              [
                4.823444800306168,
                52.193265698673486
              ],
              [
                4.822209133379393,
                52.196124581886146
              ],
              [
                4.814399874184118,
                52.19930925298202
              ],
              [
                4.813594310150978,
                52.20184711858079
              ],
              [
                4.802925127414552,
                52.20102775709668
              ],
              [
                4.801587807401229,
                52.204321825400896
              ],
              [
                4.802146923109364,
                52.21764063561305
              ],
              [
                4.794429874012146,
                52.2234234002688
              ],
              [
                4.79457569770201,
                52.22673066516718
              ],
              [
                4.789410010194426,
                52.22787510167738
              ],
              [
                4.780888681218972,
                52.22871376506339
              ],
              [
                4.776400158120768,
                52.22737266284005
              ],
              [
                4.774603194497431,
                52.224546685500336
              ],
              [
                4.762074487262452,
                52.21813027116461
              ],
              [
                4.743629882603789,
                52.214792826267036
              ],
              [
                4.734338950846075,
                52.2065164202941
              ],
              [
                4.724296569516667,
                52.21305307322006
              ],
              [
                4.722897061833454,
                52.21982541374828
              ],
              [
                4.724154531319078,
                52.23237133344953
              ],
              [
                4.704875981396675,
                52.23381352394866
              ],
              [
                4.696494089712401,
                52.232216479713905
              ],
              [
                4.685062534836825,
                52.22644500022323
              ],
              [
                4.676699023394604,
                52.22592552023058
              ],
              [
                4.670348087144903,
                52.23075578542268
              ],
              [
                4.665045189530727,
                52.22757378648659
              ],
              [
                4.632937161166441,
                52.216270283353786
              ],
              [
                4.619637822742172,
                52.21457838589633
              ],
              [
                4.601707495767433,
                52.21465105841264
              ],
              [
                4.583553195091425,
                52.218874205889136
              ],
              [
                4.571396254224462,
                52.21695891745456
              ],
              [
                4.556856644176419,
                52.219139973332425
              ],
              [
                4.550470361895746,
                52.22674471595408
              ],
              [
                4.554208113124255,
                52.23139749200255
              ],
              [
                4.562936944210106,
                52.23475818070741
              ],
              [
                4.569520802973868,
                52.25969115600363
              ],
              [
                4.567971962024222,
                52.26807220068202
              ],
              [
                4.588439711362958,
                52.280501598746305
              ],
              [
                4.596048136772638,
                52.291368697928256
              ],
              [
                4.597475800841548,
                52.29667618201312
              ],
              [
                4.611676039331052,
                52.31355991255953
              ],
              [
                4.596541177780647,
                52.3177243869201
              ],
              [
                4.587686422863153,
                52.31788092099921
              ],
              [
                4.587486138315787,
                52.316762137480204
              ],
              [
                4.583272456107076,
                52.318395049787696
              ],
              [
                4.573240558188876,
                52.3153555199667
              ],
              [
                4.5689550634576,
                52.316512563905825
              ],
              [
                4.563707432469432,
                52.30929800806595
              ],
              [
                4.47764943515092,
                52.332510947569055
              ],
              [
                4.420523652246556,
                52.25808459777125
              ],
              [
                4.360001773313135,
                52.19267739561912
              ],
              [
                4.332639617081235,
                52.16843668342222
              ],
              [
                4.286909004725652,
                52.13271463169355
              ],
              [
                4.256907465796692,
                52.11358762103976
              ],
              [
                4.243142798920137,
                52.11062556611984
              ],
              [
                4.237587550534499,
                52.10430469357009
              ],
              [
                4.238716740765263,
                52.09998005706098
              ],
              [
                4.143633541132102,
                52.03176206164324
              ],
              [
                4.119965275668989,
                52.01065503526487
              ],
              [
                4.110164075952056,
                52.00443650358239
              ]
            ]
          ]
        }
      }
    ]
  }
}