{
  "objectName": "Placeholder MetNO specific",
  "scope": "global",
  "keywords": "N,METNorway Specific",
  "geoJSON": {
    "type": "FeatureCollection",
    "features": [
      {
        "type": "Feature",
        "properties": {
          "fill":"#4B18FF",
          "fill-opacity":0.5,
          "stroke":"#4B18FF",
          "stroke-opacity":1.0,
          "stroke-width":2,
          "selectionType": "poly"
        },
        "geometry": {
          "type": "Polygon",
          "coordinates": [
            [
              [
                29.439458045204493,
                69.12027863025403
              ],
              [
                31.457981968892547,
                70.53082524386299
              ],
              [
                26.49350421063274,
                71.10439559846866
              ],
              [
                15.964446987070723,
                69.60099965932234
              ],
              [
                4.67162395454566,
                61.991116394627774
              ],
              [
                7.290249585276107,
                57.985658503616534
              ],
              [
                11.763735037773962,
                58.84283835951129
              ],
              [
                20.76526064340988,
                68.58895061518996
              ],
              [
                29.439458045204493,
                69.12027863025403
              ]
            ]
          ]
        }
      }
    ]
  }
}
