{
  "objectName": "Quark",
  "scope": "global",
  "keywords": "FI,Baltic areas",
  "geoJSON": {
    "type": "FeatureCollection",
    "name": "NIMI_EN_Quark",
    "crs": {
      "type": "name",
      "properties": {
        "name": "urn:ogc:def:crs:OGC:1.3:CRS84"
      }
    },
    "features": [
      {
        "type": "Feature",
        "properties": {
          "LYHENNE": "MK",
          "AREAPRJ": 10747.78917,
          "NIMI2": "Kvarken",
          "NUMERO": 137,
          "LYHENNE2": "B2",
          "NIMI": "Merenkurkku",
          "NIMI_EN": "Quark",
          "fill":"#4B18FF",
          "fill-opacity":0.5,
          "stroke":"#4B18FF",
          "stroke-opacity":1.0,
          "stroke-width":2
        },
        "geometry": {
          "type": "Polygon",
          "coordinates": [
            [
              [
                22.430817891700396,
                63.344655253927499
              ],
              [
                22.311320002662512,
                63.453762022179482
              ],
              [
                21.523806447076236,
                63.78020994906781
              ],
              [
                20.803513891987734,
                64.078792760365175
              ],
              [
                20.768496877753464,
                64.066577522841598
              ],
              [
                20.249362928235463,
                63.885484284637641
              ],
              [
                19.688768348625608,
                63.614852418619094
              ],
              [
                19.669231952689408,
                63.463825287334998
              ],
              [
                20.38234800848721,
                63.146465584666608
              ],
              [
                21.2038680951472,
                62.780862583137143
              ],
              [
                21.33602185949016,
                62.798379782033948
              ],
              [
                21.37055208745517,
                62.802956820563445
              ],
              [
                21.544529715609954,
                62.918941905999965
              ],
              [
                21.628296721758552,
                62.951159985287887
              ],
              [
                21.750725423052657,
                63.028483375578901
              ],
              [
                21.699176496191981,
                63.125137613442668
              ],
              [
                21.879597740204346,
                63.170242924445759
              ],
              [
                22.01491367321362,
                63.086475918297161
              ],
              [
                22.279101923374586,
                63.208904619591266
              ],
              [
                22.39508700881111,
                63.228235467164019
              ],
              [
                22.459523167386955,
                63.318446089170202
              ],
              [
                22.430817891700396,
                63.344655253927499
              ]
            ]
          ]
        }
      }
    ]
  }
}
