{
  "objectName": "IJmuiden",
  "scope": "global",
  "keywords": "NL,Coastal Districts",
  "geoJSON": {
    "type": "FeatureCollection",
    "name": "ijmuiden",
    "crs": {
      "type": "name",
      "properties": {
        "name": "urn:ogc:def:crs:OGC:1.3:CRS84"
      }
    },
    "features": [
      {
        "type": "Feature",
        "properties": {
          "name": "4",
          "fill":"#4B18FF",
          "fill-opacity":0.5,
          "stroke":"#4B18FF",
          "stroke-opacity":1.0,
          "stroke-width":2
        },
        "geometry": {
          "type": "MultiPolygon",
          "coordinates": [
            [
              [
                [
                  4.4332,
                  52.25
                ],
                [
                  3.4747,
                  52.2981
                ],
                [
                  3.8098,
                  52.8043
                ],
                [
                  4.6428,
                  52.767
                ],
                [
                  4.6317,
                  52.6865
                ],
                [
                  4.5931,
                  52.5174
                ],
                [
                  4.5557,
                  52.437
                ],
                [
                  4.4332,
                  52.25
                ]
              ]
            ]
          ]
        }
      }
    ]
  }
}
