{
  "objectName": "Zeeland",
  "scope": "global",
  "keywords": "NL,Provinces",
  "geoJSON": {
    "type": "FeatureCollection",
    "features": [
      {
        "type": "Feature",
        "properties": {
          "fill": "#4B18FF",
          "fill-opacity": 0.5,
          "stroke": "#4B18FF",
          "stroke-opacity": 1,
          "stroke-width": 2,
          "selectionType": "poly"
        },
        "geometry": {
          "type": "Polygon",
          "coordinates": [
            [
              [
                3.485917377559599,
                51.57362856524514
              ],
              [
                3.452581865156763,
                51.616407755115745
              ],
              [
                3.387301085266634,
                51.592518055815354
              ],
              [
                3.307937714121401,
                51.433376219917946
              ],
              [
                3.352555969116961,
                51.37861110424066
              ],
              [
                3.363062215564478,
                51.37288053643891
              ],
              [
                3.374990032178582,
                51.35888718021209
              ],
              [
                3.374070693131936,
                51.34850782164952
              ],
              [
                3.383512995227143,
                51.34120500362131
              ],
              [
                3.385340148357699,
                51.33412485896018
              ],
              [
                3.358378188835704,
                51.31498142153886
              ],
              [
                3.378079453351802,
                51.302650346545185
              ],
              [
                3.366003051811685,
                51.29823261243194
              ],
              [
                3.370287028730017,
                51.29194041906114
              ],
              [
                3.380796229076363,
                51.286961469942334
              ],
              [
                3.381680140709242,
                51.28162350684276
              ],
              [
                3.375929538395313,
                51.27948461714812
              ],
              [
                3.375698182222511,
                51.27721054537767
              ],
              [
                3.379014072528792,
                51.274792577827526
              ],
              [
                3.387979372035479,
                51.273191832266434
              ],
              [
                3.394643003878964,
                51.26531666957377
              ],
              [
                3.403162273691011,
                51.26246316772873
              ],
              [
                3.407402917228022,
                51.25696206028735
              ],
              [
                3.411491162450361,
                51.256903182900544
              ],
              [
                3.416842672782569,
                51.26001008339519
              ],
              [
                3.418011862931873,
                51.257693390071076
              ],
              [
                3.424598656543947,
                51.254207959365765
              ],
              [
                3.427478866637236,
                51.24465693838974
              ],
              [
                3.432313830305597,
                51.245609359776566
              ],
              [
                3.448276481575054,
                51.24149251714225
              ],
              [
                3.527594176570135,
                51.246040156733955
              ],
              [
                3.515414802754304,
                51.28715060062103
              ],
              [
                3.529129762226791,
                51.288743728010566
              ],
              [
                3.533665478913848,
                51.28348877436067
              ],
              [
                3.538107150366948,
                51.28366516983087
              ],
              [
                3.543426645186742,
                51.29119775821124
              ],
              [
                3.55504429128581,
                51.28963533053858
              ],
              [
                3.558056179236724,
                51.29119332371995
              ],
              [
                3.55975921742462,
                51.295454689501035
              ],
              [
                3.562636124199098,
                51.295858463253936
              ],
              [
                3.571941280982731,
                51.291963472160425
              ],
              [
                3.576159447211203,
                51.288007131356096
              ],
              [
                3.579756372263851,
                51.28886438732442
              ],
              [
                3.581812050366054,
                51.28691251154604
              ],
              [
                3.583879517433882,
                51.28888456625397
              ],
              [
                3.583385070847304,
                51.292254235116125
              ],
              [
                3.587927919614982,
                51.29296046268669
              ],
              [
                3.581112842230286,
                51.2983213007859
              ],
              [
                3.590017016507772,
                51.30595226605067
              ],
              [
                3.591781060702879,
                51.30533998514499
              ],
              [
                3.590831945529548,
                51.30441657111244
              ],
              [
                3.614730981594501,
                51.29772659310285
              ],
              [
                3.621227879131454,
                51.292765104518054
              ],
              [
                3.625710053445727,
                51.2933382971594
              ],
              [
                3.640815472153345,
                51.288085855651275
              ],
              [
                3.644406077491256,
                51.29011085053679
              ],
              [
                3.658100251486683,
                51.290188526560115
              ],
              [
                3.676756693768032,
                51.28306462551615
              ],
              [
                3.67791076975245,
                51.28052667846919
              ],
              [
                3.689932380923894,
                51.28060896159601
              ],
              [
                3.693718131255989,
                51.27608071459066
              ],
              [
                3.712701058447146,
                51.27210308383544
              ],
              [
                3.718913473277998,
                51.27153542564963
              ],
              [
                3.723088363355199,
                51.273345337737325
              ],
              [
                3.751725730724733,
                51.269160485614044
              ],
              [
                3.752412550913698,
                51.27026668522229
              ],
              [
                3.755714361013616,
                51.26934414640318
              ],
              [
                3.7625137344519,
                51.261780827005516
              ],
              [
                3.769342132752886,
                51.25984976062025
              ],
              [
                3.773072321623598,
                51.261909283373164
              ],
              [
                3.773783624891375,
                51.26397522371649
              ],
              [
                3.785433763757422,
                51.25846731777953
              ],
              [
                3.795473312015937,
                51.256053333851014
              ],
              [
                3.789451517516516,
                51.24578627875806
              ],
              [
                3.788455287109521,
                51.22637281159303
              ],
              [
                3.789627286580742,
                51.21588118468888
              ],
              [
                3.799291481405529,
                51.21086436944413
              ],
              [
                3.804989738303278,
                51.21012062957048
              ],
              [
                3.80404702027803,
                51.213202318489984
              ],
              [
                3.806027099486752,
                51.21337931354309
              ],
              [
                3.825116372967209,
                51.208930841281415
              ],
              [
                3.836365430636824,
                51.213795720222365
              ],
              [
                3.849642694008952,
                51.21173344591862
              ],
              [
                3.852411358092702,
                51.21321573500494
              ],
              [
                3.859573770218422,
                51.2108306872498
              ],
              [
                3.888548500889161,
                51.22301807982775
              ],
              [
                3.893346464840755,
                51.218662466839
              ],
              [
                3.890243949458011,
                51.213995914601995
              ],
              [
                3.877625583726627,
                51.20801301722703
              ],
              [
                3.884259337226782,
                51.203600878255486
              ],
              [
                3.886349562395283,
                51.20016212162249
              ],
              [
                3.894082045726289,
                51.20343556151107
              ],
              [
                3.89947133658065,
                51.20174225367321
              ],
              [
                3.911546881757431,
                51.20544463944838
              ],
              [
                3.915337450899551,
                51.20816983689857
              ],
              [
                3.918628603069138,
                51.20776348848518
              ],
              [
                3.916004714102181,
                51.21463392887093
              ],
              [
                3.918527160179072,
                51.21483807053786
              ],
              [
                3.919632176171118,
                51.217070760502736
              ],
              [
                3.925449813319931,
                51.21710629187713
              ],
              [
                3.929418487718947,
                51.22026036770098
              ],
              [
                3.935980046949755,
                51.21189276188652
              ],
              [
                3.946639460264056,
                51.21550796037624
              ],
              [
                3.958562369800456,
                51.2158072820184
              ],
              [
                3.963746869135052,
                51.221021211093216
              ],
              [
                3.964291462296484,
                51.22395446180382
              ],
              [
                3.978918694509602,
                51.22536622478073
              ],
              [
                3.986204966739479,
                51.23415952299267
              ],
              [
                3.988435076353908,
                51.23330284043785
              ],
              [
                3.992595977826909,
                51.236416207653136
              ],
              [
                3.999645987218317,
                51.23781098867764
              ],
              [
                4.002844222530329,
                51.24086619266803
              ],
              [
                4.01475078767998,
                51.24506235423536
              ],
              [
                4.020934080691972,
                51.24536555866088
              ],
              [
                4.024490492773265,
                51.24149984596794
              ],
              [
                4.036537324935698,
                51.24567841200921
              ],
              [
                4.040552114718473,
                51.241317617140474
              ],
              [
                4.061848169984398,
                51.24457291226497
              ],
              [
                4.064077375472695,
                51.247492369499305
              ],
              [
                4.070633132218916,
                51.250738613083215
              ],
              [
                4.166131684622427,
                51.292892888103715
              ],
              [
                4.24204892330122,
                51.35396708915695
              ],
              [
                4.22674603867519,
                51.35975863912116
              ],
              [
                4.222066239075285,
                51.36451026730143
              ],
              [
                4.217576809077933,
                51.37388512950323
              ],
              [
                4.277424577929722,
                51.37603524010915
              ],
              [
                4.273697687711448,
                51.383149886457524
              ],
              [
                4.268382049827394,
                51.38354588817438
              ],
              [
                4.26634902206737,
                51.38654063201947
              ],
              [
                4.268633596190051,
                51.38812644950628
              ],
              [
                4.269061035404943,
                51.40034738964124
              ],
              [
                4.263732257132628,
                51.41644910742055
              ],
              [
                4.266446871084578,
                51.419979481724674
              ],
              [
                4.275851638195824,
                51.42504940900946
              ],
              [
                4.218927212580806,
                51.50485845504695
              ],
              [
                4.220101603381253,
                51.51428383809778
              ],
              [
                4.23565704254634,
                51.54324152183045
              ],
              [
                4.235201768063619,
                51.55395264836387
              ],
              [
                4.228121118474729,
                51.563716306685066
              ],
              [
                4.195717966407285,
                51.58897518335541
              ],
              [
                4.191430590113058,
                51.59562834952568
              ],
              [
                4.19016232240678,
                51.600953896546834
              ],
              [
                4.1918932148659,
                51.60983498792147
              ],
              [
                4.199272708336506,
                51.6195386064958
              ],
              [
                4.211944513553637,
                51.626788596352725
              ],
              [
                4.238168239864108,
                51.634297881728116
              ],
              [
                4.242786202359671,
                51.64706300245336
              ],
              [
                4.193764111549876,
                51.66439927396384
              ],
              [
                4.151824517744555,
                51.68523312469486
              ],
              [
                4.123080127461564,
                51.68575409917287
              ],
              [
                4.11002649203032,
                51.68714291038097
              ],
              [
                4.098083805142505,
                51.69047587207376
              ],
              [
                4.047813346447623,
                51.694364407963796
              ],
              [
                4.040036764965286,
                51.7026968035844
              ],
              [
                4.036703941868468,
                51.71102922210162
              ],
              [
                4.035037756891598,
                51.73019358885665
              ],
              [
                4.026258155388194,
                51.73830883889761
              ],
              [
                4.018884952763966,
                51.74271775651072
              ],
              [
                4.013336251592603,
                51.759011840312304
              ],
              [
                3.974491327492621,
                51.76380098692387
              ],
              [
                3.958938003821526,
                51.77213343791173
              ],
              [
                3.940329676967175,
                51.773799947565124
              ],
              [
                3.921443465451218,
                51.770744775705495
              ],
              [
                3.905056993652656,
                51.76463442434868
              ],
              [
                3.886170625148256,
                51.74935849846188
              ],
              [
                3.875894347575464,
                51.74769206834314
              ],
              [
                3.8474281904221,
                51.75340101330751
              ],
              [
                3.826212601617971,
                51.76584104908727
              ],
              [
                3.773675345120725,
                51.78152047827931
              ],
              [
                3.68536389564968,
                51.73363616660552
              ],
              [
                3.570919119346987,
                51.60474165136759
              ],
              [
                3.485917377559599,
                51.57362856524514
              ]
            ]
          ]
        }
      }
    ]
  }
}