{
  "objectName": "Placeholder FMI specific",
  "scope": "global",
  "keywords": "FI,FMI Specific",
  "geoJSON": {
    "type": "FeatureCollection",
    "features": [
      {
        "type": "Feature",
        "properties": {
          "fill":"#4B18FF",
          "fill-opacity":0.5,
          "stroke":"#4B18FF",
          "stroke-opacity":1.0,
          "stroke-width":2,
          "selectionType": "poly"
        },
        "geometry": {
          "type": "Polygon",
          "coordinates": [
            [
              [
                27.80281702599796,
                69.95924311348594
              ],
              [
                21.41991705109249,
                68.98374821564951
              ],
              [
                25.784293102309906,
                65.53143904020449
              ],
              [
                21.201698248531624,
                62.75006401991575
              ],
              [
                21.583581153013142,
                60.52228633215773
              ],
              [
                23.87487857990229,
                60.03544942815248
              ],
              [
                28.784801637521873,
                60.52228633215773
              ],
              [
                31.730755472093637,
                62.75006401991575
              ],
              [
                27.80281702599796,
                69.95924311348594
              ]
            ]
          ]
        }
      }
    ]
  }
}
