{
    "componentType": "Map",
    "id": "RenewalWarnings",
    "scope": "system",
    "keywords": "WMS,Warnings",
    "title": "Renewal warnings convection",
    "initialProps": {
        "mapPreset": {
            "layers": [
                {
                    "service": "https://adaguc-server-geoweb.geoweb.knmi.cloud/adagucserver?dataset=OVL",
                    "name": "provincies",
                    "layerType": "mapLayer",
                    "style": "black/polyline",
                    "enabled": false
                },
                {
                    "service": "https://adaguc-server-geoweb.geoweb.knmi.cloud/adagucserver?dataset=OVL",
                    "name": "nwblightR",
                    "layerType": "mapLayer",
                    "style": "red/polyline"
                },
                {
                    "service": "https://adaguc-server-geoweb.geoweb.knmi.cloud/adagucserver?dataset=cell-tracking",
                    "name": "boundaries",
                    "layerType": "mapLayer",
                    "enabled": true,
                    "id": "renewal-warning-rader"
                },
                {
                    "service": "https://adaguc-server-geoweb.geoweb.knmi.cloud/adagucserver?dataset=cell-tracking",
                    "name": "inner_parts",
                    "layerType": "mapLayer",
                    "enabled": false,
                    "style": "polygon_innerparts_coloured/shaded",
                    "opacity": 0.4
                },
                {
                    "service": "https://adaguc-server-geoweb.geoweb.knmi.cloud/adagucserver?dataset=cell-tracking",
                    "name": "inner_parts",
                    "layerType": "mapLayer",
                    "enabled": true,
                    "style": "polygon_innerparts_neutral/shaded",
                    "opacity": 0.4
                },
                {
                    "service": "https://adaguc-server-geoweb.geoweb.knmi.cloud/adagucserver?dataset=cell-tracking",
                    "name": "MESH",
                    "layerType": "mapLayer",
                    "enabled": false
                },
                {
                    "service": "https://adaguc-server-geoweb.geoweb.knmi.cloud/adagucserver?dataset=cell-tracking",
                    "name": "Zmax",
                    "layerType": "mapLayer",
                    "enabled": true,
                    "style": "nearest"
                },
                {
                    "service": "https://adaguc-server-geoweb.geoweb.knmi.cloud/adagucserver?dataset=cell-tracking",
                    "name": "ZmaxTrack",
                    "layerType": "mapLayer",
                    "enabled": false
                }
            ],
            "proj": {
                "srs": "EPSG:3857",
                "bbox": {
                    "left": -450651.2255879827,
                    "bottom": 6393842.957153378,
                    "right": 1428345.8183648037,
                    "top": 7342085.640241
                }
            },
            "activeLayerId": "renewal-warning-rader",
            "shouldAutoUpdate": true
        }
    }
}
